{"text_format":"1","workbook":"xlsx","n_sheets":9,"sheets":["Introduction","Data_entry","Summary","Saved_data","SCORES_Maint_Impr","SCORES_Other","EVC_data","Dropdown_menus","Version"],"not_rendered":{"charts":0,"images":4,"macros":1,"external_links":0,"defined_names":180,"comments":1,"pivot_tables":0},"unopened":[],"bounds":{"document_bytes":16777216,"sheet_cells":100000,"rows_first":2000,"rows_last":500,"rows_between":2000,"halvings":0,"cell_chars":16384,"cell_head_chars":4096},"cells_cut":0,"cells_raw":0,"read":"whole","date_system":"1900"}

{"sheet":"Introduction","index":0,"n_rows":17,"n_cols":3,"rows_kept":17,"cut":false,"hidden":false,"merged":[]}
["Gain calculator"]
["Version 2.6"]
[]
[]
[null,null,"Introduction\nThe Gain calculator can be used to determine the gain score for native vegetation proposed to be managed and protected. To understand more about the method used to predict gain refer to Native vegetation gain scoring manual, Version 2.\n\nThe Gain calculator is designed and developed by the Department of Environment, Land, Water and Planning (DELWP), Victoria for use on Microsoft Excel 2007 or subsequent versions. Use of earlier Excel versions may result in reduced functionality under some circumstances. For troubleshooting and feedback, please contact nativevegetation.offsetmanagement@delwp.vic.gov.au."]
[]
[null,null,"You need to enable macros for the Gain calculator to work.\nYou cannot use the Gain calculator until macros are enabled. If you click the button below and nothing happens, you probably need to enable macros.  See instructions below."]
[]
[]
[]
[]
[]
[]
[]
[]
[null,null,"How to enable macros\n    - Excel 2007 - Click the ‘Office’ button > ‘Excel Options’ > ‘Trust Center’ > ‘Trust Center Settings’ > ‘Macro Settings’ \n    - Excel 2010 and 2013 - Click ‘File’ > ‘Options’ > ‘Trust Center’ > ‘Trust Center Settings’ > ‘Macro Settings’ \n\nIn 'Macro settings', choose one of the following options:\n    - Disable all macros with notification - Macros are disabled, but security alerts appear if there are macros present. Enable macros on a case-by-case basis.\n    - Enable all macros (not recommended, potentially dangerous code can run) - All macros run. This setting makes your computer vulnerable to potentially malicious code."]
[null,null,"Disclaimer\nThis publication may be of assistance to you but the State of Victoria and its employees do not guarantee that the publication is without flaw of any kind or is wholly appropriate for your particular purposes and therefore disclaims all liability for any error, loss or other consequence which may arise from you relying on any information in this publication."]

{"sheet":"Data_entry","index":1,"n_rows":64,"n_cols":22,"rows_kept":64,"cut":false,"hidden":true,"merged":[]}
["Gain calculator"]
["Version 2.6","About DELWP Gain Calculator"]
[]
[]
[]
["Property","Property address / location",null,{"$f":"IF(C6<>\"\",\"FYI\",\"\")","v":""},null,null,null,null,null,null,null,null,null,null,null,null,"Habitat",false,"Max.",{"$f":"IF(Data_entry!R6,\"Default scores\",\"Habitat score\")","v":"Habitat score"},"Maintenance gain","Improvement gain"]
["details","Unique project ID",null,null,null,null,null,null,null,null,null,null,null,null,null,null,"score","Large trees",{"$f":"IF(AND(_zonetype=\"Patch\",OR(_standardiser=1.15,_standardiser=1.25,_standardiser=1.36)),\"N/A\",10)","v":10},null,{"$f":"\nIF(OR(_landtenure=\"Crown land - conservation primary purpose\",_landtenure=\"Crown land - multiple and other purposes\",_zonetype=\"Large scattered tree\",_zonetype=\"Medium scattered tree\"),\"\",\nIF(OR(_zonetype=\"Revegetation\",_securityproposed=\"Transfer to Crown (non-funded)\"),\"N/A\",\nIF(_vegtype=\"Woody\",gain_maint_W_LT,\nIF(OR(_vegtype=\"High rain. VVP/GiP grassland\",_vegtype=\"Other grassland\",_vegtype=\"Non-woody wetland\"),\"N/A\",\n\"\"))))","v":""},{"$f":"\nIF(OR(_landtenure=\"Crown land - conservation primary purpose\",_landtenure=\"Crown land - multiple and other purposes\",_zonetype=\"Large scattered tree\",_zonetype=\"Medium scattered tree\",),\"\",\nIF(OR(_zonetype=\"Revegetation\"),\"N/A\",\nIF(OR(_vegtype=\"Woody\",_vegtype=\"High rain. VVP/GiP grassland\",_vegtype=\"Other grassland\",_vegtype=\"Non-woody wetland\",_securityproposed=\"Transfer to Crown (non-funded)\"),\"N/A\",\n\"\")))","v":""}]
[null,"Property size (ha)",null,{"$f":"IF(_propertysize=\"< 10 ha\",\"FYI\",\"\")","v":""},null,null,null,null,null,null,null,null,null,null,null,null,null,"Tree canopy cover",{"$f":"IF(AND(_zonetype=\"Patch\",_standardiser=1.36),\"N/A\",5)","v":5},null,{"$f":"\nIF(OR(_landtenure=\"Crown land - conservation primary purpose\",_landtenure=\"Crown land - multiple and other purposes\",_zonetype=\"Large scattered tree\",_zonetype=\"Medium scattered tree\"),\"\",\nIF(OR(_propertysize=\"< 10 ha\",_zonetype=\"Revegetation\",_MgmtRestrTree,_securityproposed=\"Transfer to Crown (non-funded)\"),\"N/A\",\nIF(_vegtype=\"Woody\",gain_maint_W_CC,\nIF(OR(_vegtype=\"High rain. VVP/GiP grassland\",_vegtype=\"Other grassland\",_vegtype=\"Non-woody wetland\"),\"N/A\",\n\"\"))))","v":""},{"$f":"\nIF(OR(_landtenure=\"Crown land - conservation primary purpose\",_landtenure=\"Crown land - multiple and other purposes\",_zonetype=\"Large scattered tree\",_zonetype=\"Medium scattered tree\"),\"\",\nIF(_securityproposed=\"Transfer to Crown (non-funded)\",\"N/A\",\nIF(_zonetype=\"Revegetation\",gain_impr_Reveg_CC,\nIF(_vegtype=\"Woody\",gain_impr_W_CC,\nIF(OR(_vegtype=\"High rain. VVP/GiP grassland\",_vegtype=\"Other grassland\",_vegtype=\"Non-woody wetland\",_securityproposed=\"Transfer to Crown (non-funded)\"),\"N/A\",\n\"\")))))","v":""}]
[null,"Total extent of native vegetation on the property (ha)",null,null,null,null,null,null,null,null,null,null,null,null,null,null,null,"Understorey",25,null,{"$f":"\nIF(OR(_landtenure=\"Crown land - conservation primary purpose\",_landtenure=\"Crown land - multiple and other purposes\",_zonetype=\"Large scattered tree\",_zonetype=\"Medium scattered tree\"),\"\",\nIF(OR(_zonetype=\"Revegetation\",_MgmtRestrStock,_MgmtRestrFuel,_securityproposed=\"Transfer to Crown (non-funded)\"),\"N/A\",\nIF(_vegtype=\"Woody\",gain_maint_W_US,\nIF(_vegtype=\"High rain. VVP/GiP grassland\",gain_maint_HR_US,\nIF(_vegtype=\"Other grassland\",gain_maint_G_US,\nIF(_vegtype=\"Non-woody wetland\",gain_maint_We_US,\n\"\"))))))","v":""},{"$f":"\nIF(OR(_landtenure=\"Crown land - conservation primary purpose\",_landtenure=\"Crown land - multiple and other purposes\",_zonetype=\"Large scattered tree\",_zonetype=\"Medium scattered tree\"),\"\",\nIF(OR(_zonetype=\"Revegetation\",_MgmtRestrFuel,_securityproposed=\"Transfer to Crown (non-funded)\"),\"N/A\",\nIF(_vegtype=\"Woody\",gain_impr_W_US,\nIF(_vegtype=\"High rain. VVP/GiP grassland\",gain_impr_HR_US,\nIF(_vegtype=\"Other grassland\",gain_impr_G_US,\nIF(_vegtype=\"Non-woody wetland\",gain_impr_We_US,\n\"\"))))))","v":""}]
[null,"Proposal type","Offset",null,null,null,null,null,null,null,null,null,null,null,null,null,null,"Lack of weeds",15,null,{"$f":"\nIF(OR(_landtenure=\"Crown land - conservation primary purpose\",_landtenure=\"Crown land - multiple and other purposes\",_zonetype=\"Large scattered tree\",_zonetype=\"Medium scattered tree\"),\"\",\n\"N/A\")","v":"N/A"},{"$f":"\nIF(OR(_landtenure=\"Crown land - conservation primary purpose\",_landtenure=\"Crown land - multiple and other purposes\",_zonetype=\"Large scattered tree\",_zonetype=\"Medium scattered tree\"),\"\",\nIF(OR(_zonetype=\"Revegetation\",_securityproposed=\"Transfer to Crown (non-funded)\"),\"N/A\",\nIF(_vegtype=\"Woody\",gain_impr_W_LW,\nIF(_vegtype=\"High rain. VVP/GiP grassland\",gain_impr_HR_LW,\nIF(_vegtype=\"Other grassland\",gain_impr_G_LW,\nIF(_vegtype=\"Non-woody wetland\",gain_impr_We_LW,\n\"\"))))))","v":""}]
[null,"Current land tenure","Freehold land",null,null,null,null,null,null,null,null,null,null,null,null,null,null,"Recruitment",10,null,{"$f":"\nIF(OR(_landtenure=\"Crown land - conservation primary purpose\",_landtenure=\"Crown land - multiple and other purposes\",_zonetype=\"Large scattered tree\",_zonetype=\"Medium scattered tree\"),\"\",\nIF(OR(_zonetype=\"Revegetation\",_MgmtRestrStock,_MgmtRestrFuel,_securityproposed=\"Transfer to Crown (non-funded)\"),\"N/A\",\nIF(_vegtype=\"Woody\",gain_maint_W_R,\nIF(_vegtype=\"High rain. VVP/GiP grassland\",gain_maint_HR_R,\nIF(_vegtype=\"Other grassland\",gain_maint_G_R,\nIF(_vegtype=\"Non-woody wetland\",gain_maint_We_R,\n\"\"))))))","v":""},{"$f":"\nIF(OR(_landtenure=\"Crown land - conservation primary purpose\",_landtenure=\"Crown land - multiple and other purposes\",_zonetype=\"Large scattered tree\",_zonetype=\"Medium scattered tree\"),\"\",\nIF(OR(_zonetype=\"Revegetation\",_MgmtRestrFuel,_securityproposed=\"Transfer to Crown (non-funded)\"),\"N/A\",\nIF(_vegtype=\"Woody\",gain_impr_W_R,\nIF(_vegtype=\"High rain. VVP/GiP grassland\",gain_impr_HR_R,\nIF(_vegtype=\"Other grassland\",gain_impr_G_R,\nIF(_vegtype=\"Non-woody wetland\",gain_impr_We_R,\n\"\"))))))","v":""}]
[null,"Current security arrangements",null,{"$f":"IF(_securitycurrent=\"On-title agreement (req. of funding)\",\"ATTENTION\",\"\")","v":""},{"$f":"\nIF(_landtenure=\"Crown land - conservation primary purpose\",\"Security_crown_current\",\nIF(_landtenure=\"Crown land - multiple and other purposes\",\"Security_crown_current\",\nIF(_landtenure=\"Freehold land\",\"Security_freehold_current\",\n\"\")))","v":"Security_freehold_current"},null,null,null,null,null,null,null,null,null,null,null,null,"Organic litter",5,null,{"$f":"\nIF(OR(_landtenure=\"Crown land - conservation primary purpose\",_landtenure=\"Crown land - multiple and other purposes\",_zonetype=\"Large scattered tree\",_zonetype=\"Medium scattered tree\"),\"\",\nIF(OR(_zonetype=\"Revegetation\",_MgmtRestrDead,_MgmtRestrFuel,_securityproposed=\"Transfer to Crown (non-funded)\"),\"N/A\",\nIF(_vegtype=\"Woody\",gain_maint_W_OL,\nIF(_vegtype=\"High rain. VVP/GiP grassland\",gain_maint_HR_OL,\nIF(_vegtype=\"Other grassland\",gain_maint_G_OL,\nIF(_vegtype=\"Non-woody wetland\",gain_maint_We_OL,\n\"\"))))))","v":""},{"$f":"\nIF(OR(_landtenure=\"Crown land - conservation primary purpose\",_landtenure=\"Crown land - multiple and other purposes\",_zonetype=\"Large scattered tree\",_zonetype=\"Medium scattered tree\"),\"\",\nIF(OR(_zonetype=\"Revegetation\",_MgmtRestrFuel,_securityproposed=\"Transfer to Crown (non-funded)\"),\"N/A\",\nIF(_vegtype=\"Woody\",gain_impr_W_OL,\nIF(_vegtype=\"High rain. VVP/GiP grassland\",gain_impr_HR_OL,\nIF(_vegtype=\"Other grassland\",gain_impr_G_OL,\nIF(_vegtype=\"Non-woody wetland\",gain_impr_We_OL,\n\"\"))))))","v":""}]
[null,"Proposed security arrangements",null,{"$f":"\nIF(_securityproposed=\"None\",\"ATTENTION\",\nIF(AND(_securitycurrent=\"On-title agreement (req. of funding)\",_securityproposed=\"On-title agreement\"),\"ATTENTION\",\n\"\"))","v":""},{"$f":"\nIF(_landtenure=\"Crown land - conservation primary purpose\",\"Security_crown_conservation\",\nIF(_landtenure=\"Crown land - multiple and other purposes\",\"Security_crown_multiple\",\nIF(_landtenure=\"Freehold land\",\"Security_freehold_proposed\",\n\"\")))","v":"Security_freehold_proposed"},null,null,null,null,null,null,null,null,null,null,null,null,"Logs",{"$f":"IF(AND(_zonetype=\"Patch\",OR(_standardiser=1.36,_standardiser=1.25)),\"N/A\",5)","v":5},null,{"$f":"\nIF(OR(_landtenure=\"Crown land - conservation primary purpose\",_landtenure=\"Crown land - multiple and other purposes\",_zonetype=\"Large scattered tree\",_zonetype=\"Medium scattered tree\"),\"\",\nIF(OR(_MgmtRestrDead,_MgmtRestrFuel,_securityproposed=\"Transfer to Crown (non-funded)\"),\"N/A\",\nIF(_zonetype=\"Revegetation\",gain_maint_Reveg_L,\nIF(_vegtype=\"Woody\",gain_maint_W_L,\nIF(OR(_vegtype=\"High rain. VVP/GiP grassland\",_vegtype=\"Other grassland\",_vegtype=\"Non-woody wetland\"),\"N/A\",\n\"\")))))","v":""},{"$f":"\nIF(OR(_landtenure=\"Crown land - conservation primary purpose\",_landtenure=\"Crown land - multiple and other purposes\",_zonetype=\"Large scattered tree\",_zonetype=\"Medium scattered tree\"),\"\",\nIF(OR(_MgmtRestrFuel,,_securityproposed=\"Transfer to Crown (non-funded)\"),\"N/A\",\nIF(_zonetype=\"Revegetation\",gain_impr_Reveg_L,\nIF(_vegtype=\"Woody\",gain_impr_W_L,\nIF(OR(_vegtype=\"High rain. VVP/GiP grassland\",_vegtype=\"Other grassland\",_vegtype=\"Non-woody wetland\"),\"N/A\",\n\"\")))))","v":""}]
[null,null,{"$f":"COUNTBLANK(C6:C13)","v":6},null,null,null,null,null,null,null,null,null,null,null,null,null,null,"Site condition (standardised)",75,{"$f":"\nIF(def_UseDefault,ROUND(SUM(T7:T13)*def_standardiser,4),\nIF(_zonetype=\"Large scattered tree\",SUM(T7:T13),\nIF(_zonetype=\"Medium scattered tree\",SUM(T7:T13),\nROUND(SUM(T7:T13)*C21,4))))","v":0}]
["Zone","Site number",null,null,null,null,null,null,null,null,null,null,null,null,null,null,null,"Landscape context",25,null,null,{"$f":"\nIF(OR(_landtenure=\"Crown land - conservation primary purpose\",_landtenure=\"Crown land - multiple and other purposes\",_zonetype=\"Large scattered tree\",_zonetype=\"Medium scattered tree\"),\"\",\nIF(_zonetype=\"Revegetation\",gain_impr_Reveg_LC,\n\"\"))","v":""}]
["information","Zone ID",null,{"$f":"\nIF(C16=\"\",\"\",\nIF(COUNTIF(Saved_data!C1:VOD1,Saved_data!B1)>0,\"Existing zone ID\",\n\"\"))","v":""},null,null,null,null,null,null,null,null,null,null,null,null,null,"Habitat score",100,{"$f":"ROUND(SUM(T14:T15),4)","v":0}]
[null,"Zone type",null,null,null,null,null,null,null,null,null,null,null,null,null,null,null,null,null,{"$f":"\nIF(AND(_proposaltype=\"Offset\",_zonetype=\"Patch\",T14>0,T14<30),\"ATTENTION\",\nIF(AND(_proposaltype=\"Offset\",_zonetype=\"Patch\",_standardiser=1.36,sc_lackweed=\"\"),\"\",\nIF(AND(_proposaltype=\"Offset\",_zonetype=\"Patch\",_standardiser=1.36,sc_lackweed<7),\"ATTENTION\",\n\"\")))","v":""},{"$f":"\nIF(_securityproposed=\"Transfer to Crown (non-funded)\",\"N/A\",\nIF(AND(OR(_landtenure=\"Crown land - conservation primary purpose\",_landtenure=\"Crown land - multiple and other purposes\"),OR(_zonetype=\"Large scattered tree\",_zonetype=\"Medium scattered tree\")),gain_maint_Crown_ST,\nIF(AND(OR(_landtenure=\"Crown land - conservation primary purpose\",_landtenure=\"Crown land - multiple and other purposes\"),_zonetype=\"Patch\"),gain_maint_Crown_patch,\nIF(AND(OR(_landtenure=\"Crown land - conservation primary purpose\",_landtenure=\"Crown land - multiple and other purposes\"),_zonetype=\"Revegetation\"),gain_maint_Crown_reveg,\nIF(AND(_zonetype=\"Large scattered tree\",_MgmtRestrTree),gain_maint_LST-3,\nIF(AND(_zonetype=\"Medium scattered tree\",_MgmtRestrTree),gain_maint_MST-3,\nIF(_zonetype=\"Large scattered tree\",gain_maint_LST,\nIF(_zonetype=\"Medium scattered tree\",gain_maint_MST,\nSUM(U7:U13)))))))))","v":0},{"$f":"\nIF(OR(_zonetype=\"Large scattered tree\",_zonetype=\"Medium scattered tree\",_securityproposed=\"Transfer to Crown (non-funded)\"),\"N/A\",\nIF(AND(OR(_landtenure=\"Crown land - conservation primary purpose\",_landtenure=\"Crown land - multiple and other purposes\"),_zonetype=\"Patch\"),gain_impr_Crown_patch,\nIF(AND(OR(_landtenure=\"Crown land - conservation primary purpose\",_landtenure=\"Crown land - multiple and other purposes\"),_zonetype=\"Revegetation\"),gain_impr_Crown_reveg,\nSUM(V7:V13,V15))))","v":0}]
[null,"Size of zone (ha)",null,null,null,null,null,null,null,null,null,null,null,null,null,null,"Gain score"]
[null,"Bioregion",null,null,{"$f":"IFERROR((VLOOKUP(C19,EVC_data_table,2,FALSE)),\"\")","v":""},null,null,null,null,null,null,null,null,null,null,null,null,"Maintenance gain (standardised)",null,{"$f":"\nIF(U17=\"N/A\",U17,\nIF(_landtenure<>\"Freehold land\",U17,\nROUND(U17*C21,4)))","v":0},{"$f":"IF(_securityproposed=\"Transfer to Crown (non-funded)\",\"FYI\",\"\")","v":""}]
[null,"EVC name",null,"Click to manually enter:",null,null,null,null,null,null,null,null,null,null,null,null,null,"Improvement gain (standardised)",null,{"$f":"\nIF(V17=\"N/A\",V17,\nIF(_landtenure<>\"Freehold land\",V17,\nROUND(V17*C21,4)))","v":0}]
[null,"EVC standardiser",{"$f":"IFERROR(INDEX(EVC_data_table,Match_row,5),1)","v":1},false,"Match row:",{"$f":"MATCH(CONCATENATE(_bioregion,_EVC),EVC_data!J1:J1301,0)","v":{"$error":"#N/A"}},null,null,null,null,null,null,null,null,null,null,null,"Prior management gain",null,{"$f":"ROUND(T16*gain_priormgmt,4)","v":0}]
[null,"Bioregional EVC code / conservation status",{"$f":"CONCATENATE(IFERROR(INDEX(EVC_data_table,Match_row,4),1),\" / \",IFERROR(INDEX(EVC_data_table,Match_row,6),1))","v":"1 / 1"},false,null,null,null,null,null,null,null,null,null,null,null,null,null,"Security gain",null,{"$f":"\nIF(_zonetype=\"Revegetation\",ROUND(SUM(T19,T20)*gain_security,4),\nROUND(T16*gain_security,4))","v":0}]
[null,"Vegetation type (as per gain scoring manual)",{"$f":"IFERROR(INDEX(EVC_data_table,Match_row,9),1)","v":1},{"$f":"IF(AND(_zonetype=\"Revegetation\",_vegtype<>\"Woody\"),\"ATTENTION\",\"\")","v":""},null,null,null,null,null,null,null,null,null,null,null,null,null,"GAIN SCORE (out of 100)",null,{"$f":"ROUND(SUM(T19:T22),4)","v":0}]
[null,"Length of existing logs as proportion of benchmark",null,null,null,null,null,null,null,null,null,null,null,null,null,null,null,"Gain score divided by 100 ",null,{"$f":"ROUND(T23/100,4)","v":0}]
[null,"Length of logs to be introduced as proportion of benchmark",null,null,null,null,null,null,null,null,null,null,null,null,null,null,null,"Habitat hectares (Hha) of gain",null,{"$f":"ROUND((T23/100)*C18,4)","v":0}]
[null,"Are there any current land management restrictions (e.g. due to an overlay)?",{"$f":"\nIF(AND(_MgmtRestrStock,_MgmtRestrTree,_MgmtRestrDead,_MgmtRestrFuel),\"Restriction 1, 2, 3, 4\",\nIF(AND(_MgmtRestrStock,_MgmtRestrTree,_MgmtRestrDead),\"Restriction 1, 2, 3\",\nIF(AND(_MgmtRestrStock,_MgmtRestrTree,_MgmtRestrFuel),\"Restriction 1, 2, 4\",\nIF(AND(_MgmtRestrStock,_MgmtRestrDead,_MgmtRestrFuel),\"Restriction 1, 3, 4\",\nIF(AND(_MgmtRestrTree,_MgmtRestrDead,_MgmtRestrFuel),\"Restriction 2, 3, 4\",\nIF(AND(_MgmtRestrStock,_MgmtRestrTree),\"Restriction 1, 2\",\nIF(AND(_MgmtRestrStock,_MgmtRestrDead),\"Restriction 1, 3\",\nIF(AND(_MgmtRestrStock,_MgmtRestrFuel),\"Restriction 1, 4\",\nIF(AND(_MgmtRestrTree,_MgmtRestrDead),\"Restriction  2, 3\",\nIF(AND(_MgmtRestrTree,_MgmtRestrFuel),\"Restriction  2, 4\",\nIF(AND(_MgmtRestrDead,_MgmtRestrFuel),\"Restriction 3, 4\",\nIF(_MgmtRestrStock,\"Restriction 1\",\nIF(_MgmtRestrTree,\"Restriction 2\",\nIF(_MgmtRestrDead,\"Restriction 3\",\nIF(_MgmtRestrFuel,\"Restriction 4\",\n\"None\")))))))))))))))","v":"None"}]
[1,"1. Not permitted to graze with domestic stock",false,{"$f":"IF(C27,\"FYI\",\"\")","v":""}]
[2,"2. Not permitted to remove trees",false,{"$f":"IF(C28,\"FYI\",\"\")","v":""},null,null,null,null,null,null,null,null,null,null,null,null,"Number of large trees in zone"]
[3,"3. Not permitted to remove dead vegetation",false,{"$f":"IF(C29,\"FYI\",\"\")","v":""},null,null,null,null,null,null,null,null,null,null,null,null,"This information does not contribute to gain scoring. However the data is required for an offset site."]
[4,"4. Requirement for regular fuel reduction",false,{"$f":"IF(C30,\"FYI\",\"\")","v":""}]
[null,"Type of overlay(s) e.g. ESO, BMO, etc.",null,null,null,{"$f":"CONCATENATE(_landtenure,_zonetype,_vegtype)","v":"Freehold land1"},"If this cell changes, the below management action list will re-filter"]
["Management commitments ",null,null,null,"Display mgmt actions for:",{"$f":"\nIF(_zonetype=\"Revegetation\",\"Reveg\",\nIF(_zonetype=\"Large scattered tree\",\"ST\",\nIF(_zonetype=\"Medium scattered tree\",\"ST\",\nIF(_vegtype=\"Woody\",\"Woody\",\nIF(_vegtype=\"High rain. VVP/GiP grassland\",\"HRGrass\",\nIF(_vegtype=\"Other grassland\",\"OGrass\",\nIF(_vegtype=\"Non-woody wetland\",\"Wet\",\n\"\")))))))","v":""},"PINK shading = additional measures for Crown land. Only appear when Crown land is selected."]
[null,"To generate gain the land manager must commit to all of the following:",{"$f":"IF(AND(_zonetype=\"Patch\",_EVC=\"\"),\"Enter Bioregion and EVC to display management actions\",\"\")","v":""},null,"Hide/display rows","Woody","HR grassland","Other grassland","Wetland","Revegetation","Scattered tree","Named ranges for mgmt actions:"]
[null,"Retain all standing trees (dead or alive)",null,null,{"$f":"\nIF(filter_mgmtactions=\"\",\"Hide\",\nIF(COUNTIF(F34:M34,filter_mgmtactions)>0,\"Display\",\n\"Hide\"))","v":"Hide"},"Woody",null,null,null,"Reveg","ST",{"$f":"IF(C34=\"Yes\",TRUE,FALSE)","v":false}]
[null,"Exclude stock",null,null,"Hide","Woody",null,null,"Wet","Reveg","ST",{"$f":"IF(C35=\"Yes\",TRUE,FALSE)","v":false}]
[null,"Ensure weed cover does not increase above current level",null,null,"Hide","Woody","HRGrass",null,"Wet","Reveg","ST",false]
[null,"Ensure perennial weed cover does not increase above current level",null,null,{"$f":"\nIF(filter_mgmtactions=\"\",\"Hide\",\nIF(COUNTIF(F37:M37,filter_mgmtactions)>0,\"Display\",\n\"Hide\"))","v":"Hide"},null,null,"OGrass",null,null,null,false]
[null,"Monitor for new high threat weeds & eliminate to < 1% cover",null,null,"Hide","Woody","HRGrass","OGrass","Wet","Reveg","ST",false]
[{"$f":"IF(E40 = \"Display\",\"Either A or B:\",\"\")","v":""},{"$f":"IF(E40=\"Hide\",\"Exclude stock and ensure annual weed cover does not increase\",\"A. Exclude stock and ensure annual weed cover does not increase\")","v":"Exclude stock and ensure annual weed cover does not increase"},null,{"$f":"IF(AND(mgmt_weed_crntlvl_annual,mgmt_weed_monitorannual),\"Choose either A or B\",\"\")","v":""},{"$f":"\nIF(filter_mgmtactions=\"\",\"Hide\",\nIF(COUNTIF(F39:M39,filter_mgmtactions)>0,\"Display\",\n\"Hide\"))","v":"Hide"},null,null,"OGrass",null,null,null,false]
[null,{"$f":"IF(E39=\"Hide\",\"Exclude stock and monitor annual weeds. If cover ≥ 25%, control by strategic grazing\",\"B. Exclude stock and monitor annual weeds. If cover ≥ 25%, control by strategic grazing\")","v":"Exclude stock and monitor annual weeds. If cover ≥ 25%, control by strategic grazing"},null,null,{"$f":"\nIF(filter_mgmtactions=\"\",\"Hide\",\nIF(COUNTIF(F40:M40,filter_mgmtactions)>0,\"Display\",\n\"Hide\"))","v":"Hide"},null,null,"OGrass",null,null,null,false]
[{"$f":"IF(E42 = \"Display\",\"Either A or B:\",\"\")","v":""},{"$f":"IF(E42=\"Hide\",\"Undertake biomass management with agreed schedule\",\"A. Undertake biomass management with agreed schedule\")","v":"Undertake biomass management with agreed schedule"},null,{"$f":"IF(AND(E42=\"Display\",mgmt_biomass_timing,mgmt_biomass),\"Choose either A or B\",\"\")","v":""},{"$f":"\nIF(filter_mgmtactions=\"\",\"Hide\",\nIF(COUNTIF(F41:M41,filter_mgmtactions)>0,\"Display\",\n\"Hide\"))","v":"Hide"},null,"HRGrass",null,null,null,null,false]
[null,{"$f":"IF(E41=\"Hide\",\"Undertake biomass management with no schedule\",\"B. Undertake biomass management with no schedule\")","v":"Undertake biomass management with no schedule"},null,null,{"$f":"\nIF(filter_mgmtactions=\"\",\"Hide\",\nIF(COUNTIF(F42:M42,filter_mgmtactions)>0,\"Display\",\n\"Hide\"))","v":"Hide"},null,"HRGrass",null,null,null,null,false]
[null,"Retain leaf litter",null,null,"Hide","Woody",null,null,"Wet",null,"ST",false]
[null,"Retain logs & fallen timber",null,null,"Hide","Woody",null,null,null,"Reveg","ST",false]
[null,"Recruit at least five new canopy plants for each tree protected",null,null,{"$f":"\nIF(filter_mgmtactions=\"\",\"Hide\",\nIF(COUNTIF(F45:M45,filter_mgmtactions)>0,\"Display\",\n\"Hide\"))","v":"Hide"},null,null,null,null,null,"ST",false]
[null,"Restrict public access & prevent lopping or pruning",null,null,{"$f":"\nIF(filter_mgmtactions=\"\",\"Hide\",\nIF(COUNTIF(F46:M46,filter_mgmtactions)>0,\"Display\",\n\"Hide\"))","v":"Hide"},{"$f":"IF(AND(_landtenure<>\"Freehold land\",_vegtype=\"Woody\"),\"Woody\",\"\")","v":""},{"$f":"IF(AND(_landtenure<>\"Freehold land\",_vegtype=\"High rain. VVP/GiP grassland\"),\"HRGrass\",\"\")","v":""},{"$f":"IF(AND(_landtenure<>\"Freehold land\",_vegtype=\"Other grassland\"),\"OGrass\",\"\")","v":""},{"$f":"IF(AND(_landtenure<>\"Freehold land\",_vegtype=\"Non-woody wetland\"),\"Wet\",\"\")","v":""},{"$f":"IF(AND(_landtenure<>\"Freehold land\",_zonetype=\"Revegetation\"),\"Reveg\",\"\")","v":""},{"$f":"IF(AND(_landtenure<>\"Freehold land\",OR(_zonetype=\"Large scattered tree\",_zonetype=\"Medium scattered tree\")),\"ST\",\"\")","v":""},false]
[null,{"$f":"IF(_zonetype<>\"Patch\",\"\",\"To generate additional gain the land manager can agree to:\")","v":""},null,null,{"$f":"IF(B47=\"\",\"Hide\",\"Display\")","v":"Hide"}]
[null,"Control rabbits",null,null,{"$f":"\nIF(filter_mgmtactions=\"\",\"Hide\",\nIF(COUNTIF(F48:M48,filter_mgmtactions)>0,\"Display\",\n\"Hide\"))","v":"Hide"},"Woody","HRGrass","OGrass","Wet","Reveg","ST",false]
[null,"Control ALL high threats ",null,null,{"$f":"\nIF(filter_mgmtactions=\"\",\"Hide\",\nIF(COUNTIF(F49:M49,filter_mgmtactions)>0,\"Display\",\n\"Hide\"))","v":"Hide"},"Woody","HRGrass","OGrass","Wet","Reveg",null,false]
[{"$f":"IF(E51 = \"Display\",\"Either A or B:\",\"\")","v":""},{"$f":"IF(E51=\"Hide\",\"Eliminate woody & high threat herb. & grassy weeds to < 1% cover\",\"A. Eliminate woody & high threat herb. & grassy weeds to < 1% cover\")","v":"Eliminate woody & high threat herb. & grassy weeds to < 1% cover"},null,{"$f":"\nIF(AND(mgmt_weedwoodyherb,mgmt_weedwoody),\"Choose either A or B\",\nIF(AND(sc_lackweed<9,mgmt_weedwoodyherb),\"ATTENTION\",\n\"\"))","v":""},{"$f":"\nIF(filter_mgmtactions=\"\",\"Hide\",\nIF(COUNTIF(F50:M50,filter_mgmtactions)>0,\"Display\",\n\"Hide\"))","v":"Hide"},"Woody","HRGrass","OGrass","Wet",null,null,false]
[null,{"$f":"IF(E50=\"Hide\",\"Eliminate woody weeds to < 1% cover \",\"B. Eliminate woody weeds to < 1% cover \")","v":"Eliminate woody weeds to < 1% cover "},null,null,{"$f":"\nIF(filter_mgmtactions=\"\",\"Hide\",\nIF(COUNTIF(F51:M51,filter_mgmtactions)>0,\"Display\",\n\"Hide\"))","v":"Hide"},"Woody","HRGrass","OGrass","Wet","Reveg",null,false]
[null,"Introduce logs from a DELWP approved source",null,{"$f":"IF(AND(mgmt_log_intro,sc_underst>=10),\"ATTENTION\",\"\")","v":""},"Hide","Woody",{"$f":"IF(AND(_landtenure<>\"Freehold land\",_vegtype=\"High rain. VVP/GiP grassland\"),\"HRGrass\",\"\")","v":""},{"$f":"IF(AND(_landtenure<>\"Freehold land\",_vegtype=\"Other grassland\"),\"OGrass\",\"\")","v":""},{"$f":"IF(AND(_landtenure<>\"Freehold land\",_vegtype=\"Non-woody wetland\"),\"Wet\",\"\")","v":""},"Reveg",null,false]
[null,"Introduce hollows, rocks or other missing features",null,null,{"$f":"\nIF(filter_mgmtactions=\"\",\"Hide\",\nIF(COUNTIF(F53:M53,filter_mgmtactions)>0,\"Display\",\n\"Hide\"))","v":"Hide"},{"$f":"IF(AND(_landtenure<>\"Freehold land\",_vegtype=\"Woody\"),\"Woody\",\"\")","v":""},{"$f":"IF(AND(_landtenure<>\"Freehold land\",_vegtype=\"High rain. VVP/GiP grassland\"),\"HRGrass\",\"\")","v":""},{"$f":"IF(AND(_landtenure<>\"Freehold land\",_vegtype=\"Other grassland\"),\"OGrass\",\"\")","v":""},{"$f":"IF(AND(_landtenure<>\"Freehold land\",_vegtype=\"Non-woody wetland\"),\"Wet\",\"\")","v":""},{"$f":"IF(AND(_landtenure<>\"Freehold land\",_zonetype=\"Revegetation\"),\"Reveg\",\"\")","v":""},null,false]
[null,"Revegetation meets the minimum size requirements",null,null,{"$f":"\nIF(filter_mgmtactions=\"\",\"Hide\",\nIF(COUNTIF(F54:M54,filter_mgmtactions)>0,\"Display\",\n\"Hide\"))","v":"Hide"},null,null,null,null,"Reveg",null,false]
[null,"Undertake reveg. / suppl. planting to minimum standard",null,null,"Hide","Woody",{"$f":"IF(AND(_landtenure<>\"Freehold land\",_vegtype=\"High rain. VVP/GiP grassland\"),\"HRGrass\",\"\")","v":""},{"$f":"IF(AND(_landtenure<>\"Freehold land\",_vegtype=\"Other grassland\"),\"OGrass\",\"\")","v":""},"Wet","Reveg",null,false]
[null,"Undertake reveg. / suppl. planting to a higher standard",null,null,"Hide",null,null,null,null,"Reveg",null,false]
[null,"Restore ecological processes - ecological burning or flooding",null,null,"Hide",{"$f":"IF(AND(_landtenure<>\"Freehold land\",_vegtype=\"Woody\"),\"Woody\",\"\")","v":""},{"$f":"IF(AND(_landtenure<>\"Freehold land\",_vegtype=\"High rain. VVP/GiP grassland\"),\"HRGrass\",\"\")","v":""},{"$f":"IF(AND(_landtenure<>\"Freehold land\",_vegtype=\"Other grassland\"),\"OGrass\",\"\")","v":""},{"$f":"IF(AND(_landtenure<>\"Freehold land\",_vegtype=\"Non-woody wetland\"),\"Wet\",\"\")","v":""},null,null,false]
[null,null,null,null,{"$f":"COUNTIF(E34:E46,\"Display\")","v":0}]
[null,null,{"$f":"COUNTIF(L34:L57,TRUE)","v":0}]
["User details","User name"]
[null,"Organisation"]
[null,"Contact phone"]
[null,"Contact email"]
[" "]

{"sheet":"Summary","index":2,"n_rows":66,"n_cols":15,"rows_kept":66,"cut":false,"hidden":true,"merged":[[7,1,7,3],[8,1,8,3],[9,1,9,3],[10,1,10,3],[39,1,39,3],[12,1,12,3],[33,1,33,3],[34,1,34,3],[35,1,35,3],[36,1,36,3],[37,1,37,3],[42,1,42,3],[43,1,43,3],[44,1,44,3],[11,1,11,3],[13,1,13,3],[14,1,14,3],[15,1,15,3],[16,1,16,3],[40,1,40,3],[38,1,38,3],[17,1,17,3],[18,1,18,3],[19,1,19,3],[20,1,20,3],[21,1,21,3],[56,1,56,3],[45,1,45,3],[46,1,46,3],[47,1,47,3],[54,1,54,3],[55,1,55,3],[53,1,53,3],[51,1,51,3],[52,1,52,3],[48,1,48,3],[49,1,49,3],[50,1,50,3],[65,1,65,3],[57,1,57,3],[58,1,58,3],[59,1,59,3],[60,1,60,3],[61,1,61,3],[62,1,62,3],[63,1,63,3],[64,1,64,3]]}
["Summary of gain scoring"]
["Version 2.6",null,null,null,"Property address / location",null,null,null,null,null,null,null,null,null,"User name"]
[null,null,null,null,"Unique project ID",null,null,null,null,null,null,null,null,null,"Organisation"]
["Last saved:",null,null,null,"Proposal type",null,null,null,null,null,null,null,null,null,"Contact phone"]
[{"$f":"lastsaved()","v":"2019-06-19T13:31:35"},null,null,null,"Current land tenure",null,null,null,null,null,null,null,null,null,"Contact email"]
[]
[".",".",".","."]
["Site number / Zone ID"]
["Zone type"]
["Size of zone (ha)"]
["Bioregion"]
["EVC name"]
["EVC standardiser"]
["BioEVC code / conservation status"]
["Vegetation type"]
["Property size (ha)"]
["Total native veg. on property (ha)"]
["Current security"]
["Proposed security"]
["Current land management restrictions"]
["Type of overlay"]
[]
["Habitat scoring"]
["Large trees"]
["Tree canopy cover"]
["Understorey"]
["Lack of weeds"]
["Recruitment"]
["Organic litter"]
["Logs"]
["Site condition (/75)"]
["Landscape context (/25)"]
["Habitat score (/100)"]
["Maintenance gain (standardised)"]
["Improvement gain (standardised)"]
["Prior management gain"]
["Security gain"]
["Gain score (out of 100)"]
["Gain score divided by 100"]
["Habitat hectares of gain"]
["Number of large trees in zone"]
[]
["Management actions"]
["Retain all standing trees (dead or alive)"]
["Exclude stock"]
["Ensure weed cover does not increase above current level"]
["Ensure perennial weed cover does not increase above current level"]
["Monitor for new high threat weeds & eliminate to < 1% cover"]
["Exclude stock and ensure annual weed cover does not increase"]
["Exclude stock and monitor annual weeds. If cover ≥ 25%, control by strategic grazing"]
["Undertake biomass management with agreed schedule"]
["Undertake biomass management with no schedule"]
["Retain leaf litter"]
["Retain logs & fallen timber"]
["Recruit at least five new canopy plants for each tree protected"]
["Restrict public access & prevent lopping or pruning"]
["Control rabbits"]
["Control ALL high threats "]
["A. Eliminate woody & high threat herb. & grassy weeds to < 1% cover"]
["B. Eliminate woody weeds to < 1% cover "]
["Introduce logs from a DELWP approved source"]
["Introduce hollows, rocks or other missing features"]
["Revegetation meets the minimum size requirements"]
["Undertake reveg. / suppl. planting to minimum standard"]
["Undertake reveg. / suppl. planting to a higher standard"]
["Restore ecological processes - ecological burning or flooding"]

{"sheet":"Saved_data","index":3,"n_rows":98,"n_cols":2,"rows_kept":98,"cut":false,"hidden":true,"merged":[]}
["Data fields",{"$f":"SiteNo_ZoneID","v":"0 / 0"}]
["Property address / location",{"$f":"Data_entry!C6","v":0}]
["Unique project ID",{"$f":"Data_entry!C7","v":0}]
["Property size (ha)",{"$f":"Data_entry!C8","v":0}]
["Total native veg. on property (ha)",{"$f":"Data_entry!C9","v":0}]
["Proposal type",{"$f":"Data_entry!C10","v":"Offset"}]
["Current land tenure",{"$f":"Data_entry!C11","v":"Freehold land"}]
["Current security",{"$f":"Data_entry!C12","v":0}]
["Proposed security",{"$f":"Data_entry!C13","v":0}]
["User details:"]
["User name",{"$f":"Data_entry!C60","v":0}]
["Organisation",{"$f":"Data_entry!C61","v":0}]
["Contact phone",{"$f":"Data_entry!C62","v":0}]
["Contact email",{"$f":"Data_entry!C63","v":0}]
["Habitat zone information:"]
["Site number",{"$f":"Data_entry!C15","v":0}]
["Zone ID",{"$f":"Data_entry!C16","v":0}]
["Site number / Zone ID",{"$f":"IF(B16=\"\",B17,CONCATENATE(B16,\" / \",B17))","v":"0 / 0"}]
["Zone type",{"$f":"Data_entry!C17","v":0}]
["Size of habitat zone (ha)",{"$f":"Data_entry!C18","v":0}]
["Bioregion",{"$f":"Data_entry!C19","v":0}]
["EVC name",{"$f":"Data_entry!C20","v":0}]
["Standardiser manually entered",{"$f":"_manualstndsr","v":false}]
["EVC standardiser",{"$f":"Data_entry!C21","v":1}]
["Bio EVC code / conservation status",{"$f":"Data_entry!C22","v":"1 / 1"}]
["Veg. type manually entered",{"$f":"_manualvegtype","v":false}]
["Vegetation type (as per gain scoring manual)",{"$f":"Data_entry!C23","v":1}]
["Length of logs as proportion of benchmark",{"$f":"Data_entry!C24","v":0}]
["Large logs present?",{"$f":"Data_entry!C25","v":0}]
["Select current land management restrictions:",{"$f":"Data_entry!C26","v":"None"}]
["Not permitted to graze with domestic stock",{"$f":"Data_entry!C27","v":false}]
["Not permitted to remove trees or dead vegetation",{"$f":"Data_entry!C28","v":false}]
["Not permitted to remove fallen timber",{"$f":"Data_entry!C29","v":false}]
["Requirement for regular fuel reduction",{"$f":"Data_entry!C30","v":false}]
["Proposed management actions:"]
["Retain all standing trees (dead or alive)",{"$f":"IF(Data_entry!C34=\"\",\"\",Data_entry!C34)","v":""}]
["Exclude stock",{"$f":"IF(Data_entry!C35=\"\",\"\",Data_entry!C35)","v":""}]
["Ensure weed cover does not increase above current level",{"$f":"IF(Data_entry!C36=\"\",\"\",Data_entry!C36)","v":""}]
["Ensure perennial weed cover does not increase above current level",{"$f":"IF(Data_entry!C37=\"\",\"\",Data_entry!C37)","v":""}]
["Monitor for new high threat weeds & eliminate to < 1% cover",{"$f":"IF(Data_entry!C38=\"\",\"\",Data_entry!C38)","v":""}]
["Exclude stock and ensure annual weed cover does not increase",{"$f":"IF(Data_entry!C39=\"\",\"\",Data_entry!C39)","v":""}]
["Exclude stock and monitor annual weeds. If cover ≥ 25%, control by strategic grazing",{"$f":"IF(Data_entry!C40=\"\",\"\",Data_entry!C40)","v":""}]
["Undertake biomass management with agreed schedule",{"$f":"IF(Data_entry!C41=\"\",\"\",Data_entry!C41)","v":""}]
["Undertake biomass management with no schedule",{"$f":"IF(Data_entry!C42=\"\",\"\",Data_entry!C42)","v":""}]
["Retain leaf litter",{"$f":"IF(Data_entry!C43=\"\",\"\",Data_entry!C43)","v":""}]
["Retain logs & fallen timber",{"$f":"IF(Data_entry!C44=\"\",\"\",Data_entry!C44)","v":""}]
["Recruit at least five new canopy plants for each tree protected",{"$f":"IF(Data_entry!C45=\"\",\"\",Data_entry!C45)","v":""}]
["Restrict public access & prevent lopping or pruning",{"$f":"IF(Data_entry!C46=\"\",\"\",Data_entry!C46)","v":""}]
["Control rabbits",{"$f":"IF(Data_entry!C48=\"\",\"\",Data_entry!C48)","v":""}]
["Control ALL high threats ",{"$f":"IF(Data_entry!C49=\"\",\"\",Data_entry!C49)","v":""}]
["Eliminate woody & high threat herb. & grassy weeds to < 1% cover",{"$f":"IF(Data_entry!C50=\"\",\"\",Data_entry!C50)","v":""}]
["Eliminate woody weeds to < 1% cover ",{"$f":"IF(Data_entry!C51=\"\",\"\",Data_entry!C51)","v":""}]
["Introduce logs from a DELWP approved source",{"$f":"IF(Data_entry!C52=\"\",\"\",Data_entry!C52)","v":""}]
["Introduce hollows, rocks or other missing features",{"$f":"IF(Data_entry!C53=\"\",\"\",Data_entry!C53)","v":""}]
["Revegetation meets the minimum size requirements",{"$f":"IF(Data_entry!C54=\"\",\"\",Data_entry!C54)","v":""}]
["Undertake reveg. / suppl. planting to minimum standard",{"$f":"IF(Data_entry!C55=\"\",\"\",Data_entry!C55)","v":""}]
["Undertake reveg. / suppl. planting to a higher standard",{"$f":"IF(Data_entry!C56=\"\",\"\",Data_entry!C56)","v":""}]
["Restore ecological processes - ecological burning or flooding",{"$f":"IF(Data_entry!C57=\"\",\"\",Data_entry!C57)","v":""}]
["Use default condition scores",{"$f":"def_UseDefault","v":false}]
["Habitat score:",{"$f":"Data_entry!T6","v":"Habitat score"}]
["Large trees",{"$f":"Data_entry!T7","v":0}]
["Tree canopy cover",{"$f":"Data_entry!T8","v":0}]
["Understorey",{"$f":"Data_entry!T9","v":0}]
["Lack of weeds",{"$f":"Data_entry!T10","v":0}]
["Recruitment",{"$f":"Data_entry!T11","v":0}]
["Organic litter",{"$f":"Data_entry!T12","v":0}]
["Logs",{"$f":"Data_entry!T13","v":0}]
["Site condition (standardised)",{"$f":"Data_entry!T14","v":0}]
["Landscape context",{"$f":"Data_entry!T15","v":0}]
["Habitat score",{"$f":"Data_entry!T16","v":0}]
["Maintenance gain:","Maint. gain"]
["Large trees",{"$f":"Data_entry!U7","v":""}]
["Tree canopy cover",{"$f":"Data_entry!U8","v":""}]
["Understorey",{"$f":"Data_entry!U9","v":""}]
["Lack of weeds",{"$f":"Data_entry!U10","v":"N/A"}]
["Recruitment",{"$f":"Data_entry!U11","v":""}]
["Organic litter",{"$f":"Data_entry!U12","v":""}]
["Logs",{"$f":"Data_entry!U13","v":""}]
["Site eligibiility",{"$f":"alert_eligibilityscore","v":""}]
["Improvement gain:","Impr. gain"]
["Large trees",{"$f":"Data_entry!V7","v":""}]
["Tree canopy cover",{"$f":"Data_entry!V8","v":""}]
["Understorey",{"$f":"Data_entry!V9","v":""}]
["Lack of weeds",{"$f":"Data_entry!V10","v":""}]
["Recruitment",{"$f":"Data_entry!V11","v":""}]
["Organic litter",{"$f":"Data_entry!V12","v":""}]
["Logs",{"$f":"Data_entry!V13","v":""}]
["Landscape context",{"$f":"Data_entry!V15","v":""}]
["Total scores:"]
["Maintenance gain (standardised)",{"$f":"Data_entry!T19","v":0}]
["Improvement gain (standardised)",{"$f":"Data_entry!T20","v":0}]
["Prior management gain",{"$f":"Data_entry!T21","v":0}]
["Security gain",{"$f":"Data_entry!T22","v":0}]
["GAIN SCORE (out of 100)",{"$f":"Data_entry!T23","v":0}]
["Gain score divided by 100",{"$f":"Data_entry!T24","v":0}]
["Habitat hectares of gain",{"$f":"Data_entry!T25","v":0}]
["Number of large trees in zone",{"$f":"_largetreesinzone","v":0}]
["Type of overlay",{"$f":"Data_entry!C31","v":0}]

{"sheet":"SCORES_Maint_Impr","index":4,"n_rows":98,"n_cols":75,"rows_kept":98,"cut":false,"hidden":true,"merged":[[27,66,27,67],[28,66,28,67],[28,68,29,68],[29,66,29,67],[6,71,6,72],[27,71,27,72],[28,71,28,72],[29,71,29,72],[28,73,29,73],[5,71,5,72],[17,66,17,67],[6,66,6,67],[18,66,18,67],[5,66,5,67],[7,66,7,67],[6,68,7,68],[18,68,19,68],[19,66,19,67],[8,71,9,71],[54,21,55,21],[33,17,34,17],[35,11,36,11],[35,17,38,17],[35,18,36,18],[37,11,38,11],[37,18,38,18],[59,19,60,19],[80,11,81,11],[71,18,72,18],[73,16,74,16],[74,11,75,11],[76,11,77,11],[78,11,79,11],[63,11,64,11],[65,11,66,11],[71,12,72,12],[71,13,72,13],[71,17,72,17],[61,19,62,19],[39,11,40,11],[45,17,46,17],[45,18,46,18],[48,16,49,16],[88,0,92,0],[93,0,97,0],[86,5,86,6],[86,7,87,7],[88,5,89,5],[56,5,59,5],[57,6,59,6],[71,0,72,0],[61,11,62,11],[57,11,58,11],[59,11,60,11],[45,6,46,6],[45,7,46,7],[48,5,49,5],[54,1,55,1],[54,5,54,7],[54,9,55,9],[54,19,55,20],[86,0,86,1],[86,2,87,2],[54,8,55,8],[54,12,55,12],[54,13,55,13],[54,16,54,18],[56,16,62,16],[57,17,62,17],[57,18,58,18],[59,18,62,18],[17,6,18,6],[17,7,18,7],[28,13,29,13],[28,16,28,17],[28,18,29,19],[28,20,29,20],[30,16,32,16],[31,17,32,17],[31,18,32,18],[28,12,29,12],[31,11,32,11],[28,24,29,24],[28,25,29,25],[28,28,28,29],[28,30,29,31],[28,32,29,32],[28,1,29,1],[35,5,37,5],[36,6,37,6],[30,5,34,5],[28,5,28,6],[28,7,29,7],[28,8,29,8],[31,6,34,6],[33,16,38,16],[33,11,34,11],[39,23,40,23],[45,29,46,29],[45,30,46,30],[48,28,49,28],[54,24,55,24],[54,25,55,25],[54,28,54,30],[30,28,32,28],[31,23,32,23],[31,29,32,29],[31,30,32,30],[33,23,34,23],[33,28,38,28],[33,29,34,29],[35,23,36,23],[35,29,38,29],[35,30,36,30],[37,23,38,23],[37,30,38,30],[54,32,55,32],[57,23,58,23],[59,23,60,23],[61,23,62,23],[54,31,55,31],[80,23,81,23],[71,30,72,30],[73,28,74,28],[74,23,75,23],[76,23,77,23],[78,23,79,23],[63,23,64,23],[65,23,66,23],[71,24,72,24],[71,25,72,25],[71,29,72,29],[5,1,5,3],[6,1,6,3],[17,1,17,3],[18,1,18,3],[71,41,72,41],[71,36,72,36],[54,44,55,44],[45,41,46,41],[45,42,46,42],[48,40,49,40],[54,36,55,36],[54,40,54,42],[28,36,29,36],[28,40,28,41],[28,42,29,42],[28,43,29,43],[30,40,34,40],[35,40,37,40],[31,41,34,41],[36,41,37,41],[56,40,59,40],[57,41,59,41],[58,42,59,42],[54,43,55,43]]}
["WOODY VEGETATION",null,null,null,null,null,null,null,null,null,null,"HIGH RAINFALL VOLCANIC PLAINS OR GIPPSLAND PLAINS GRASSLAND VEGETATION",null,null,null,null,null,null,null,null,null,null,null,"OTHER GRASSLAND VEGETATION",null,null,null,null,null,null,null,null,null,null,null,"NON-WOODY WETLAND VEGETATION",null,null,null,null,null,null,null,null,null,null,null,"REVEGETATION",null,null,null,null,null,null,null,null,null,null,"SCATTERED TREE",null,null,null,null,null,null,null,"CROWN LAND"]
["MAINTENANCE GAIN",null,null,null,null,"IMPROVEMENT GAIN",null,null,null,null,null,"MAINTENANCE GAIN",null,null,null,null,"IMPROVEMENT GAIN",null,null,null,null,null,null,"MAINTENANCE GAIN",null,null,null,null,"IMPROVEMENT GAIN",null,null,null,null,null,null,"MAINTENANCE GAIN",null,null,null,null,"IMPROVEMENT GAIN",null,null,null,null,null,null,"MAINTENANCE GAIN",null,null,null,null,"IMPROVEMENT GAIN",null,null,null,null,null,"MAINTENANCE GAIN",null,null,null,null,"IMPROVEMENT GAIN",null,null,"MAINTENANCE GAIN",null,null,null,null,"IMPROVEMENT GAIN"]
[]
["LARGE TREES","Maintenance gain =",{"$f":"\nIF(AND(_NVonproperty=\"< 5 ha\",mgmt_retainTrees,sc_largetree=0),B9,\nIF(AND(_NVonproperty=\"< 5 ha\",mgmt_retainTrees,sc_largetree=1),B10,\nIF(AND(_NVonproperty=\"< 5 ha\",mgmt_retainTrees,sc_largetree=2),B11,\nIF(AND(_NVonproperty=\"< 5 ha\",mgmt_retainTrees,sc_largetree=3),B12,\nIF(AND(_NVonproperty=\"< 5 ha\",mgmt_retainTrees,sc_largetree<=6),B13,\nIF(AND(_NVonproperty=\"< 5 ha\",mgmt_retainTrees,sc_largetree<=10),B14,\nIF(AND(_NVonproperty=\"5 to < 20 ha\",mgmt_retainTrees,sc_largetree=0),C9,\nIF(AND(_NVonproperty=\"5 to < 20 ha\",mgmt_retainTrees,sc_largetree=1),C10,\nIF(AND(_NVonproperty=\"5 to < 20 ha\",mgmt_retainTrees,sc_largetree=2),C11,\nIF(AND(_NVonproperty=\"5 to < 20 ha\",mgmt_retainTrees,sc_largetree=3),C12,\nIF(AND(_NVonproperty=\"5 to < 20 ha\",mgmt_retainTrees,sc_largetree<=6),C13,\nIF(AND(_NVonproperty=\"5 to < 20 ha\",mgmt_retainTrees,sc_largetree<=10),C14,\nIF(AND(_NVonproperty=\"≥ 20 ha\",mgmt_retainTrees,sc_largetree=0),D9,\nIF(AND(_NVonproperty=\"≥ 20 ha\",mgmt_retainTrees,sc_largetree=1),D10,\nIF(AND(_NVonproperty=\"≥ 20 ha\",mgmt_retainTrees,sc_largetree=2),D11,\nIF(AND(_NVonproperty=\"≥ 20 ha\",mgmt_retainTrees,sc_largetree=3),D12,\nIF(AND(_NVonproperty=\"≥ 20 ha\",mgmt_retainTrees,sc_largetree<=6),D13,\nIF(AND(_NVonproperty=\"≥ 20 ha\",mgmt_retainTrees,sc_largetree<=10),D14,\n0))))))))))))))))))","v":0},null,null,"Improvement gain =","N/A",null,null,null,null,"LARGE TREES","Maintenance gain =","N/A",null,null,"Improvement gain =","N/A",null,null,null,null,null,"LARGE TREES","Maintenance gain =","N/A",null,null,"Improvement gain =","N/A",null,null,null,null,null,"LARGE TREES","Maintenance gain =","N/A",null,null,"Improvement gain =","N/A",null,null,null,null,null,"LARGE TREES","Maintenance gain =","N/A",null,null,"Improvement gain =","N/A",null,null,null,null,"LARGE SCATTERED TREE",null,"Maintenance gain =",{"$f":"IF(AND(mgmt_retainTrees,mgmt_recruit5,mgmt_weed_crntlvl,mgmt_weed_1pct,mgmt_log_retain,mgmt_litter,mgmt_stock,mgmt_rabbits),BJ6,0)","v":0},null,"Improvement gain =","N/A",null,"PATCH","Maintenance gain =",{"$f":"\nIF(AND(_vegtype=\"Woody\",mgmt_weed_crntlvl,mgmt_weed_1pct,mgmt_stock,mgmt_retainTrees,mgmt_log_retain,mgmt_litter,mgmt_restrictaccess),BQ7,\nIF(AND(_vegtype=\"High rain. VVP/GiP grassland\",mgmt_weed_crntlvl,mgmt_weed_1pct,OR(mgmt_biomass,mgmt_biomass_timing),mgmt_restrictaccess),BQ7,\nIF(AND(_vegtype=\"Other grassland\",mgmt_weed_crntlvl_perennial,mgmt_weed_1pct,OR(mgmt_weed_crntlvl_annual,mgmt_weed_monitorannual),mgmt_restrictaccess),BQ7,\nIF(AND(_vegtype=\"Non-woody wetland\",mgmt_weed_crntlvl,mgmt_weed_1pct,mgmt_stock,mgmt_litter,mgmt_restrictaccess),BQ7,\n0))))","v":0},null,null,"Improvement gain =",{"$f":"\nIF(AND(_vegtype=\"Woody\",gain_maint_Crown_patch>0,mgmt_rabbits,mgmt_threats_all,OR(mgmt_weedwoody,mgmt_weedwoodyherb)),SUM(BW7:BW11),\nIF(AND(_vegtype=\"High rain. VVP/GiP grassland\",gain_maint_Crown_patch>0,mgmt_rabbits,mgmt_threats_all,OR(mgmt_weedwoody,mgmt_weedwoodyherb)),SUM(BW7:BW11),\nIF(AND(_vegtype=\"Other grassland\",gain_maint_Crown_patch>0,mgmt_rabbits,mgmt_threats_all,OR(mgmt_weedwoody,mgmt_weedwoodyherb)),SUM(BW7:BW11),\nIF(AND(_vegtype=\"Non-woody wetland\",gain_maint_Crown_patch>0,mgmt_rabbits,mgmt_threats_all,OR(mgmt_weedwoody,mgmt_weedwoodyherb)),SUM(BW7:BW11),\n0))))","v":0}]
[]
["Condition score","Maintenance gain / ha",null,null,null,"No improvement gain for large trees",null,null,null,null,null,"Not applicable",null,null,null,null,"Not applicable",null,null,null,null,null,null,"Not applicable",null,null,null,null,"Not applicable",null,null,null,null,null,null,"Not applicable",null,null,null,null,"Not applicable",null,null,null,null,null,null,"Not applicable",null,null,null,null,"Not applicable",null,null,null,null,null,"Standard maintenance gain score = ",null,null,13.6,null,"Not applicable",null,null,"Requirements / Additional actions",null,"Gain score / ha (/100)",null,null,"Requirements / Additional actions",null,"Gain score / ha (/100)"]
["Large trees","Total hectares of native vegetation on the property",null,null,null,null,null,null,null,null,null,null,null,null,null,null,null,null,null,null,null,null,null,null,null,null,null,null,null,null,null,null,null,null,null,null,null,null,null,null,null,null,null,null,null,null,null,null,null,null,null,null,null,null,null,null,null,null,null,null,null,null,null,null,null,null,"Meet all of the minimum commitments relating to the relevant vegetation type",null,2,null,null,"All maintenance gain commitments.\nAll improvement gain commitments for relevant veg type.\nControl all high threats.",null,15,{"$f":"IF(mgmt_threats_all,BV7,0)","v":0}]
[null,"< 5ha","5 < 20ha","≥ 20ha",null,null,null,null,null,null,null,null,null,null,null,null,null,null,null,null,null,null,null,null,null,null,null,null,null,null,null,null,null,null,null,null,null,null,null,null,null,null,null,null,null,null,null,null,null,null,null,null,null,null,null,null,null,null,null,null,null,null,null,null,null,null,"Restrict public access to the land and prevent lopping or pruning of native vegetation.",null,null,null,null,"Supplementary planting",null,1,{"$f":"IF(mgmt_reveg,BV8,0)","v":0}]
[0,0,0,0,null,null,null,null,null,null,null,null,null,null,null,null,null,null,null,null,null,null,null,null,null,null,null,null,null,null,null,null,null,null,null,null,null,null,null,null,null,null,null,null,null,null,null,null,null,null,null,null,null,null,null,null,null,null,null,null,null,null,null,null,null,null,null,null,null,null,null,"Introduce missing or depauperate habitat features","Logs",2,{"$f":"IF(mgmt_log_intro,BV9,0)","v":0}]
[1,1,0.5,0.25,null,null,null,null,null,null,null,null,null,null,null,null,null,null,null,null,null,null,null,null,null,null,null,null,null,null,null,null,null,null,null,null,null,null,null,null,null,null,null,null,null,null,null,null,null,null,null,null,null,null,null,null,null,null,null,null,null,null,null,null,null,null,null,null,null,null,null,null,"Other - e.g. hollows, rocks.",5,{"$f":"IF(mgmt_missingrocks,BV10,0)","v":0}]
[2,2,1,0.5,null,null,null,null,null,null,null,null,null,null,null,null,null,null,null,null,null,null,null,null,null,null,null,null,null,null,null,null,null,null,null,null,null,null,null,null,null,null,null,null,null,null,null,null,null,null,null,null,null,null,null,null,null,null,null,null,null,null,null,null,null,null,null,null,null,null,null,"Restoring ecological processes ",null,10,{"$f":"IF(mgmt_ecoburnflood,BV11,0)","v":0}]
[3,3,1.5,0.75]
["4-6",2.5,1.25,0.63]
["7-10",2,1,0.5]
[]
["TREE CANOPY COVER","Maintenance gain =",{"$f":"\nIF(AND(_NVonproperty=\"< 5 ha\",mgmt_retainTrees,sc_canopy=1),B21,\nIF(AND(_NVonproperty=\"< 5 ha\",mgmt_retainTrees,sc_canopy=2),B22,\nIF(AND(_NVonproperty=\"< 5 ha\",mgmt_retainTrees,sc_canopy=3),B23,\nIF(AND(_NVonproperty=\"< 5 ha\",mgmt_retainTrees,sc_canopy=4),B24,\nIF(AND(_NVonproperty=\"< 5 ha\",mgmt_retainTrees,sc_canopy=5),B25,\nIF(AND(_NVonproperty=\"5 to < 20 ha\",mgmt_retainTrees,sc_canopy=1),C21,\nIF(AND(_NVonproperty=\"5 to < 20 ha\",mgmt_retainTrees,sc_canopy=2),C22,\nIF(AND(_NVonproperty=\"5 to < 20 ha\",mgmt_retainTrees,sc_canopy=3),C23,\nIF(AND(_NVonproperty=\"5 to < 20 ha\",mgmt_retainTrees,sc_canopy=4),C24,\nIF(AND(_NVonproperty=\"5 to < 20 ha\",mgmt_retainTrees,sc_canopy=5),C25,\nIF(AND(_NVonproperty=\"≥ 20 ha\",mgmt_retainTrees,sc_canopy=1),D21,\nIF(AND(_NVonproperty=\"≥ 20 ha\",mgmt_retainTrees,sc_canopy=2),D22,\nIF(AND(_NVonproperty=\"≥ 20 ha\",mgmt_retainTrees,sc_canopy=3),D23,\nIF(AND(_NVonproperty=\"≥ 20 ha\",mgmt_retainTrees,sc_canopy=4),D24,\nIF(AND(_NVonproperty=\"≥ 20 ha\",mgmt_retainTrees,sc_canopy=5),D25,\n0)))))))))))))))","v":0},null,null,"Improvement gain =",{"$f":"\nIF(AND(mgmt_retainTrees,mgmt_stock,mgmt_rabbits,mgmt_threats_all,mgmt_reveg,sc_canopy=0),H20,\nIF(AND(mgmt_retainTrees,mgmt_stock,mgmt_rabbits,mgmt_threats_all,sc_canopy>=1,sc_canopy<=3),H21,\nIF(AND(mgmt_retainTrees,mgmt_stock,mgmt_rabbits,mgmt_threats_all,sc_canopy>=4,sc_canopy<=5),H22,\n0)))","v":0},null,null,null,null,"TREE CANOPY COVER","Maintenance gain =","N/A",null,null,"Improvement gain =","N/A",null,null,null,null,null,"TREE CANOPY COVER","Maintenance gain =","N/A",null,null,"Improvement gain =","N/A",null,null,null,null,null,"TREE CANOPY COVER","Maintenance gain =","N/A",null,null,"Improvement gain =","N/A",null,null,null,null,null,"TREE CANOPY COVER","Maintenance gain =","N/A",null,null,"Improvement gain =",{"$f":"\nIF(AND(mgmt_retainTrees,mgmt_stock,mgmt_weed_crntlvl,mgmt_weed_1pct,mgmt_log_retain,mgmt_rabbits,mgmt_threats_all,mgmt_weedwoody,mgmt_reveghigher),BB20,\nIF(AND(mgmt_retainTrees,mgmt_stock,mgmt_weed_crntlvl,mgmt_weed_1pct,mgmt_log_retain,mgmt_rabbits,mgmt_threats_all,mgmt_weedwoody,mgmt_reveg),BB19,\n0))","v":0},null,null,null,null,"MEDIUM SCATTERED TREE",null,"Maintenance gain =",{"$f":"IF(AND(mgmt_retainTrees,mgmt_recruit5,mgmt_weed_crntlvl,mgmt_weed_1pct,mgmt_log_retain,mgmt_litter,mgmt_stock,mgmt_rabbits),BJ18,0)","v":0},null,"Improvement gain =","N/A",null,"SCATTERED TREE","Maintenance gain =",{"$f":"IF(AND(gain_maint_LST>0,mgmt_restrictaccess),BQ19,0)","v":0},null,null,"Improvement gain =","N/A"]
[]
["Condition score","Maintenance gain / ha",null,null,null,"Condition score","Additional commitment","Improvement gain / ha ",null,null,null,"Not applicable",null,null,null,null,"Not applicable",null,null,null,null,null,null,"Not applicable",null,null,null,null,"Not applicable",null,null,null,null,null,null,"Not applicable",null,null,null,null,"Not applicable",null,null,null,null,null,null,"Not applicable",null,null,null,null,"Additional commitments","Improvement gain / ha",null,null,null,null,"Standard maintenance gain score",null,null,5.6,null,"Not applicable",null,null,"Requirements / Additional actions",null,"Gain score / ha (/100)",null,null,"Not applicable"]
[" Tree canopy cover","Total hectares of native vegetation on the property",null,null,null,"Tree canopy cover",null,null,null,null,null,null,null,null,null,null,null,null,null,null,null,null,null,null,null,null,null,null,null,null,null,null,null,null,null,null,null,null,null,null,null,null,null,null,null,null,null,null,null,null,null,null,"A and B",7,null,null,null,null,null,null,null,null,null,null,null,null,"Meet all of the minimum commitments relating to the relevant vegetation type",null,2]
[null,"< 5ha","5 < 20ha","≥ 20ha",null,0,"A",0.6,null,null,null,null,null,null,null,null,null,null,null,null,null,null,null,null,null,null,null,null,null,null,null,null,null,null,null,null,null,null,null,null,null,null,null,null,null,null,null,null,null,null,null,null,"A and C",10,null,null,null,null,null,null,null,null,null,null,null,null,"Restrict public access to the land and prevent lopping or pruning of native vegetation."]
[1,0.2,0.1,0.05,null,"1-3","None",0.4]
[2,0.4,0.2,0.1,null,"4-5","None",0]
[3,0.6,0.3,0.15]
[4,0.8,0.4,0.2]
[5,1,0.5,0.25]
[null,null,null,null,null,null,null,null,null,null,null,null,null,null,null,null,null,null,null,null,null,null,null,null,null,null,null,null,null,null,null,null,null,null,null,null,null,null,null,null,null,null,null,null,null,null,null,null,null,null,null,null,null,null,null,null,null,null,null,null,null,null,null,null,null,null,"REVEGETATION","Maintenance gain =",{"$f":"IF(AND(gain_maint_Reveg_L>0,mgmt_restrictaccess),BQ29,0)","v":0},null,null,"Improvement gain =",{"$f":"IF(\nAND(SUM(gain_impr_Reveg_CC,gain_impr_Reveg_L,gain_impr_Reveg_LC)>0,mgmt_restrictaccess),\nBV29,\n0)","v":0}]
["UNDERSTOREY","Maintenance gain =",{"$f":"\nIF(AND(mgmt_stock,mgmt_weed_crntlvl,mgmt_weed_1pct,sc_underst=0),B31,\nIF(AND(mgmt_stock,mgmt_weed_crntlvl,mgmt_weed_1pct,sc_underst=5),B32,\nIF(AND(mgmt_stock,mgmt_weed_crntlvl,mgmt_weed_1pct,sc_underst=10),B33,\nIF(AND(mgmt_stock,mgmt_weed_crntlvl,mgmt_weed_1pct,sc_underst=15),B34,\nIF(AND(mgmt_stock,mgmt_weed_crntlvl,mgmt_weed_1pct,sc_underst=20),B35,\nIF(AND(mgmt_stock,mgmt_weed_crntlvl,mgmt_weed_1pct,sc_underst=25),B36,\n0))))))","v":0},null,null,"Improvement gain =",{"$f":"\nIF(AND(mgmt_stock,mgmt_weed_crntlvl,mgmt_weed_1pct,mgmt_rabbits,mgmt_threats_all,sc_underst<=5,sc_lackweed<9,mgmt_weedwoody),I31,\nIF(AND(mgmt_stock,mgmt_weed_crntlvl,mgmt_weed_1pct,mgmt_rabbits,mgmt_threats_all,sc_underst<=5,sc_lackweed>=9,sc_lackweed<=15,mgmt_weedwoodyherb,mgmt_reveg),I34,\nIF(AND(mgmt_stock,mgmt_weed_crntlvl,mgmt_weed_1pct,mgmt_rabbits,mgmt_threats_all,sc_underst<=5,sc_lackweed>=9,sc_lackweed<=15,mgmt_weedwoody,mgmt_reveg),I35,\nIF(AND(mgmt_stock,mgmt_weed_crntlvl,mgmt_weed_1pct,mgmt_rabbits,mgmt_threats_all,sc_underst<=5,sc_lackweed>=9,sc_lackweed<=15,mgmt_weedwoodyherb),I32,\nIF(AND(mgmt_stock,mgmt_weed_crntlvl,mgmt_weed_1pct,mgmt_rabbits,mgmt_threats_all,sc_underst<=5,sc_lackweed>=9,sc_lackweed<=15,mgmt_weedwoody),I33,\nIF(AND(mgmt_stock,mgmt_weed_crntlvl,mgmt_weed_1pct,mgmt_rabbits,mgmt_threats_all,sc_underst>=10,sc_underst<=20,sc_lackweed<9,mgmt_weedwoody),I36,\nIF(AND(mgmt_stock,mgmt_weed_crntlvl,mgmt_weed_1pct,mgmt_rabbits,mgmt_threats_all,sc_underst>=10,sc_underst<=20,sc_lackweed>=9,sc_lackweed<=15,mgmt_weedwoodyherb),I37,\nIF(AND(mgmt_stock,mgmt_weed_crntlvl,mgmt_weed_1pct,mgmt_rabbits,mgmt_threats_all,sc_underst>=10,sc_underst<=20,sc_lackweed>=9,sc_lackweed<=15,mgmt_weedwoody),I38,\n0))))))))","v":0},null,null,null,null,"UNDERSTOREY","Maintenance gain =",{"$f":"\nIF(AND(mgmt_weed_crntlvl,mgmt_weed_1pct,sc_underst=0),N31,\nIF(AND(mgmt_weed_crntlvl,mgmt_weed_1pct,sc_underst=5,mgmt_biomass_timing),N32,\nIF(AND(mgmt_weed_crntlvl,mgmt_weed_1pct,sc_underst=5,mgmt_biomass),N33,\nIF(AND(mgmt_weed_crntlvl,mgmt_weed_1pct,sc_underst=10,mgmt_biomass_timing),N34,\nIF(AND(mgmt_weed_crntlvl,mgmt_weed_1pct,sc_underst=10,mgmt_biomass),N35,\nIF(AND(mgmt_weed_crntlvl,mgmt_weed_1pct,sc_underst=15,mgmt_biomass_timing),N36,\nIF(AND(mgmt_weed_crntlvl,mgmt_weed_1pct,sc_underst=15,mgmt_biomass),N37,\nIF(AND(mgmt_weed_crntlvl,mgmt_weed_1pct,sc_underst=20,mgmt_biomass_timing),N38,\nIF(AND(mgmt_weed_crntlvl,mgmt_weed_1pct,sc_underst=20,mgmt_biomass),N39,\nIF(AND(mgmt_weed_crntlvl,mgmt_weed_1pct,sc_underst=25,mgmt_biomass_timing),N40,\nIF(AND(mgmt_weed_crntlvl,mgmt_weed_1pct,sc_underst=25,mgmt_biomass),N41,\n0)))))))))))","v":0},null,null,"Improvement gain =",{"$f":"\nIF(AND(mgmt_weed_crntlvl,mgmt_weed_1pct,mgmt_rabbits,mgmt_threats_all,sc_underst<=5,sc_lackweed<9,OR(mgmt_biomass_timing,mgmt_biomass),mgmt_weedwoody),U31,\nIF(AND(mgmt_weed_crntlvl,mgmt_weed_1pct,mgmt_rabbits,mgmt_threats_all,sc_underst<=5,sc_lackweed>=9,sc_lackweed<=15,OR(mgmt_biomass_timing,mgmt_biomass),mgmt_weedwoodyherb),U32,\nIF(AND(mgmt_weed_crntlvl,mgmt_weed_1pct,mgmt_rabbits,mgmt_threats_all,sc_underst<=5,sc_lackweed>=9,sc_lackweed<=15,OR(mgmt_biomass_timing,mgmt_biomass),mgmt_weedwoody),U33,\nIF(AND(mgmt_weed_crntlvl,mgmt_weed_1pct,mgmt_rabbits,mgmt_threats_all,sc_underst>=10,sc_underst<=20,sc_lackweed<9,mgmt_biomass_timing,mgmt_weedwoody),U34,\nIF(AND(mgmt_weed_crntlvl,mgmt_weed_1pct,mgmt_rabbits,mgmt_threats_all,sc_underst>=10,sc_underst<=20,sc_lackweed<9,mgmt_biomass,mgmt_weedwoody),U35,\nIF(AND(mgmt_weed_crntlvl,mgmt_weed_1pct,mgmt_rabbits,mgmt_threats_all,sc_underst>=10,sc_underst<=20,sc_lackweed>=9,sc_lackweed<=15,mgmt_biomass_timing,mgmt_weedwoodyherb),U36,\nIF(AND(mgmt_weed_crntlvl,mgmt_weed_1pct,mgmt_rabbits,mgmt_threats_all,sc_underst>=10,sc_underst<=20,sc_lackweed>=9,sc_lackweed<=15,mgmt_biomass_timing,mgmt_weedwoody),U37,\nIF(AND(mgmt_weed_crntlvl,mgmt_weed_1pct,mgmt_rabbits,mgmt_threats_all,sc_underst>=10,sc_underst<=20,sc_lackweed>=9,sc_lackweed<=15,mgmt_biomass,mgmt_weedwoodyherb),U38,\nIF(AND(mgmt_weed_crntlvl,mgmt_weed_1pct,mgmt_rabbits,mgmt_threats_all,sc_underst>=10,sc_underst<=20,sc_lackweed>=9,sc_lackweed<=15,mgmt_biomass,mgmt_weedwoody),U39,\nIF(AND(mgmt_weed_crntlvl,mgmt_weed_1pct,mgmt_rabbits,mgmt_threats_all,sc_underst=25,sc_lackweed<=15),U40,\n0))))))))))","v":0},null,null,null,null,null,"UNDERSTOREY","Maintenance gain =",{"$f":"\nIF(AND(mgmt_weed_crntlvl_perennial,mgmt_weed_1pct,sc_underst=0),Z31,\nIF(AND(mgmt_weed_crntlvl_perennial,mgmt_weed_1pct,sc_underst=5,mgmt_weed_crntlvl_annual),Z32,\nIF(AND(mgmt_weed_crntlvl_perennial,mgmt_weed_1pct,sc_underst=5,mgmt_weed_monitorannual),Z33,\nIF(AND(mgmt_weed_crntlvl_perennial,mgmt_weed_1pct,sc_underst=10,mgmt_weed_crntlvl_annual),Z34,\nIF(AND(mgmt_weed_crntlvl_perennial,mgmt_weed_1pct,sc_underst=10,mgmt_weed_monitorannual),Z35,\nIF(AND(mgmt_weed_crntlvl_perennial,mgmt_weed_1pct,sc_underst=15,mgmt_weed_crntlvl_annual),Z36,\nIF(AND(mgmt_weed_crntlvl_perennial,mgmt_weed_1pct,sc_underst=15,mgmt_weed_monitorannual),Z37,\nIF(AND(mgmt_weed_crntlvl_perennial,mgmt_weed_1pct,sc_underst=20,mgmt_weed_crntlvl_annual),Z38,\nIF(AND(mgmt_weed_crntlvl_perennial,mgmt_weed_1pct,sc_underst=20,mgmt_weed_monitorannual),Z39,\nIF(AND(mgmt_weed_crntlvl_perennial,mgmt_weed_1pct,sc_underst=25,mgmt_weed_crntlvl_annual),Z40,\nIF(AND(mgmt_weed_crntlvl_perennial,mgmt_weed_1pct,sc_underst=25,mgmt_weed_monitorannual),Z41,\n0)))))))))))","v":0},null,null,"Improvement gain =",{"$f":"\nIF(AND(mgmt_weed_crntlvl_perennial,mgmt_weed_1pct,mgmt_rabbits,mgmt_threats_all,sc_underst<=5,sc_lackweed<9,OR(mgmt_weed_crntlvl_annual,mgmt_weed_monitorannual),mgmt_weedwoody),AG31,\nIF(AND(mgmt_weed_crntlvl_perennial,mgmt_weed_1pct,mgmt_rabbits,mgmt_threats_all,sc_underst<=5,sc_lackweed>=9,sc_lackweed<=15,OR(mgmt_weed_crntlvl_annual,mgmt_weed_monitorannual),mgmt_weedwoodyherb),AG32,\nIF(AND(mgmt_weed_crntlvl_perennial,mgmt_weed_1pct,mgmt_rabbits,mgmt_threats_all,sc_underst<=5,sc_lackweed>=9,sc_lackweed<=15,OR(mgmt_weed_crntlvl_annual,mgmt_weed_monitorannual),mgmt_weedwoody),AG33,\nIF(AND(mgmt_weed_crntlvl_perennial,mgmt_weed_1pct,mgmt_rabbits,mgmt_threats_all,sc_underst>=10,sc_underst<=20,sc_lackweed<9,mgmt_weed_crntlvl_annual,mgmt_weedwoody),AG34,\nIF(AND(mgmt_weed_crntlvl_perennial,mgmt_weed_1pct,mgmt_rabbits,mgmt_threats_all,sc_underst>=10,sc_underst<=20,sc_lackweed<9,mgmt_weed_monitorannual,mgmt_weedwoody),AG35,\nIF(AND(mgmt_weed_crntlvl_perennial,mgmt_weed_1pct,mgmt_rabbits,mgmt_threats_all,sc_underst>=10,sc_underst<=20,sc_lackweed>=9,sc_lackweed<=15,mgmt_weed_crntlvl_annual,mgmt_weedwoodyherb),AG36,\nIF(AND(mgmt_weed_crntlvl_perennial,mgmt_weed_1pct,mgmt_rabbits,mgmt_threats_all,sc_underst>=10,sc_underst<=20,sc_lackweed>=9,sc_lackweed<=15,mgmt_weed_crntlvl_annual,mgmt_weedwoody),AG37,\nIF(AND(mgmt_weed_crntlvl_perennial,mgmt_weed_1pct,mgmt_rabbits,mgmt_threats_all,sc_underst>=10,sc_underst<=20,sc_lackweed>=9,sc_lackweed<=15,mgmt_weed_monitorannual,mgmt_weedwoodyherb),AG38,\nIF(AND(mgmt_weed_crntlvl_perennial,mgmt_weed_1pct,mgmt_rabbits,mgmt_threats_all,sc_underst>=10,sc_underst<=20,sc_lackweed>=9,sc_lackweed<=15,mgmt_weed_monitorannual,mgmt_weedwoody),AG39,\nIF(AND(mgmt_weed_crntlvl_perennial,mgmt_weed_1pct,mgmt_rabbits,mgmt_threats_all,sc_underst=25,sc_lackweed<=15),AG40,\n0))))))))))","v":0},null,null,null,null,null,"UNDERSTOREY","Maintenance gain =",{"$f":"\nIF(AND(mgmt_stock,mgmt_weed_crntlvl,mgmt_weed_1pct,sc_underst=0),AK31,\nIF(AND(mgmt_stock,mgmt_weed_crntlvl,mgmt_weed_1pct,sc_underst=5),AK32,\nIF(AND(mgmt_stock,mgmt_weed_crntlvl,mgmt_weed_1pct,sc_underst=10),AK33,\nIF(AND(mgmt_stock,mgmt_weed_crntlvl,mgmt_weed_1pct,sc_underst=15),AK34,\nIF(AND(mgmt_stock,mgmt_weed_crntlvl,mgmt_weed_1pct,sc_underst=20),AK35,\nIF(AND(mgmt_stock,mgmt_weed_crntlvl,mgmt_weed_1pct,sc_underst=25),AK36,\n0))))))","v":0},null,null,"Improvement gain =",{"$f":"\nIF(AND(mgmt_stock,mgmt_weed_crntlvl,mgmt_weed_1pct,mgmt_rabbits,mgmt_threats_all,sc_underst<=5,sc_lackweed<9,mgmt_weedwoody),AR31,\nIF(AND(mgmt_stock,mgmt_weed_crntlvl,mgmt_weed_1pct,mgmt_rabbits,mgmt_threats_all,sc_underst<=5,sc_lackweed>=9,sc_lackweed<=15,mgmt_weedwoodyherb,mgmt_reveg),AR34,\nIF(AND(mgmt_stock,mgmt_weed_crntlvl,mgmt_weed_1pct,mgmt_rabbits,mgmt_threats_all,sc_underst<=5,sc_lackweed>=9,sc_lackweed<=15,mgmt_weedwoody,mgmt_reveg),AR35,\nIF(AND(mgmt_stock,mgmt_weed_crntlvl,mgmt_weed_1pct,mgmt_rabbits,mgmt_threats_all,sc_underst<=5,sc_lackweed>=9,sc_lackweed<=15,mgmt_weedwoodyherb),AR32,\nIF(AND(mgmt_stock,mgmt_weed_crntlvl,mgmt_weed_1pct,mgmt_rabbits,mgmt_threats_all,sc_underst<=5,sc_lackweed>=9,sc_lackweed<=15,mgmt_weedwoody),AR33,\nIF(AND(mgmt_stock,mgmt_weed_crntlvl,mgmt_weed_1pct,mgmt_rabbits,mgmt_threats_all,sc_underst>=10,sc_underst<=20,sc_lackweed<9,mgmt_weedwoody),AR36,\nIF(AND(mgmt_stock,mgmt_weed_crntlvl,mgmt_weed_1pct,mgmt_rabbits,mgmt_threats_all,sc_underst>=10,sc_underst<=20,sc_lackweed>=9,sc_lackweed<=15,mgmt_weedwoodyherb),AR37,\nIF(AND(mgmt_stock,mgmt_weed_crntlvl,mgmt_weed_1pct,mgmt_rabbits,mgmt_threats_all,sc_underst>=10,sc_underst<=20,sc_lackweed>=9,sc_lackweed<=15,mgmt_weedwoody),AR38,\nIF(AND(mgmt_stock,mgmt_weed_crntlvl,mgmt_weed_1pct,mgmt_rabbits,mgmt_threats_all,sc_underst=25,sc_lackweed<=15),AR39,\n0)))))))))","v":0},null,null,null,null,null,"UNDERSTOREY","Maintenance gain =","N/A",null,null,"Improvement gain =","-"]
[null,null,null,null,null,null,null,null,null,null,null,null,null,null,null,null,null,null,null,null,null,null,null,null,null,null,null,null,null,null,null,null,null,null,null,null,null,null,null,null,null,null,null,null,null,null,null,null,null,null,null,null,null,null,null,null,null,null,null,null,null,null,null,null,null,null,"Requirements / Additional actions",null,"Gain score / ha (/100)",null,null,"Requirements / Additional actions",null,"Gain score / ha (/100)"]
["Condition score","Maintenance gain / ha ",null,null,null,"Condition score",null,"Additional commitments","Improvement gain / ha ",null,null,"Condition score","Additional commitment","Maintenance gain / ha ",null,null,"Condition score (non-standardised)",null,"Additional commitments",null,"Improvement gain / ha",null,null,"Condition score","Additional commitment","Maintenance gain / ha ",null,null,"Condition score (non-standardised)",null,"Additional commitments",null,"Improvement gain / ha",null,null,"Condition score","Maintenance gain / ha ",null,null,null,"Condition score (non-standardised)",null,"Additional commitments","Improvement gain / ha",null,null,null,null,null,null,null,null,null,null,null,null,null,null,null,null,null,null,null,null,null,null,"Meet all of the minimum commitments relating to revegetation",null,{"$f":"gain_maint_Reveg_L","v":0},null,null,"All maintenance gain commitments.\nAll improvement gain commitments for relevant veg type.",null,{"$f":"SUM(gain_impr_Reveg_CC,gain_impr_Reveg_L,gain_impr_Reveg_LC)","v":0}]
["Understorey",null,null,null,null,"Understorey","Lack of weeds",null,null,null,null,"Understorey",null,null,null,null,"Understorey","Lack of weeds",null,null,null,null,null,"Understorey",null,null,null,null,"Understorey","Lack of weeds",null,null,null,null,null,"Understorey",null,null,null,null,"Understorey","Lack of weeds",null,null,null,null,null,null,null,null,null,null,null,null,null,null,null,null,null,null,null,null,null,null,null,null,"Restrict public access to the land and prevent lopping or pruning of native vegetation.",null,null,null,null,"Control all high threats."]
[0,0,null,null,null,"0-5","< 9","B",1.25,null,null,0,"N/A",0,null,null,"0-5","< 9","A OR B","D",0.63,null,null,0,"N/A",0,null,null,"0-5","< 9","A OR B","D",0.63,null,null,0,0,null,null,null,"0-5","< 9","B",0.63]
[5,0.5,null,null,null,null,"9-15","A",2.5,null,null,5,"A",2.5,null,null,null,"9-15","A OR B","C",1.25,null,null,5,"A",2.5,null,null,null,"9-15","A OR B","C",1.25,null,null,5,2.5,null,null,null,null,"9-15","A",1.25]
[10,1,null,null,null,null,null,"B",1.25,null,null,null,"B",1.25,null,null,null,null,null,"D",0.63,null,null,null,"B",1.25,null,null,null,null,null,"D",0.63,null,null,10,5,null,null,null,null,null,"B",0.63]
[15,1.5,null,null,null,null,null,"A AND C",3.5,null,null,10,"A",5,null,null,"10-20","< 9","A","D",1.25,null,null,10,"A",5,null,null,"10-20","< 9","A","D",1.25,null,null,15,7.5,null,null,null,null,null,"A and C",2.25]
[20,2,null,null,null,null,null,"B AND C",2.25,null,null,null,"B",2.5,null,null,null,null,"B","D",0.63,null,null,null,"B",2.5,null,null,null,null,"B","D",0.63,null,null,20,10,null,null,null,null,null,"B and C",1.63]
[25,2.5,null,null,null,"10-20","< 9","B",2.5,null,null,15,"A",7.5,null,null,null,"9-15","A","C",2.5,null,null,15,"A",7.5,null,null,null,"9-15","A","C",2.5,null,null,25,12.5,null,null,null,"10-20","< 9","B",1.25]
[null,null,null,null,null,null,"9-15","A",5,null,null,null,"B",3.75,null,null,null,null,null,"D",1.25,null,null,null,"B",3.75,null,null,null,null,null,"D",1.25,null,null,null,null,null,null,null,null,"9-15","A",2.5]
[null,null,null,null,null,null,null,"B",2.5,null,null,20,"A",10,null,null,null,null,"B","C",1.25,null,null,20,"A",10,null,null,null,null,"B","C",1.25,null,null,null,null,null,null,null,null,null,"B",1.25]
[null,null,null,null,null,25,"0-15","N/A",0,null,null,null,"B",5,null,null,null,null,null,"D",0.63,null,null,null,"B",5,null,null,null,null,null,"D",0.63,null,null,null,null,null,null,null,25,"0-15","N/A",0]
[null,null,null,null,null,null,null,null,null,null,null,25,"A",12.5,null,null,25,"0-15","N/A","N/A",0,null,null,25,"A",12.5,null,null,25,"0-15","N/A","N/A",0]
[null,null,null,null,null,null,null,null,null,null,null,null,"B",6.25,null,null,null,null,null,null,null,null,null,null,"B",6.25]
[]
[]
["LACK OF WEEDS","Maintenance gain =","N/A",null,null,"Improvement gain =",{"$f":"\nIF(AND(mgmt_weed_crntlvl,mgmt_weed_1pct,sc_lackweed<9,mgmt_weedwoody),H48,\nIF(AND(mgmt_weed_crntlvl,mgmt_weed_1pct,sc_lackweed>=9,sc_lackweed<=15,mgmt_weedwoodyherb),H49,\nIF(AND(mgmt_weed_crntlvl,mgmt_weed_1pct,sc_lackweed>=9,sc_lackweed<=15,mgmt_weedwoody),H50,\n0)))","v":0},null,null,null,null,"LACK OF WEEDS","Maintenance gain =","N/A",null,null,"Improvement gain =",{"$f":"\nIF(AND(mgmt_weed_crntlvl,mgmt_weed_1pct,sc_lackweed<9,mgmt_weedwoody),S48,\nIF(AND(mgmt_weed_crntlvl,mgmt_weed_1pct,sc_lackweed>=9,sc_lackweed<=15,mgmt_weedwoodyherb),S49,\nIF(AND(mgmt_weed_crntlvl,mgmt_weed_1pct,sc_lackweed>=9,sc_lackweed<=15,mgmt_weedwoody),S50,\n0)))","v":0},null,null,null,null,null,"LACK OF WEEDS","Maintenance gain =","N/A",null,null,"Improvement gain =",{"$f":"\nIF(AND(mgmt_weed_crntlvl_perennial,mgmt_weed_1pct,sc_lackweed<9,mgmt_weedwoody),AE48,\nIF(AND(mgmt_weed_crntlvl_perennial,mgmt_weed_1pct,sc_lackweed>=9,sc_lackweed<=15,mgmt_weedwoodyherb),AE49,\nIF(AND(mgmt_weed_crntlvl_perennial,mgmt_weed_1pct,sc_lackweed>=9,sc_lackweed<=15,mgmt_weedwoody),AE50,\n0)))","v":0},null,null,null,null,null,"LACK OF WEEDS","Maintenance gain =","N/A",null,null,"Improvement gain =",{"$f":"\nIF(AND(mgmt_weed_crntlvl,mgmt_weed_1pct,sc_lackweed<9,mgmt_weedwoody),AQ48,\nIF(AND(mgmt_weed_crntlvl,mgmt_weed_1pct,sc_lackweed>=9,sc_lackweed<=15,mgmt_weedwoodyherb),AQ49,\nIF(AND(mgmt_weed_crntlvl,mgmt_weed_1pct,sc_lackweed>=9,sc_lackweed<=15,mgmt_weedwoody),AQ50,\n0)))","v":0},null,null,null,null,null,"LACK OF WEEDS","Maintenance gain =","N/A",null,null,"Improvement gain =","N/A"]
[]
["No maintenance gain for lack of weeds",null,null,null,null,"Condition score","Additional commitment","Improvement gain / ha",null,null,null,"No maintenance gain for lack of weeds",null,null,null,null,"Condition score","Additional commitment","Improvement gain / ha",null,null,null,null,"No maintenance gain for lack of weeds",null,null,null,null,"Condition score","Additional commitment","Improvement gain / ha",null,null,null,null,"No maintenance gain for lack of weeds",null,null,null,null,"Condition score","Additional commitment","Improvement gain / ha"]
[null,null,null,null,null,"Lack of weeds",null,null,null,null,null,null,null,null,null,null,"Lack of weeds",null,null,null,null,null,null,null,null,null,null,null,"Lack of weeds",null,null,null,null,null,null,null,null,null,null,null,"Lack of weeds"]
[null,null,null,null,null,"< 9","B",2,null,null,null,null,null,null,null,null,"< 9","B",1,null,null,null,null,null,null,null,null,null,"< 9","B",1,null,null,null,null,null,null,null,null,null,"< 9","B",1]
[null,null,null,null,null,"9-15","A",4,null,null,null,null,null,null,null,null,"9-15","A",2,null,null,null,null,null,null,null,null,null,"9-15","A",2,null,null,null,null,null,null,null,null,null,"9-15","A",2]
[null,null,null,null,null,null,"B",2,null,null,null,null,null,null,null,null,null,"B",1,null,null,null,null,null,null,null,null,null,null,"B",1,null,null,null,null,null,null,null,null,null,null,"B",1]
[]
[]
["RECRUITMENT","Maintenance gain =",{"$f":"\nIF(AND(mgmt_stock,mgmt_weed_crntlvl,mgmt_weed_1pct,sc_recruit=0),B57,\nIF(AND(mgmt_stock,mgmt_weed_crntlvl,mgmt_weed_1pct,sc_recruit=1),B58,\nIF(AND(mgmt_stock,mgmt_weed_crntlvl,mgmt_weed_1pct,sc_recruit=3),B59,\nIF(AND(mgmt_stock,mgmt_weed_crntlvl,mgmt_weed_1pct,sc_recruit=5),B60,\nIF(AND(mgmt_stock,mgmt_weed_crntlvl,mgmt_weed_1pct,sc_recruit=6),B61,\nIF(AND(mgmt_stock,mgmt_weed_crntlvl,mgmt_weed_1pct,sc_recruit=10),B62,\n0))))))","v":0},null,null,"Improvement gain =",{"$f":"\nIF(AND(mgmt_stock,mgmt_weed_crntlvl,mgmt_weed_1pct,mgmt_rabbits,mgmt_threats_all,sc_recruit<=6,sc_underst<=5,sc_lackweed<=15),J57,\nIF(AND(mgmt_stock,mgmt_weed_crntlvl,mgmt_weed_1pct,mgmt_rabbits,mgmt_threats_all,sc_recruit<=6,sc_underst>=10,sc_underst<=25,sc_lackweed>=9,sc_lackweed<=15,mgmt_weedwoodyherb),J58,\nIF(AND(mgmt_stock,mgmt_weed_crntlvl,mgmt_weed_1pct,mgmt_rabbits,mgmt_threats_all,sc_recruit<=6,sc_underst>=10,sc_underst<=25,sc_lackweed>=9,sc_lackweed<=15,mgmt_weedwoody),J59,\nIF(AND(mgmt_stock,mgmt_weed_crntlvl,mgmt_weed_1pct,mgmt_rabbits,mgmt_threats_all,sc_recruit<=6,sc_underst>=10,sc_underst<=25,sc_lackweed<9,mgmt_weedwoody),J60,\nIF(AND(mgmt_stock,mgmt_weed_crntlvl,mgmt_weed_1pct,mgmt_rabbits,mgmt_threats_all,sc_recruit=10,sc_underst>=0,sc_underst<=25,sc_lackweed>=0,sc_lackweed<=15),J61,\n0)))))","v":0},null,null,null,null,"RECRUITMENT","Maintenance gain =",{"$f":"\nIF(AND(mgmt_weed_crntlvl,mgmt_weed_1pct,sc_recruit=0),N57,\nIF(AND(mgmt_weed_crntlvl,mgmt_weed_1pct,sc_recruit=1,mgmt_biomass_timing),N58,\nIF(AND(mgmt_weed_crntlvl,mgmt_weed_1pct,sc_recruit=1,mgmt_biomass),N59,\nIF(AND(mgmt_weed_crntlvl,mgmt_weed_1pct,sc_recruit=3,mgmt_biomass_timing),N60,\nIF(AND(mgmt_weed_crntlvl,mgmt_weed_1pct,sc_recruit=3,mgmt_biomass),N61,\nIF(AND(mgmt_weed_crntlvl,mgmt_weed_1pct,sc_recruit=5,mgmt_biomass_timing),N62,\nIF(AND(mgmt_weed_crntlvl,mgmt_weed_1pct,sc_recruit=5,mgmt_biomass),N63,\nIF(AND(mgmt_weed_crntlvl,mgmt_weed_1pct,sc_recruit=6,mgmt_biomass_timing),N64,\nIF(AND(mgmt_weed_crntlvl,mgmt_weed_1pct,sc_recruit=6,mgmt_biomass),N65,\nIF(AND(mgmt_weed_crntlvl,mgmt_weed_1pct,sc_recruit=10,mgmt_biomass_timing),N66,\nIF(AND(mgmt_weed_crntlvl,mgmt_weed_1pct,sc_recruit=10,mgmt_biomass),N67,\n0)))))))))))","v":0},null,null,"Improvement gain =",{"$f":"\nIF(AND(mgmt_weed_crntlvl,mgmt_weed_1pct,mgmt_rabbits,mgmt_threats_all,sc_recruit<=6,sc_underst<=5,sc_lackweed<=15),V57,\nIF(AND(mgmt_weed_crntlvl,mgmt_weed_1pct,mgmt_rabbits,mgmt_threats_all,sc_recruit<=6,sc_underst>=10,sc_underst<=25,sc_lackweed<9,mgmt_biomass_timing,mgmt_weedwoody),V58,\nIF(AND(mgmt_weed_crntlvl,mgmt_weed_1pct,mgmt_rabbits,mgmt_threats_all,sc_recruit<=6,sc_underst>=10,sc_underst<=25,sc_lackweed<9,mgmt_biomass,mgmt_weedwoody),V59,\nIF(AND(mgmt_weed_crntlvl,mgmt_weed_1pct,mgmt_rabbits,mgmt_threats_all,sc_recruit<=6,sc_underst>=10,sc_underst<=25,sc_lackweed>=9,sc_lackweed<=15,mgmt_biomass_timing,mgmt_weedwoodyherb),V60,\nIF(AND(mgmt_weed_crntlvl,mgmt_weed_1pct,mgmt_rabbits,mgmt_threats_all,sc_recruit<=6,sc_underst>=10,sc_underst<=25,sc_lackweed>=9,sc_lackweed<=15,mgmt_biomass_timing,mgmt_weedwoody),V61,\nIF(AND(mgmt_weed_crntlvl,mgmt_weed_1pct,mgmt_rabbits,mgmt_threats_all,sc_recruit<=6,sc_underst>=10,sc_underst<=25,sc_lackweed>=9,sc_lackweed<=15,mgmt_biomass,mgmt_weedwoodyherb),V62,\nIF(AND(mgmt_weed_crntlvl,mgmt_weed_1pct,mgmt_rabbits,mgmt_threats_all,sc_recruit<=6,sc_underst>=10,sc_underst<=25,sc_lackweed>=9,sc_lackweed<=15,mgmt_biomass,mgmt_weedwoody),V63,\nIF(AND(mgmt_weed_crntlvl,mgmt_weed_1pct,mgmt_rabbits,mgmt_threats_all,sc_recruit=10,sc_underst>=0,sc_underst<=25,sc_lackweed>=0,sc_lackweed<=15),V64,\n0))))))))","v":0},null,null,null,null,null,"RECRUITMENT","Maintenance gain =",{"$f":"\nIF(AND(mgmt_weed_crntlvl_perennial,mgmt_weed_1pct,sc_recruit=0),Z57,\nIF(AND(mgmt_weed_crntlvl_perennial,mgmt_weed_1pct,sc_recruit=1,mgmt_weed_crntlvl_annual),Z58,\nIF(AND(mgmt_weed_crntlvl_perennial,mgmt_weed_1pct,sc_recruit=1,mgmt_weed_monitorannual),Z59,\nIF(AND(mgmt_weed_crntlvl_perennial,mgmt_weed_1pct,sc_recruit=3,mgmt_weed_crntlvl_annual),Z60,\nIF(AND(mgmt_weed_crntlvl_perennial,mgmt_weed_1pct,sc_recruit=3,mgmt_weed_monitorannual),Z61,\nIF(AND(mgmt_weed_crntlvl_perennial,mgmt_weed_1pct,sc_recruit=5,mgmt_weed_crntlvl_annual),Z62,\nIF(AND(mgmt_weed_crntlvl_perennial,mgmt_weed_1pct,sc_recruit=5,mgmt_weed_monitorannual),Z63,\nIF(AND(mgmt_weed_crntlvl_perennial,mgmt_weed_1pct,sc_recruit=6,mgmt_weed_crntlvl_annual),Z64,\nIF(AND(mgmt_weed_crntlvl_perennial,mgmt_weed_1pct,sc_recruit=6,mgmt_weed_monitorannual),Z65,\nIF(AND(mgmt_weed_crntlvl_perennial,mgmt_weed_1pct,sc_recruit=10,mgmt_weed_crntlvl_annual),Z66,\nIF(AND(mgmt_weed_crntlvl_perennial,mgmt_weed_1pct,sc_recruit=10,mgmt_weed_monitorannual),Z67,\n0)))))))))))","v":0},null,null,"Improvement gain =",{"$f":"\nIF(AND(mgmt_weed_crntlvl_perennial,mgmt_weed_1pct,mgmt_rabbits,mgmt_threats_all,sc_recruit<=6,sc_underst<=5,sc_lackweed<=15),AG57,\nIF(AND(mgmt_weed_crntlvl_perennial,mgmt_weed_1pct,mgmt_rabbits,mgmt_threats_all,sc_recruit<=6,sc_underst>=10,sc_underst<=25,sc_lackweed<9,OR(mgmt_weed_crntlvl_annual,mgmt_weed_monitorannual),mgmt_weedwoody),AG58,\nIF(AND(mgmt_weed_crntlvl_perennial,mgmt_weed_1pct,mgmt_rabbits,mgmt_threats_all,sc_recruit<=6,sc_underst>=10,sc_underst<=25,sc_lackweed>=9,sc_lackweed<=15,OR(mgmt_weed_crntlvl_annual,mgmt_weed_monitorannual),mgmt_weedwoodyherb),AG59,\nIF(AND(mgmt_weed_crntlvl_perennial,mgmt_weed_1pct,mgmt_rabbits,mgmt_threats_all,sc_recruit<=6,sc_underst>=10,sc_underst<=25,sc_lackweed>=9,sc_lackweed<=15,OR(mgmt_weed_crntlvl_annual,mgmt_weed_monitorannual),mgmt_weedwoody),AG60,\nIF(AND(mgmt_weed_crntlvl_perennial,mgmt_weed_1pct,mgmt_rabbits,mgmt_threats_all,sc_recruit=10,sc_underst>=0,sc_underst<=25,sc_lackweed>=0,sc_lackweed<=15),AG61,\n0)))))","v":0},null,null,null,null,null,"RECRUITMENT","Maintenance gain =",{"$f":"\nIF(AND(mgmt_stock,mgmt_weed_crntlvl,mgmt_weed_1pct,sc_recruit=0),AK57,\nIF(AND(mgmt_stock,mgmt_weed_crntlvl,mgmt_weed_1pct,sc_recruit=1),AK58,\nIF(AND(mgmt_stock,mgmt_weed_crntlvl,mgmt_weed_1pct,sc_recruit=3),AK59,\nIF(AND(mgmt_stock,mgmt_weed_crntlvl,mgmt_weed_1pct,sc_recruit=5),AK60,\nIF(AND(mgmt_stock,mgmt_weed_crntlvl,mgmt_weed_1pct,sc_recruit=6),AK61,\nIF(AND(mgmt_stock,mgmt_weed_crntlvl,mgmt_weed_1pct,sc_recruit=10),AK62,\n0))))))","v":0},null,null,"Improvement gain =",{"$f":"\nIF(AND(mgmt_stock,mgmt_weed_crntlvl,mgmt_weed_1pct,mgmt_rabbits,mgmt_threats_all,sc_recruit<=6,sc_underst<=5,sc_lackweed<=15),AS57,\nIF(AND(mgmt_stock,mgmt_weed_crntlvl,mgmt_weed_1pct,mgmt_rabbits,mgmt_threats_all,sc_recruit<=6,sc_underst>=10,sc_underst<=25,sc_lackweed<9,mgmt_weedwoody),AS58,\nIF(AND(mgmt_stock,mgmt_weed_crntlvl,mgmt_weed_1pct,mgmt_rabbits,mgmt_threats_all,sc_recruit<=6,sc_underst>=10,sc_underst<=25,sc_lackweed>=9,sc_lackweed<=15,mgmt_weedwoodyherb),AS59,\nIF(AND(mgmt_stock,mgmt_weed_crntlvl,mgmt_weed_1pct,mgmt_rabbits,mgmt_threats_all,sc_recruit<=6,sc_underst>=10,sc_underst<=25,sc_lackweed>=9,sc_lackweed<=15,mgmt_weedwoody),AS60,\nIF(AND(mgmt_stock,mgmt_weed_crntlvl,mgmt_weed_1pct,mgmt_rabbits,mgmt_threats_all,sc_recruit=10,sc_underst>=0,sc_underst<=25,sc_lackweed>=0,sc_lackweed<=15),AS61,\n0)))))","v":0},null,null,null,null,null,"RECRUITMENT","Maintenance gain =","N/A",null,null,"Improvement gain =","N/A"]
[]
["Condition score","Maintenance gain / ha",null,null,null,"Condition score",null,null,"Additional commitment","Improvement gain / ha",null,"Condition score","Additional commitment","Maintenance gain / ha",null,null,"Condition score ",null,null,"Additional commitments",null,"Improvement gain / ha",null,"Condition score","Additional commitment","Maintenance gain / ha",null,null,"Condition score ",null,null,"Additional commitments","Improvement gain / ha",null,null,"Condition score","Maintenance gain / ha",null,null,null,"Score",null,null,"Additional commitment","Improvement gain / ha"]
["Recruitment",null,null,null,null,"Recruitment","Understorey","Lack of weeds",null,null,null,"Recruitment",null,null,null,null,"Recruitment","Understorey","Lack of weeds",null,null,null,null,"Recruitment",null,null,null,null,"Recruitment","Understorey","Lack of weeds",null,null,null,null,"Recruitment",null,null,null,null,"Recruitment","Understorey","Lack of weeds"]
[0,0,null,null,null,"0-6","0-5 ","0-15","N/A",0,null,0,"N/A",0,null,null,"0-6","0-5","0-15","N/A","N/A",0,null,0,"N/A",0,null,null,"0-6","0-5","0-15","N/A",0,null,null,0,0,null,null,null,"0-6","0-5","0-15","N/A",0]
[1,0.1,null,null,null,null,"10-25","9-15","A",4,null,1,"A",1,null,null,null,"10-25","< 9","A","D",1,null,1,"A",1,null,null,null,"10-25","< 9","A and C",1,null,null,1,0.5,null,null,null,null,"10-25","< 9","B",1]
[3,0.3,null,null,null,null,null,"9-15","B",2,null,null,"B",0.5,null,null,null,null,null,"B","D",0.5,null,null,"B",0.5,null,null,null,null,"9-15","A and B",2,null,null,3,1.5,null,null,null,null,null,"9-15","A",2]
[5,0.5,null,null,null,null,null,"< 9","B",2,null,3,"A",1.5,null,null,null,null,"9-15","A","C",2,null,3,"A",1.5,null,null,null,null,null,"A and C",1,null,null,5,2.5,null,null,null,null,null,null,"B",1]
[6,0.6,null,null,null,10,"0-25","0-15","N/A",0,null,null,"B",0.75,null,null,null,null,null,null,"D",1,null,null,"B",0.75,null,null,10,"0-25","0-15","N/A",0,null,null,6,3,null,null,null,10,"0-25","0-15","N/A",0]
[10,1,null,null,null,null,null,null,null,null,null,5,"A",2.5,null,null,null,null,null,"B","C",1,null,5,"A",2.5,null,null,null,null,null,null,null,null,null,10,5]
[null,null,null,null,null,null,null,null,null,null,null,null,"B",1.25,null,null,null,null,null,null,"D",0.5,null,null,"B",1.25]
[null,null,null,null,null,null,null,null,null,null,null,6,"A",3,null,null,10,"0-25","0-15","N/A","N/A",0,null,6,"A",3]
[null,null,null,null,null,null,null,null,null,null,null,null,"B",1.5,null,null,null,null,null,null,null,null,null,null,"B",1.5]
[null,null,null,null,null,null,null,null,null,null,null,10,"A",5,null,null,null,null,null,null,null,null,null,10,"A",5]
[null,null,null,null,null,null,null,null,null,null,null,null,"B",2.5,null,null,null,null,null,null,null,null,null,null,"B",2.5]
[]
[]
["ORGANIC LITTER","Maintenance gain =",{"$f":"\nIF(AND(mgmt_stock,mgmt_weed_crntlvl,mgmt_weed_1pct,mgmt_litter,sc_litter=0),B74,\nIF(AND(mgmt_stock,mgmt_weed_crntlvl,mgmt_weed_1pct,mgmt_litter,sc_litter=2),B75,\nIF(AND(mgmt_stock,mgmt_weed_crntlvl,mgmt_weed_1pct,mgmt_litter,sc_litter=3),B76,\nIF(AND(mgmt_stock,mgmt_weed_crntlvl,mgmt_weed_1pct,mgmt_litter,sc_litter=4),B77,\nIF(AND(mgmt_stock,mgmt_weed_crntlvl,mgmt_weed_1pct,mgmt_litter,sc_litter=5),B78,\n0)))))","v":0},null,null,"Improvement gain =",{"$f":"\nIF(AND(mgmt_stock,mgmt_weed_crntlvl,mgmt_weed_1pct,mgmt_litter,mgmt_rabbits,mgmt_threats_all,sc_litter<=4),G74,\nIF(AND(mgmt_stock,mgmt_weed_crntlvl,mgmt_weed_1pct,mgmt_litter,mgmt_rabbits,mgmt_threats_all,sc_litter=5),G75,\n0))","v":0},null,null,null,null,"ORGANIC LITTER","Maintenance gain =",{"$f":"\nIF(AND(mgmt_weed_crntlvl,mgmt_weed_1pct,sc_litter=0),N74,\nIF(AND(mgmt_weed_crntlvl,mgmt_weed_1pct,sc_litter=2,mgmt_biomass_timing),N75,\nIF(AND(mgmt_weed_crntlvl,mgmt_weed_1pct,sc_litter=2,mgmt_biomass),N76,\nIF(AND(mgmt_weed_crntlvl,mgmt_weed_1pct,sc_litter=3,mgmt_biomass_timing),N77,\nIF(AND(mgmt_weed_crntlvl,mgmt_weed_1pct,sc_litter=3,mgmt_biomass),N78,\nIF(AND(mgmt_weed_crntlvl,mgmt_weed_1pct,sc_litter=4,mgmt_biomass_timing),N79,\nIF(AND(mgmt_weed_crntlvl,mgmt_weed_1pct,sc_litter=4,mgmt_biomass),N80,\nIF(AND(mgmt_weed_crntlvl,mgmt_weed_1pct,sc_litter=5,mgmt_biomass_timing),N81,\nIF(AND(mgmt_weed_crntlvl,mgmt_weed_1pct,sc_litter=5,mgmt_biomass),N82,\n0)))))))))","v":0},null,null,"Improvement gain =",{"$f":"\nIF(AND(mgmt_weed_crntlvl,mgmt_weed_1pct,mgmt_rabbits,mgmt_threats_all,sc_litter<=4,mgmt_biomass_timing),S74,\nIF(AND(mgmt_weed_crntlvl,mgmt_weed_1pct,mgmt_rabbits,mgmt_threats_all,sc_litter<=4,mgmt_biomass),S75,\nIF(AND(mgmt_weed_crntlvl,mgmt_weed_1pct,mgmt_rabbits,mgmt_threats_all,sc_litter=5,OR(mgmt_biomass_timing,mgmt_biomass)),S76,\n0)))","v":0},null,null,null,null,null,"ORGANIC LITTER","Maintenance gain =",{"$f":"\nIF(AND(mgmt_weed_crntlvl_perennial,mgmt_weed_1pct,sc_litter=0),Z74,\nIF(AND(mgmt_weed_crntlvl_perennial,mgmt_weed_1pct,sc_litter=2,mgmt_weed_crntlvl_annual),Z75,\nIF(AND(mgmt_weed_crntlvl_perennial,mgmt_weed_1pct,sc_litter=2,mgmt_weed_monitorannual),Z76,\nIF(AND(mgmt_weed_crntlvl_perennial,mgmt_weed_1pct,sc_litter=3,mgmt_weed_crntlvl_annual),Z77,\nIF(AND(mgmt_weed_crntlvl_perennial,mgmt_weed_1pct,sc_litter=3,mgmt_weed_monitorannual),Z78,\nIF(AND(mgmt_weed_crntlvl_perennial,mgmt_weed_1pct,sc_litter=4,mgmt_weed_crntlvl_annual),Z79,\nIF(AND(mgmt_weed_crntlvl_perennial,mgmt_weed_1pct,sc_litter=4,mgmt_weed_monitorannual),Z80,\nIF(AND(mgmt_weed_crntlvl_perennial,mgmt_weed_1pct,sc_litter=5,mgmt_weed_crntlvl_annual),Z81,\nIF(AND(mgmt_weed_crntlvl_perennial,mgmt_weed_1pct,sc_litter=5,mgmt_weed_monitorannual),Z82,\n0)))))))))","v":0},null,null,"Improvement gain =",{"$f":"\nIF(AND(mgmt_weed_crntlvl_perennial,mgmt_weed_1pct,mgmt_rabbits,mgmt_threats_all,sc_litter<=4,mgmt_weed_crntlvl_annual),AE74,\nIF(AND(mgmt_weed_crntlvl_perennial,mgmt_weed_1pct,mgmt_rabbits,mgmt_threats_all,sc_litter<=4,mgmt_weed_monitorannual),AE75,\nIF(AND(mgmt_weed_crntlvl_perennial,mgmt_weed_1pct,mgmt_rabbits,mgmt_threats_all,sc_litter=5,OR(mgmt_weed_crntlvl_annual,mgmt_weed_monitorannual)),AE76,\n0)))","v":0},null,null,null,null,null,"ORGANIC LITTER","Maintenance gain =",{"$f":"\nIF(AND(mgmt_stock,mgmt_weed_crntlvl,mgmt_weed_1pct,mgmt_litter,sc_litter=0),AK74,\nIF(AND(mgmt_stock,mgmt_weed_crntlvl,mgmt_weed_1pct,mgmt_litter,sc_litter=2),AK75,\nIF(AND(mgmt_stock,mgmt_weed_crntlvl,mgmt_weed_1pct,mgmt_litter,sc_litter=3),AK76,\nIF(AND(mgmt_stock,mgmt_weed_crntlvl,mgmt_weed_1pct,mgmt_litter,sc_litter=4),AK77,\nIF(AND(mgmt_stock,mgmt_weed_crntlvl,mgmt_weed_1pct,mgmt_litter,sc_litter=5),AK78,\n0)))))","v":0},null,null,"Improvement gain =",{"$f":"\nIF(AND(mgmt_stock,mgmt_weed_crntlvl,mgmt_weed_1pct,mgmt_litter,mgmt_rabbits,mgmt_threats_all,sc_litter<=4),AP74,\nIF(AND(mgmt_stock,mgmt_weed_crntlvl,mgmt_weed_1pct,mgmt_litter,mgmt_rabbits,mgmt_threats_all,sc_litter=5),AP75,\n0))","v":0},null,null,null,null,null,"ORGANIC LITTER","Maintenance gain =","N/A",null,null,"Improvement gain =","N/A"]
[]
["Condition score Organic litter","Maintenance",null,null,null,"Condition score","Improvement",null,null,null,null,"Condition score","Additional commitment","Maintenance gain / ha ",null,null,"Condition score","Additional commitment","Improvement gain / ha",null,null,null,null,"Condition score","Additional commitment","Maintenance gain / ha ",null,null,"Condition score","Additional commitment","Improvement gain / ha",null,null,null,null,"Condition score","Maintenance gain / ha ",null,null,null,"Condition score","Improvement gain / ha"]
[null,"gain / ha",null,null,null,"Organic litter","gain / ha",null,null,null,null,"Organic litter",null,null,null,null,"Organic litter",null,null,null,null,null,null,"Organic litter",null,null,null,null,"Organic litter",null,null,null,null,null,null,"Organic litter",null,null,null,null,"Organic litter"]
[0,0,null,null,null,"0-4",2,null,null,null,null,0,"N/A",0,null,null,"0-4","A",1,null,null,null,null,0,"N/A",0,null,null,"0-4","A",1,null,null,null,null,0,0,null,null,null,"0-4",1]
[2,0.2,null,null,null,5,0,null,null,null,null,2,"A",1,null,null,null,"B",0.5,null,null,null,null,2,"A",1,null,null,null,"B",0.5,null,null,null,null,2,1,null,null,null,5,0]
[3,0.3,null,null,null,null,null,null,null,null,null,null,"B",0.5,null,null,5,"A OR B",0,null,null,null,null,null,"B",0.5,null,null,5,"A OR B",0,null,null,null,null,3,1.5]
[4,0.4,null,null,null,null,null,null,null,null,null,3,"A",1.5,null,null,null,null,null,null,null,null,null,3,"A",1.5,null,null,null,null,null,null,null,null,null,4,2]
[5,0.5,null,null,null,null,null,null,null,null,null,null,"B",0.75,null,null,null,null,null,null,null,null,null,null,"B",0.75,null,null,null,null,null,null,null,null,null,5,2.5]
[null,null,null,null,null,null,null,null,null,null,null,4,"A",2,null,null,null,null,null,null,null,null,null,4,"A",2]
[null,null,null,null,null,null,null,null,null,null,null,null,"B",1,null,null,null,null,null,null,null,null,null,null,"B",1]
[null,null,null,null,null,null,null,null,null,null,null,5,"A",2.5,null,null,null,null,null,null,null,null,null,5,"A",2.5]
[null,null,null,null,null,null,null,null,null,null,null,null,"B",1.25,null,null,null,null,null,null,null,null,null,null,"B",1.25]
[]
[]
["LOGS","Maintenance gain =",{"$f":"\nIF(AND(mgmt_log_retain,sc_canopy=0,sc_logs=0),C89,\nIF(AND(mgmt_log_retain,sc_canopy=0,sc_logs=2),C90,\nIF(AND(mgmt_log_retain,sc_canopy=0,sc_logs=3),C91,\nIF(AND(mgmt_log_retain,sc_canopy=0,sc_logs=4),C92,\nIF(AND(mgmt_log_retain,sc_canopy=0,sc_logs=5),C93,\nIF(AND(mgmt_log_retain,sc_canopy>=1,sc_logs=0),C94,\nIF(AND(mgmt_log_retain,sc_canopy>=1,sc_logs=2),C95,\nIF(AND(mgmt_log_retain,sc_canopy>=1,sc_logs=3),C96,\nIF(AND(mgmt_log_retain,sc_canopy>=1,sc_logs=4),C97,\nIF(AND(mgmt_log_retain,sc_canopy>=1,sc_logs=5),C98,\n0))))))))))","v":0},null,null,"Improvement gain =",{"$f":"\nIF(AND(mgmt_log_retain,mgmt_log_intro,sc_underst<=5,sc_logs<=3),H89,\nIF(AND(mgmt_log_retain,mgmt_log_intro,sc_underst<=5,sc_logs>=4),H90,\nIF(AND(mgmt_log_retain,mgmt_log_intro,sc_underst>=10,sc_logs>=0),H91,\n0)))","v":0},null,null,null,null,"LOGS","Maintenance gain =","N/A",null,null,"Improvement gain =","N/A",null,null,null,null,null,"LOGS","Maintenance gain =","N/A",null,null,"Improvement gain =","N/A",null,null,null,null,null,"LOGS","Maintenance gain =","N/A",null,null,"Improvement gain =","N/A",null,null,null,null,null,"LOGS","Maintenance gain =",{"$f":"\nIF(AND(mgmt_log_retain,_LogsExisting=\"<10%\"),AW88,\nIF(AND(mgmt_log_retain,_LogsExisting=\"< 50%, large logs absent\"),AW89,\nIF(AND(mgmt_log_retain,_LogsExisting=\"≥ 50%, large logs absent\"),AW90,\nIF(AND(mgmt_log_retain,_LogsExisting=\"< 50%, large logs present\"),AW91,\nIF(AND(mgmt_log_retain,_LogsExisting=\"≥ 50%, large logs present\"),AW92,\n0)))))","v":0},null,null,"Improvement gain =",{"$f":"IF(AND(mgmt_log_retain,mgmt_log_intro,_LogsIntroduced=\"> 10%\"),BB89,0)","v":0}]
[]
["Condition score",null,"Maintenance gain / ha",null,null,"Condition score",null,"Improvement gain / ha",null,null,null,"Not applicable",null,null,null,null,"Not applicable",null,null,null,null,null,null,"Not applicable",null,null,null,null,"Not applicable",null,null,null,null,null,null,"Not applicable",null,null,null,null,"Not applicable",null,null,null,null,null,null,"Length of logs as proportion of benchmark ","Maintenance gain / ha",null,null,null,"Length of logs as proportion of benchmark","Improvement gain / ha"]
["Tree canopy","Logs",null,null,null,"Understorey","Logs",null,null,null,null,null,null,null,null,null,null,null,null,null,null,null,null,null,null,null,null,null,null,null,null,null,null,null,null,null,null,null,null,null,null,null,null,null,null,null,null,"< 10%",0,null,null,null,"< 10%",0]
[0,0,0,null,null,"0-5","0-3",2,null,null,null,null,null,null,null,null,null,null,null,null,null,null,null,null,null,null,null,null,null,null,null,null,null,null,null,null,null,null,null,null,null,null,null,null,null,null,null,"< 50%, large logs absent",2,null,null,null,"> 10%",2]
[null,2,2,null,null,null,"4 or 5",0,null,null,null,null,null,null,null,null,null,null,null,null,null,null,null,null,null,null,null,null,null,null,null,null,null,null,null,null,null,null,null,null,null,null,null,null,null,null,null,"≥ 50%, large logs absent",3]
[null,3,3,null,null,"10-25","0-5",0,null,null,null,null,null,null,null,null,null,null,null,null,null,null,null,null,null,null,null,null,null,null,null,null,null,null,null,null,null,null,null,null,null,null,null,null,null,null,null,"< 50%, large logs present",4]
[null,4,4,null,null,null,null,null,null,null,null,null,null,null,null,null,null,null,null,null,null,null,null,null,null,null,null,null,null,null,null,null,null,null,null,null,null,null,null,null,null,null,null,null,null,null,null,"≥ 50%, large logs present",5]
[null,5,5]
["1-5",0,0.4]
[null,2,2.4,null,null,null,null,null,null,null,null,null,null,null,null,null,null,null,null,null,null,null,null,null,null,null,null,null,null,null,null,null,null,null,null,null,null,null,null,null,null,null,null,null,null,null,null,"LANDSCAPE CONTEXT","Maintenance gain =","N/A",null,null,"Improvement gain =",{"$f":"IF(mgmt_revegsize,BB98,0)","v":0}]
[null,3,3.4]
[null,4,4.4000000000000004,null,null,null,null,null,null,null,null,null,null,null,null,null,null,null,null,null,null,null,null,null,null,null,null,null,null,null,null,null,null,null,null,null,null,null,null,null,null,null,null,null,null,null,null,"Not applicable",null,null,null,null,"Minimum commitment","Improvement gain / ha"]
[null,5,5,null,null,null,null,null,null,null,null,null,null,null,null,null,null,null,null,null,null,null,null,null,null,null,null,null,null,null,null,null,null,null,null,null,null,null,null,null,null,null,null,null,null,null,null,null,null,null,null,null,"meet the minimum size requirements as outlined in Section 3.2.6",3]

{"sheet":"SCORES_Other","index":5,"n_rows":63,"n_cols":11,"rows_kept":63,"cut":false,"hidden":true,"merged":[[5,2,7,2],[5,1,6,1],[26,2,31,2],[26,3,31,3],[32,2,33,2],[32,3,33,3],[17,2,18,2],[17,3,18,3],[19,2,20,2],[19,3,20,3],[21,3,22,3],[21,2,22,2],[21,0,22,0],[17,0,20,0],[26,1,27,1],[32,1,33,1],[32,0,33,0],[17,1,18,1],[19,1,20,1],[21,1,22,1],[30,1,31,1],[28,1,29,1],[26,0,31,0]]}
[]
["PRIOR MANAGEMENT GAIN","Prior  management gain =",{"$f":"\nIF(AND(_landtenure=\"Freehold land\",_zonetype<>\"Revegetation\",_securitycurrent<>\"On-title agreement (requirement of funding)\"),0.1,\n0)","v":0.1}]
[]
["FREEHOLD LAND"]
["Current security existing on site","Prior management gain (/100)\n- Patch or Scattered tree","Prior management gain (/100)\n- Revegetation"]
["None","10% of current (standardised) habitat score","N/A"]
["On-title security agreement (voluntary, non-funded)"]
["On-title security agreement (requirement of funding)","N/A"]
[]
["CROWN LAND"]
["N/A. Prior Management gain is available only on freehold land and is not available on Crown land."]
[]
[]
["SECURITY GAIN","Security gain = ",{"$f":"\nIF(_landtenure=\"Crown land - conservation primary purpose\",0,\nIF(OR(_securityproposed=\"Sign Crown land offset MOU\",_securityproposed=\"Reclassify to 'conservation' AND sign offset MOU\"),0.1,\nIF(AND(_securitycurrent=\"None\",_securityproposed=\"On-title agreement\"),0.1,\nIF(AND(_securitycurrent=\"None\",OR(_securityproposed=\"Transfer to Crown (non-funded)\",_securityproposed=\"Transfer to Crown (funded)\")),0.2,\nIF(AND(_securitycurrent=\"On-title agreement (voluntary)\",_securityproposed=\"On-title agreement\"),0.1,\nIF(AND(_securitycurrent=\"On-title agreement (voluntary)\",OR(_securityproposed=\"Transfer to Crown (non-funded)\",_securityproposed=\"Transfer to Crown (funded)\")),0.2,\nIF(AND(_securitycurrent=\"On-title agreement (req. of funding)\",OR(_securityproposed=\"Transfer to Crown (non-funded)\",_securityproposed=\"Transfer to Crown (funded)\")),0.1,\n0)))))))","v":0}]
[]
["FREEHOLD LAND"]
["Current security existing on site","Minimum commitment to generate security gain","Security gain (/100)\n- Patch or Scattered tree","Security gain (/100)\n- Revegetation"]
["None OR On-title security agreement (voluntary, non-funded)","Registered on-title security agreement","10% of current (standardised) habitat score","10% of (standardised) sum of maintenance and improvement gain"]
[]
[null,"Transfer freehold land to the Crown ","20% of current (standardised) habitat score","20% of (standardised) sum of maintenance and improvement gain"]
[]
["On-title security agreement (requirement of funding)","Transfer freehold land to the Crown ","10% of current (standardised) habitat score","10% of (standardised) sum of maintenance and improvement gain"]
[]
[]
["CROWN LAND"]
["Current crown land category","Minimum commitment to generate security gain","Security gain (/100)\n- Patch or Large scattered tree","Security gain (/100)\n- Revegetation"]
["Crown land - multiple and other purposes","Reclassify to Crown land - conservation as primary purpose","10% of current (standardised) habitat score","10% of (standardised) sum of maintenance and improvement gain"]
[]
[null,"Sign Crown land offset agreement"]
[]
[null,"Reclassify to Crown land - conservation as primary purpose AND sign Crown land offset agreement"]
[]
["Crown land - conservation as primary purpose"," Sign Crown land offset agreement","N/A","N/A"]
[]
[]
[]
[]
["DEFAULT HABITAT SCORES"]
["used by macro if 'Use default scores' is selected to populate the condition scores"]
["TypeDescr",{"$f":"IFERROR((INDEX(EVC_data_table,Match_row,8)),1)","v":1}]
["BCS",{"$f":"IFERROR(INDEX(EVC_data_table,Match_row,6),1)","v":1}]
[]
["Large trees",{"$f":"\nIF(AND($B$40=\"Forest/Woodland\",B41=\"En\"),C54,\nIF(AND($B$40=\"Forest/Woodland\",B41=\"Vu\"),C55,\nIF(AND($B$40=\"Forest/Woodland\",B41=\"Ra\"),C56,\nIF(AND($B$40=\"Forest/Woodland\",B41=\"D\"),C57,\nIF(AND($B$40=\"Forest/Woodland\",B41=\"LC\"),C58,\nIF($B$40=\"scrubs/shrublands/mallee with logs\",C59,\nIF($B$40=\"scrubs/shrublands/mallee without logs\",C60,\nIF($B$40=\"heathlands\",C61,\nIF($B$40=\"grasslands\",C62,\nIF($B$40=\"wetlands\",C63,\n\"\"))))))))))","v":""}]
["Tree canopy cover",{"$f":"\nIF(AND($B$40=\"Forest/Woodland\",B41=\"En\"),D54,\nIF(AND($B$40=\"Forest/Woodland\",B41=\"Vu\"),D55,\nIF(AND($B$40=\"Forest/Woodland\",B41=\"Ra\"),D56,\nIF(AND($B$40=\"Forest/Woodland\",B41=\"D\"),D57,\nIF(AND($B$40=\"Forest/Woodland\",B41=\"LC\"),D58,\nIF($B$40=\"scrubs/shrublands/mallee with logs\",D59,\nIF($B$40=\"scrubs/shrublands/mallee without logs\",D60,\nIF($B$40=\"heathlands\",D61,\nIF($B$40=\"grasslands\",D62,\nIF($B$40=\"wetlands\",D63,\n\"\"))))))))))","v":""}]
["Understorey",{"$f":"\nIF(AND($B$40=\"Forest/Woodland\",B41=\"En\"),E54,\nIF(AND($B$40=\"Forest/Woodland\",B41=\"Vu\"),E55,\nIF(AND($B$40=\"Forest/Woodland\",B41=\"Ra\"),E56,\nIF(AND($B$40=\"Forest/Woodland\",B41=\"D\"),E57,\nIF(AND($B$40=\"Forest/Woodland\",B41=\"LC\"),E58,\nIF($B$40=\"scrubs/shrublands/mallee with logs\",E59,\nIF($B$40=\"scrubs/shrublands/mallee without logs\",E60,\nIF($B$40=\"heathlands\",E61,\nIF($B$40=\"grasslands\",E62,\nIF($B$40=\"wetlands\",E63,\n\"\"))))))))))","v":""}]
["Lack of weeds",{"$f":"\nIF(AND($B$40=\"Forest/Woodland\",B41=\"En\"),F54,\nIF(AND($B$40=\"Forest/Woodland\",B41=\"Vu\"),F55,\nIF(AND($B$40=\"Forest/Woodland\",B41=\"Ra\"),F56,\nIF(AND($B$40=\"Forest/Woodland\",B41=\"D\"),F57,\nIF(AND($B$40=\"Forest/Woodland\",B41=\"LC\"),F58,\nIF($B$40=\"scrubs/shrublands/mallee with logs\",F59,\nIF($B$40=\"scrubs/shrublands/mallee without logs\",F60,\nIF($B$40=\"heathlands\",F61,\nIF($B$40=\"grasslands\",F62,\nIF($B$40=\"wetlands\",F63,\n\"\"))))))))))","v":""}]
["Recruitment",{"$f":"\nIF(AND($B$40=\"Forest/Woodland\",B41=\"En\"),G54,\nIF(AND($B$40=\"Forest/Woodland\",B41=\"Vu\"),G55,\nIF(AND($B$40=\"Forest/Woodland\",B41=\"Ra\"),G56,\nIF(AND($B$40=\"Forest/Woodland\",B41=\"D\"),G57,\nIF(AND($B$40=\"Forest/Woodland\",B41=\"LC\"),G58,\nIF($B$40=\"scrubs/shrublands/mallee with logs\",G59,\nIF($B$40=\"scrubs/shrublands/mallee without logs\",G60,\nIF($B$40=\"heathlands\",G61,\nIF($B$40=\"grasslands\",G62,\nIF($B$40=\"wetlands\",G63,\n\"\"))))))))))","v":""}]
["Organic litter",{"$f":"\nIF(AND($B$40=\"Forest/Woodland\",B41=\"En\"),H54,\nIF(AND($B$40=\"Forest/Woodland\",B41=\"Vu\"),H55,\nIF(AND($B$40=\"Forest/Woodland\",B41=\"Ra\"),H56,\nIF(AND($B$40=\"Forest/Woodland\",B41=\"D\"),H57,\nIF(AND($B$40=\"Forest/Woodland\",B41=\"LC\"),H58,\nIF($B$40=\"scrubs/shrublands/mallee with logs\",H59,\nIF($B$40=\"scrubs/shrublands/mallee without logs\",H60,\nIF($B$40=\"heathlands\",H61,\nIF($B$40=\"grasslands\",H62,\nIF($B$40=\"wetlands\",H63,\n\"\"))))))))))","v":""}]
["Logs",{"$f":"\nIF(AND($B$40=\"Forest/Woodland\",B41=\"En\"),I54,\nIF(AND($B$40=\"Forest/Woodland\",B41=\"Vu\"),I55,\nIF(AND($B$40=\"Forest/Woodland\",B41=\"Ra\"),I56,\nIF(AND($B$40=\"Forest/Woodland\",B41=\"D\"),I57,\nIF(AND($B$40=\"Forest/Woodland\",B41=\"LC\"),I58,\nIF($B$40=\"scrubs/shrublands/mallee with logs\",I59,\nIF($B$40=\"scrubs/shrublands/mallee without logs\",I60,\nIF($B$40=\"heathlands\",I61,\nIF($B$40=\"grasslands\",I62,\nIF($B$40=\"wetlands\",I63,\n\"\"))))))))))","v":""}]
["EVC standardiser",{"$f":"\nIF(AND($B$40=\"Forest/Woodland\",B41=\"En\"),J54,\nIF(AND($B$40=\"Forest/Woodland\",B41=\"Vu\"),J55,\nIF(AND($B$40=\"Forest/Woodland\",B41=\"Ra\"),J56,\nIF(AND($B$40=\"Forest/Woodland\",B41=\"D\"),J57,\nIF(AND($B$40=\"Forest/Woodland\",B41=\"LC\"),J58,\nIF($B$40=\"scrubs/shrublands/mallee with logs\",J59,\nIF($B$40=\"scrubs/shrublands/mallee without logs\",J60,\nIF($B$40=\"heathlands\",J61,\nIF($B$40=\"grasslands\",J62,\nIF($B$40=\"wetlands\",J63,\n\"\"))))))))))","v":""}]
["Landscape context",{"$f":"\nIF(AND($B$40=\"Forest/Woodland\",B41=\"En\"),K54,\nIF(AND($B$40=\"Forest/Woodland\",B41=\"Vu\"),K55,\nIF(AND($B$40=\"Forest/Woodland\",B41=\"Ra\"),K56,\nIF(AND($B$40=\"Forest/Woodland\",B41=\"D\"),K57,\nIF(AND($B$40=\"Forest/Woodland\",B41=\"LC\"),K58,\nIF($B$40=\"scrubs/shrublands/mallee with logs\",K59,\nIF($B$40=\"scrubs/shrublands/mallee without logs\",K60,\nIF($B$40=\"heathlands\",K61,\nIF($B$40=\"grasslands\",K62,\nIF($B$40=\"wetlands\",K63,\n\"\"))))))))))","v":""}]
[]
["TypeDescr","BCS","Large trees","Tree canopy cover","Understorey","Lack of weeds","Recruitment","Organic litter","Logs","EVC standardiser","Landscape context"]
["Forest/Woodland","Endangered",4,3,10,7,3,3,2,1,13]
["Forest/Woodland","Vulnerable",5,5,10,9,6,5,2,1,18]
["Forest/Woodland","Rare",5,5,10,9,6,5,2,1,18]
["Forest/Woodland","Depleted",5,5,15,11,6,5,3,1,20]
["Forest/Woodland","Least Concern",5,5,15,11,6,5,3,1,20]
["scrubs/shrublands/mallee with logs","all",null,4,10,7,6,5,3,1.1499999999999999,15]
["scrubs/shrublands/mallee without logs","all",null,4,10,7,6,5,null,1.25,15]
["heathlands","all",null,null,20,13,6,5,null,1.36,20]
["grasslands","all",null,null,10,7,6,3,null,1.36,10]
["wetlands","all",null,null,10,7,6,3,null,1.36,10]

{"sheet":"EVC_data","index":6,"n_rows":1260,"n_cols":64,"rows_kept":1260,"cut":false,"hidden":true,"merged":[]}
["BIOREGION","BIOREGCODE","EVCNAME","BIOEVC","STANDARDSR","BCS1","BCS2","TypeDesc","Vegetation type for gain","MatchColumn","LTDBH","LTCOUNT","TCHEIGHT","TCCOVER","ITCOUNT","ITCOVER","TCOUNT","TCOVER","MTCOUNT","MTCOVER","MSCOUNT","MSCOVER","SSCOUNT","SSCOVER","PSCOUNT","PSCOVER","LHCOUNT","LHCOVER","MHCOUNT","MHCOVER","SHCOUNT","SHCOVER","LTGCOUNT","LTGCOVER","LNGCOUNT","LNGCOVER","MTGCOUNT","MTGCOVER","MNGCOUNT","MNGCOVER","TTGCOUNT","TTGCOVER","HGCOUNT","HGCOVER","GFCOUNT","GFCOVER","TFCOUNT","TFCOVER","EPCOUNT","EPCOVER","SCCOUNT","SCCOVER","BLCOUNT","BLCOVER","S_CCOUNT","S_CCOVER","RECRUITTYP","RECRUITFRQ","BCHMARKLF","WOODYSPEC","HERBSPEC","WOODYCOVER","OLCOVER","LOGSMHA"]
["Bridgewater","Brid","Coastal Alkaline Scrub","Brid0858",1.1499999999999999,"LC","Least Concern","scrubs/shrublands/mallee with logs","Woody",{"$f":"CONCATENATE(A2,C2)","v":"BridgewaterCoastal Alkaline Scrub"},"0",20,0,null,null,null,null,null,null,null,4,30,null,null,null,null,3,5,2,1,2,10,1,5,null,null,3,5,2,30,null,null,null,null,null,null,null,null,null,null,2,1,0,20,null,null,"Continuous",0,9,4,7,30,40,50]
["Bridgewater","Brid","Coastal Dune Scrub","Brid0160",1.36,"LC","Least Concern","heathlands","Woody",{"$f":"CONCATENATE(A3,C3)","v":"BridgewaterCoastal Dune Scrub"},"0",0,0,null,null,null,null,null,null,null,7,50,1,1,null,null,3,5,7,15,3,10,null,null,null,null,2,15,2,5,null,null,null,null,null,null,null,null,null,null,3,5,0,10,null,null,"Episodic",30,9,8,13,51,40,0]
["Bridgewater","Brid","Coastal Headland Scrub","Brid0161",1.36,"V","Vulnerable","heathlands","Woody","BridgewaterCoastal Headland Scrub","0",0,0,null,null,null,null,null,null,null,7,50,null,null,null,null,2,1,4,5,2,5,1,1,null,null,4,10,2,5,null,null,null,null,null,null,null,null,null,null,2,5,0,10,"0","10","Continuous",0,10,7,8,50,40,0]
["Bridgewater","Brid","Coastal Saltmarsh","Brid0009",1.36,"V","Vulnerable","grasslands","Non-woody wetland","BridgewaterCoastal Saltmarsh","0",0,0,null,null,null,null,null,null,null,1,10,1,5,null,null,null,null,3,15,null,null,null,null,1,5,null,null,1,5,null,null,null,null,null,null,null,null,null,null,null,null,null,null,"0","10","Continuous",0,6,2,3,15,10,0]
["Bridgewater","Brid","Damp Sands Herb-rich Woodland","Brid0003",1,"V","Vulnerable","Forest/Woodland","Woody","BridgewaterDamp Sands Herb-rich Woodland","70",15,15,15,0,5,2,10,null,null,4,5,3,5,2,5,3,5,10,15,3,5,2,10,1,15,7,15,3,5,null,null,null,null,1,5,null,null,null,null,2,1,0,10,null,null,"Continuous",0,15,9,16,20,40,150]
["Bridgewater","Brid","Deep Freshwater Marsh","Brid0681",1.36,"V","Vulnerable","wetlands","Non-woody wetland","BridgewaterDeep Freshwater Marsh","0",null,0,null,null,null,null,null,null,null,null,null,null,null,null,null,null,null,null,null,null,null,null,null,null,null,null,null,null,null,null,null,null,null,null,null,null,null,null,null,null,null,null,null,null,null,null,0,0,null,null,null,null,0]
["Bridgewater","Brid","Estuarine Wetland","Brid0010",1.36,"E","Endangered","wetlands","Non-woody wetland","BridgewaterEstuarine Wetland","0",0,0,null,null,null,null,null,null,null,null,null,null,null,null,null,null,null,2,50,1,10,1,10,1,5,null,null,3,30,null,null,null,null,null,null,null,null,null,null,null,null,null,null,null,null,"Episodic",5,5,null,3,null,10,0]
["Bridgewater","Brid","Freshwater Meadow","Brid0680",1.36,"E","Endangered","wetlands","Non-woody wetland","BridgewaterFreshwater Meadow","0",null,0,null,null,null,null,null,null,null,null,null,null,null,null,null,null,null,null,null,null,null,null,null,null,null,null,null,null,null,null,null,null,null,null,null,null,null,null,null,null,null,null,null,null,null,null,0,0,null,null,null,null,0]
["Bridgewater","Brid","Herb-rich Foothill Forest","Brid0023",1,"V","Vulnerable","Forest/Woodland","Woody","BridgewaterHerb-rich Foothill Forest","70",20,25,40,0,5,2,10,null,null,5,15,1,1,1,1,3,5,10,20,5,5,3,5,1,5,10,20,2,10,null,null,null,null,3,10,null,null,null,null,2,0,0,20,null,null,"Continuous",0,15,8,18,26,40,200]
["Bridgewater","Brid","Shallow Freshwater Marsh","Brid0200",1.36,"E","Endangered","wetlands","Non-woody wetland","BridgewaterShallow Freshwater Marsh","0",null,0,null,null,null,null,null,null,null,null,null,null,null,null,null,null,null,null,null,null,null,null,null,null,null,null,null,null,null,null,null,null,null,null,null,null,null,null,null,null,null,null,null,null,null,null,0,0,null,null,null,null,0]
["Bridgewater","Brid","Spray-zone Coastal Shrubland","Brid0876",1.36,"R","Rare","grasslands","Woody","BridgewaterSpray-zone Coastal Shrubland","0",0,0,null,null,null,null,null,null,null,1,1,2,10,null,null,null,null,4,10,1,1,null,null,null,null,1,1,null,null,null,null,null,null,null,null,null,null,null,null,null,null,0,10,"0","10","Continuous",0,7,3,5,11,0,0]
["Bridgewater","Brid","Swamp Scrub","Brid0053",1.25,"E","Endangered","scrubs/shrublands/mallee without logs","Woody","BridgewaterSwamp Scrub","0",0,0,null,null,null,null,null,null,null,2,10,1,1,null,null,5,5,9,15,3,10,2,15,2,5,4,15,3,15,null,null,null,null,2,5,null,null,null,null,1,5,0,20,null,null,"Continuous",0,12,3,17,11,40,0]
["Central Victorian Uplands","CVU","Alluvial Terraces Herb-rich Woodland","CVU_0067",1,"E","Endangered","Forest/Woodland","Woody","Central Victorian UplandsAlluvial Terraces Herb-rich Woodland","70",10,15,15,0,5,2,15,null,null,2,5,null,null,null,null,2,5,9,20,3,15,1,1,null,null,8,10,2,10,null,null,null,null,null,null,null,null,null,null,null,null,0,10,"0","10","Continuous",0,11,4,14,20,10,150]
["Central Victorian Uplands","CVU","Blackthorn Scrub","CVU_0027",1.25,"R","Rare","scrubs/shrublands/mallee without logs","Woody","Central Victorian UplandsBlackthorn Scrub","0",0,0,null,null,null,null,null,null,null,null,null,null,null,null,null,null,null,null,null,null,null,null,null,null,null,null,null,null,null,null,null,null,null,null,null,null,null,null,null,null,null,null,null,null,null,null,0,0,null,null,null,0,0]
["Central Victorian Uplands","CVU","Box Ironbark Forest","CVU_0061",1,"V","Vulnerable","Forest/Woodland","Woody","Central Victorian UplandsBox Ironbark Forest","30/70",15,20,30,0,5,1,5,null,null,6,25,2,5,1,1,2,1,5,10,1,1,1,5,null,null,7,15,null,null,null,null,null,null,null,null,null,null,null,null,null,null,0,10,"0","10","Continuous",0,12,9,8,35,20,200]
["Central Victorian Uplands","CVU","Clay Heathland","CVU_0007",1.36,"V","Vulnerable","heathlands","Woody","Central Victorian UplandsClay Heathland","0",0,0,null,null,null,null,null,null,null,9,30,6,10,3,5,null,null,8,10,null,null,4,10,1,5,7,10,2,5,null,null,null,null,null,null,null,null,null,null,null,null,0,10,"0","10","Episodic",30,10,15,8,40,20,0]
["Central Victorian Uplands","CVU","Clay Heathland - treed","CVU_0007_61",1,"V","Vulnerable","heathlands","Woody","Central Victorian UplandsClay Heathland - treed","40",10,8,10,null,null,null,null,null,null,9,30,6,10,3,5,null,null,8,10,null,null,4,10,1,5,7,10,2,5,null,null,null,null,null,null,null,null,null,null,null,null,0,10,"0","10","Episodic",30,10,15,8,40,20,50]
["Central Victorian Uplands","CVU","Creekline Grassy Woodland","CVU_0068",1,"E","Endangered","Forest/Woodland","Woody","Central Victorian UplandsCreekline Grassy Woodland","80",15,15,15,0,5,1,5,null,null,4,10,3,5,null,null,2,5,9,15,3,5,3,15,1,5,15,30,3,5,null,null,null,null,null,null,null,null,null,null,null,null,0,10,null,null,"Continuous",0,12,8,14,20,40,300]
["Central Victorian Uplands","CVU","Creekline Herb-rich Woodland","CVU_0164",1,"V","Vulnerable","Forest/Woodland","Woody","Central Victorian UplandsCreekline Herb-rich Woodland","70",10,15,15,0,5,2,5,null,null,3,15,1,5,1,1,1,0,6,20,1,5,1,20,1,5,2,5,1,5,null,null,null,null,2,0,null,null,null,null,null,null,0,20,null,null,"Continuous",0,14,6,8,25,20,100]
["Central Victorian Uplands","CVU","Damp Forest","CVU_0029",1,"LC","Least Concern","Forest/Woodland","Woody","Central Victorian UplandsDamp Forest","90",20,30,40,0,5,3,15,null,null,3,10,null,null,1,5,1,1,11,20,2,5,3,10,1,5,3,10,1,5,null,null,null,null,4,20,"1","5",null,null,1,5,0,20,null,null,"Continuous",0,15,6,14,25,50,300]
["Central Victorian Uplands","CVU","Damp Sands Herb-rich Woodland","CVU_0003",1,"E","Endangered","Forest/Woodland","Woody","Central Victorian UplandsDamp Sands Herb-rich Woodland","70",15,15,15,0,5,2,10,null,null,3,10,3,5,null,null,null,null,16,20,7,15,1,10,null,null,10,15,2,10,null,null,null,null,1,10,null,null,null,null,null,null,0,10,null,null,"Continuous",0,11,8,23,25,40,150]
["Central Victorian Uplands","CVU","Escarpment Shrubland","CVU_0895",1.1499999999999999,"E","Endangered","Forest/Woodland","Woody","Central Victorian UplandsEscarpment Shrubland","0",0,0,null,null,null,null,null,null,null,3,10,2,5,null,null,3,5,4,10,5,5,1,5,1,5,9,25,3,5,null,null,null,null,1,5,null,null,null,null,1,5,0,10,"0","10","Continuous",0,13,5,12,15,20,50]
["Central Victorian Uplands","CVU","Escarpment Shrubland - treed","CVU_0895_61",1,"E","Endangered","Forest/Woodland","Woody","Central Victorian UplandsEscarpment Shrubland - treed","70",15,0,0,0,5,3,10,null,null,3,10,2,5,null,null,3,5,4,10,5,5,1,5,1,5,9,25,3,5,null,null,null,null,1,5,null,null,null,null,1,5,0,10,"0","10","Continuous",0,15,8,12,25,20,150]
["Central Victorian Uplands","CVU","Floodplain Riparian Woodland","CVU_0056",1,"E","Endangered","Forest/Woodland","Woody","Central Victorian UplandsFloodplain Riparian Woodland","80",15,20,15,0,5,2,10,null,null,6,15,1,1,null,null,4,10,4,10,1,1,3,10,2,10,3,10,3,10,null,null,null,null,1,5,null,null,null,null,1,5,0,10,null,null,"Episodic",10,14,9,9,26,40,300]
["Central Victorian Uplands","CVU","Granitic Grassy Woodland","CVU_0175_62",1,"E","Endangered","Forest/Woodland","Woody","Central Victorian UplandsGranitic Grassy Woodland","70",15,15,15,0,5,2,10,null,null,2,15,1,1,1,1,null,null,8,20,3,10,1,1,null,null,8,40,1,5,null,null,null,null,1,5,null,null,null,null,null,null,0,10,null,null,"Continuous",0,12,5,11,26,20,150]
["Central Victorian Uplands","CVU","Granitic Hills Woodland","CVU_0072",1,"D","Depleted","Forest/Woodland","Woody","Central Victorian UplandsGranitic Hills Woodland","60",15,10,15,0,5,2,10,null,null,5,5,null,null,null,null,4,10,9,15,2,5,null,null,null,null,11,20,2,1,null,null,null,null,2,5,null,null,null,null,2,1,0,10,"0","10","Continuous",0,12,7,15,15,20,150]
["Central Victorian Uplands","CVU","Grassy Dry Forest","CVU_0022",1,"D","Depleted","Forest/Woodland","Woody","Central Victorian UplandsGrassy Dry Forest","70",20,20,30,0,5,1,5,null,null,3,10,3,5,1,1,3,5,7,20,2,5,1,5,null,null,7,30,1,1,null,null,null,null,1,1,null,null,null,null,1,1,0,10,"0","10","Continuous",0,15,7,12,20,20,200]
["Central Victorian Uplands","CVU","Grassy Forest","CVU_0128",1,"V","Vulnerable","Forest/Woodland","Woody","Central Victorian UplandsGrassy Forest","70",20,20,30,0,5,2,10,null,null,3,10,4,5,2,1,3,5,10,15,null,null,1,5,null,null,9,30,null,null,null,null,null,null,1,0,null,null,null,null,2,1,0,10,null,null,"Continuous",0,12,9,13,25,20,200]
["Central Victorian Uplands","CVU","Grassy Woodland","CVU_0175_61",1,"E","Endangered","Forest/Woodland","Woody","Central Victorian UplandsGrassy Woodland","70",15,15,15,0,5,1,5,null,null,2,15,1,1,1,1,null,null,8,20,3,10,null,null,null,null,8,40,1,1,null,null,null,null,null,null,null,null,null,null,null,null,0,10,null,null,"Continuous",0,10,4,11,21,20,150]
["Central Victorian Uplands","CVU","Heathy Dry Forest","CVU_0020",1,"LC","Least Concern","Forest/Woodland","Woody","Central Victorian UplandsHeathy Dry Forest","60",20,20,30,0,5,null,null,null,null,6,30,5,20,1,1,null,null,3,5,null,null,1,5,null,null,4,20,null,null,null,null,null,null,null,null,null,null,null,null,null,null,0,10,"0","10","Episodic",20,9,11,3,50,20,200]
["Central Victorian Uplands","CVU","Heathy Woodland","CVU_0048",1,"D","Depleted","Forest/Woodland","Woody","Central Victorian UplandsHeathy Woodland","60",15,10,15,0,5,null,null,null,null,7,40,6,20,1,1,null,null,4,5,null,null,2,10,1,5,4,10,null,null,null,null,null,null,1,1,null,null,"1","0",null,null,0,10,"0","10","Episodic",20,12,13,4,60,40,150]
["Central Victorian Uplands","CVU","Herb-rich Foothill Forest","CVU_0023",1,"D","Depleted","Forest/Woodland","Woody","Central Victorian UplandsHerb-rich Foothill Forest","70",20,25,40,0,5,2,10,null,null,3,5,2,1,1,1,4,5,11,25,3,5,2,5,1,5,6,20,2,5,null,null,null,null,2,10,null,null,null,null,3,5,0,20,null,null,"Continuous",0,15,7,18,16,40,200]
["Central Victorian Uplands","CVU","Hillcrest Herb-rich Woodland","CVU_0070",1,"D","Depleted","Forest/Woodland","Woody","Central Victorian UplandsHillcrest Herb-rich Woodland","70",15,10,15,0,5,2,5,null,null,2,5,1,1,1,1,4,10,14,20,2,5,1,0,null,null,9,20,3,5,"3","5",null,null,1,5,null,null,null,null,2,1,0,10,null,null,"Continuous",0,15,5,20,11,20,150]
["Central Victorian Uplands","CVU","Hills Herb-rich Woodland","CVU_0071",1,"V","Vulnerable","Forest/Woodland","Woody","Central Victorian UplandsHills Herb-rich Woodland","70",15,15,15,0,5,1,5,null,null,4,10,2,1,1,1,1,5,4,5,null,null,1,1,null,null,8,25,3,5,null,null,null,null,null,null,null,null,null,null,null,null,0,10,"0","10","Continuous",0,12,7,5,16,20,150]
["Central Victorian Uplands","CVU","Lowland Forest","CVU_0016",1,"LC","Least Concern","Forest/Woodland","Woody","Central Victorian UplandsLowland Forest","70",20,20,30,0,5,2,10,null,null,6,20,5,15,2,5,2,5,7,20,1,1,2,5,1,10,6,20,2,1,null,null,null,null,null,null,null,null,null,null,null,null,0,10,null,null,"Continuous",0,13,13,10,45,40,200]
["Central Victorian Uplands","CVU","Montane Grassy Woodland","CVU_0037",1,"V","Vulnerable","Forest/Woodland","Woody","Central Victorian UplandsMontane Grassy Woodland","50",15,10,20,0,5,1,5,null,null,6,20,3,10,2,5,2,5,15,20,3,10,2,5,null,null,7,20,1,1,null,null,null,null,1,1,null,null,null,null,1,0,0,10,"0","10","Continuous",0,15,10,20,35,20,150]
["Central Victorian Uplands","CVU","Mountain Valley Riparian Woodland","CVU_1085",1,"V","Vulnerable","Forest/Woodland","Woody","Central Victorian UplandsMountain Valley Riparian Woodland","0",0,0,null,null,null,null,null,null,null,null,null,null,null,null,null,null,null,null,null,null,null,null,null,null,null,null,null,null,null,null,null,null,null,null,null,null,null,null,null,null,null,null,null,null,null,null,0,0,null,null,null,0,0]
["Central Victorian Uplands","CVU","Plains Grassland","CVU_0132",1.36,"E","Endangered","grasslands","Other grassland","Central Victorian UplandsPlains Grassland","0",0,0,null,null,null,null,null,null,null,null,null,1,1,null,null,3,10,10,20,3,5,1,5,null,null,13,50,4,10,null,null,null,null,null,null,null,null,null,null,null,null,0,10,"0","10","Episodic",5,9,1,16,1,10,0]
["Central Victorian Uplands","CVU","Plains Grassy Wetland","CVU_0125",1.36,"E","Endangered","wetlands","Non-woody wetland","Central Victorian UplandsPlains Grassy Wetland","0",0,0,null,null,null,null,null,null,null,null,null,null,null,null,null,5,5,6,10,3,10,3,15,1,5,8,30,2,10,null,null,null,null,null,null,null,null,null,null,null,null,0,10,null,null,"Episodic",5,8,null,14,null,20,0]
["Central Victorian Uplands","CVU","Plains Grassy Woodland","CVU_0055",1,"E","Endangered","Forest/Woodland","Woody","Central Victorian UplandsPlains Grassy Woodland","80",15,15,15,0,5,3,10,null,null,3,5,4,10,2,5,null,null,9,20,4,5,2,10,1,5,6,25,2,5,null,null,null,null,1,1,null,null,null,null,null,null,0,10,null,null,"Continuous",0,13,10,13,25,10,100]
["Central Victorian Uplands","CVU","Plains Sedgy Wetland","CVU_0647",1.36,"E","Endangered","wetlands","Non-woody wetland","Central Victorian UplandsPlains Sedgy Wetland","0",0,0,null,null,null,null,null,null,null,null,null,null,null,null,null,2,5,5,40,5,10,2,5,1,5,4,25,2,5,null,null,null,null,null,null,null,null,null,null,null,null,null,null,null,null,"Episodic",5,7,null,12,null,10,50]
["Central Victorian Uplands","CVU","Plains Woodland","CVU_0803",1,"E","Endangered","Forest/Woodland","Woody","Central Victorian UplandsPlains Woodland","70",15,15,15,0,5,null,null,null,null,2,5,2,5,1,1,1,1,20,20,4,10,1,1,1,1,16,45,3,5,null,null,null,null,null,null,null,null,null,null,null,null,0,10,"0","10","Continuous",0,13,4,25,10,10,100]
["Central Victorian Uplands","CVU","Red Gum Swamp","CVU_0292",1,"E","Endangered","Forest/Woodland","Woody","Central Victorian UplandsRed Gum Swamp","80",10,15,15,0,5,null,null,null,null,null,null,null,null,null,null,2,10,7,25,3,15,2,15,null,null,6,20,2,15,null,null,null,null,null,null,null,null,null,null,null,null,null,null,null,null,"Episodic",5,7,null,12,null,10,100]
["Central Victorian Uplands","CVU","Riparian Forest","CVU_0018",1,"V","Vulnerable","Forest/Woodland","Woody","Central Victorian UplandsRiparian Forest","80",20,30,40,0,5,3,15,null,null,5,20,null,null,1,1,2,5,11,20,2,5,4,15,2,5,4,10,2,5,null,null,null,null,4,15,"1","5",null,null,2,5,0,20,null,null,"Continuous",0,15,8,15,35,50,300]
["Central Victorian Uplands","CVU","Riparian Scrub","CVU_0191",1.25,"E","Endangered","scrubs/shrublands/mallee without logs","Woody","Central Victorian UplandsRiparian Scrub","0",0,0,null,null,null,null,null,null,null,3,20,null,null,null,null,4,10,8,10,4,5,3,20,2,5,5,10,3,10,null,null,null,null,null,null,null,null,null,null,1,5,0,20,null,null,"Continuous",0,10,3,16,20,40,0]
["Central Victorian Uplands","CVU","Riparian Shrubland","CVU_0019",1.25,"E","Endangered","scrubs/shrublands/mallee without logs","Woody","Central Victorian UplandsRiparian Shrubland","0",0,0,null,null,null,null,null,null,null,9,30,null,null,null,null,null,null,2,5,null,null,1,10,null,null,4,5,1,1,null,null,null,null,4,10,"2","1",null,null,2,5,0,20,null,null,"Continuous",0,9,9,2,30,40,50]
["Central Victorian Uplands","CVU","Riparian Woodland","CVU_0641",1,"E","Endangered","Forest/Woodland","Woody","Central Victorian UplandsRiparian Woodland","80",15,15,20,0,5,2,15,null,null,3,10,1,1,null,null,4,15,5,10,1,5,3,10,1,5,4,20,2,5,null,null,null,null,null,null,null,null,null,null,1,5,0,10,null,null,"Continuous",0,13,6,10,26,30,200]
["Central Victorian Uplands","CVU","Riverine Escarpment Scrub","CVU_0082",1.25,"E","Endangered","scrubs/shrublands/mallee without logs","Woody","Central Victorian UplandsRiverine Escarpment Scrub","0",0,0,null,0,5,null,null,null,null,8,30,2,1,1,1,2,5,12,20,3,5,4,15,null,null,3,10,2,5,null,null,null,null,3,10,null,null,null,null,1,5,0,10,null,null,"Continuous",0,13,10,17,31,40,50]
["Central Victorian Uplands","CVU","Rocky Chenopod Woodland","CVU_0064",1,"V","Vulnerable","Forest/Woodland","Woody","Central Victorian UplandsRocky Chenopod Woodland","60",10,8,10,null,null,1,5,null,null,5,10,2,1,null,null,null,null,4,5,3,5,null,null,null,null,3,10,null,null,null,null,null,null,null,null,null,null,null,null,1,1,0,10,"0","20","Continuous",0,9,8,7,16,10,100]
["Central Victorian Uplands","CVU","Rocky Outcrop Shrubland","CVU_0028",1.36,"LC","Least Concern","heathlands","Woody","Central Victorian UplandsRocky Outcrop Shrubland","0",0,0,null,null,null,null,null,null,null,7,25,2,5,null,null,2,5,5,5,2,1,2,5,null,null,4,10,null,null,null,null,null,null,2,5,null,null,null,null,null,null,0,20,"0","10","Continuous",0,10,9,9,30,40,0]
["Central Victorian Uplands","CVU","Sand Forest","CVU_0134",1,"E","Endangered","Forest/Woodland","Woody","Central Victorian UplandsSand Forest","70",15,20,30,0,5,1,5,null,null,3,5,1,5,2,5,null,null,2,5,null,null,1,1,null,null,7,15,2,1,null,null,null,null,1,50,null,null,null,null,null,null,0,10,null,null,"Continuous",0,11,5,2,15,40,150]
["Central Victorian Uplands","CVU","Sand Heathland","CVU_0006",1.36,"LC","Least Concern","heathlands","Woody","Central Victorian UplandsSand Heathland","0",0,0,null,null,null,null,null,null,null,6,30,8,20,3,5,null,null,3,5,2,5,2,10,1,5,6,15,1,1,null,null,null,null,1,1,null,null,null,null,3,5,0,10,"0","10","Episodic",30,13,14,5,50,20,150]
["Central Victorian Uplands","CVU","Sand Heathland - treed","CVU_0006_61",1,"LC","Least Concern","heathlands","Woody","Central Victorian UplandsSand Heathland - treed","50",15,5,10,0,5,null,null,null,null,6,30,8,20,3,5,null,null,3,5,2,5,2,10,1,5,6,15,1,1,null,null,null,null,1,1,null,null,null,null,3,5,0,10,"0","10","Episodic",30,14,14,5,50,20,150]
["Central Victorian Uplands","CVU","Scoria Cone Woodland","CVU_0894",1,"E","Endangered","Forest/Woodland","Woody","Central Victorian UplandsScoria Cone Woodland","50/70",15,15,15,0,5,1,5,null,null,2,10,null,null,null,null,3,5,6,10,3,5,1,15,null,null,4,15,1,5,null,null,null,null,2,20,null,null,null,null,null,null,0,10,"0","10","Continuous",0,12,3,12,15,20,100]
["Central Victorian Uplands","CVU","Seasonally Inundated Shrubby Woodland","CVU_0195",1,"D","Depleted","Forest/Woodland","Woody","Central Victorian UplandsSeasonally Inundated Shrubby Woodland","70",15,15,15,0,5,null,null,null,null,7,30,3,10,1,1,2,5,3,10,1,1,null,null,null,null,5,15,3,10,null,null,null,null,null,null,null,null,null,null,null,null,0,10,"0","10","Continuous",0,11,10,6,40,30,150]
["Central Victorian Uplands","CVU","Sedge Wetland","CVU_0136",1.36,"V","Vulnerable","wetlands","Non-woody wetland","Central Victorian UplandsSedge Wetland","0",0,0,null,null,null,null,null,null,null,null,null,null,null,null,null,2,5,null,null,null,null,1,1,2,40,1,5,1,5,null,null,null,null,null,null,null,null,null,null,null,null,null,null,null,null,"Episodic",5,5,null,2,null,0,0]
["Central Victorian Uplands","CVU","Sedgy Riparian Woodland","CVU_0198",1,"D","Depleted","Forest/Woodland","Woody","Central Victorian UplandsSedgy Riparian Woodland","70",15,15,20,0,5,1,10,null,null,4,20,2,5,null,null,1,1,7,10,2,5,3,30,2,10,7,10,2,15,null,null,null,null,1,5,null,null,null,null,null,null,0,10,null,null,"Continuous",0,13,7,10,35,30,200]
["Central Victorian Uplands","CVU","Shallow Sands Woodland","CVU_0882",1,"V","Vulnerable","Forest/Woodland","Woody","Central Victorian UplandsShallow Sands Woodland","70",15,15,15,0,5,1,5,null,null,5,20,6,15,3,5,3,5,19,20,4,5,2,5,null,null,13,20,4,5,null,null,null,null,null,null,null,null,null,null,null,null,0,10,"0","10","Continuous",0,13,12,26,40,20,150]
["Central Victorian Uplands","CVU","Shrubby Dry Forest","CVU_0021",1,"LC","Least Concern","Forest/Woodland","Woody","Central Victorian UplandsShrubby Dry Forest","70",20,25,30,0,5,1,5,null,null,4,20,3,10,1,1,1,1,2,5,null,null,1,15,null,null,2,10,null,null,null,null,null,null,null,null,null,null,null,null,null,null,0,10,"0","10","Episodic",20,11,8,3,35,20,200]
["Central Victorian Uplands","CVU","Shrubby Foothill Forest","CVU_0045",1,"LC","Least Concern","Forest/Woodland","Woody","Central Victorian UplandsShrubby Foothill Forest","70",20,25,40,0,5,1,5,null,null,5,20,3,10,2,5,1,1,7,15,null,null,2,5,1,15,5,20,1,5,null,null,null,null,2,10,null,null,null,null,1,1,0,10,"0","10","Episodic",30,15,9,8,35,40,200]
["Central Victorian Uplands","CVU","Shrubby Woodland","CVU_0282",1,"R","Rare","Forest/Woodland","Woody","Central Victorian UplandsShrubby Woodland","80",15,15,20,0,5,1,5,null,null,2,30,3,15,null,null,null,null,2,1,null,null,1,5,null,null,1,1,null,null,null,null,null,null,null,null,null,null,null,null,null,null,0,10,null,null,"Continuous",0,8,6,2,50,20,150]
["Central Victorian Uplands","CVU","Spring Soak Woodland","CVU_0080",1,"E","Endangered","Forest/Woodland","Woody","Central Victorian UplandsSpring Soak Woodland","50",5,10,15,0,5,1,5,null,null,3,10,3,5,null,null,2,5,10,25,null,null,1,1,1,5,15,25,2,5,null,null,null,null,1,5,null,null,null,null,null,null,0,20,null,null,"Continuous",0,12,7,12,20,20,50]
["Central Victorian Uplands","CVU","Stream Bank Shrubland","CVU_0851",1,"V","Vulnerable","Forest/Woodland","Woody","Central Victorian UplandsStream Bank Shrubland","80",15,20,10,0,5,1,10,null,null,10,40,null,null,null,null,4,5,9,20,2,5,3,15,null,null,3,10,2,10,null,null,null,null,1,1,null,null,null,null,2,5,0,10,null,null,"Continuous",0,12,11,15,50,20,100]
["Central Victorian Uplands","CVU","Swamp Scrub","CVU_0053",1.25,"E","Endangered","scrubs/shrublands/mallee without logs","Woody","Central Victorian UplandsSwamp Scrub","0",0,0,null,null,null,null,null,null,null,null,null,null,null,null,null,5,10,13,30,2,5,9,15,1,1,7,15,null,null,null,null,null,null,null,null,null,null,null,null,null,null,0,20,null,null,"Continuous",0,7,null,20,null,20,50]
["Central Victorian Uplands","CVU","Swampy Riparian Woodland","CVU_0083",1,"E","Endangered","Forest/Woodland","Woody","Central Victorian UplandsSwampy Riparian Woodland","70",10,15,20,0,5,3,10,null,null,3,5,1,1,null,null,3,5,7,15,2,5,5,10,3,15,9,15,5,15,null,null,null,null,4,10,null,null,null,null,null,null,0,20,null,null,"Continuous",0,13,7,12,16,20,200]
["Central Victorian Uplands","CVU","Swampy Woodland","CVU_0937",1,"E","Endangered","Forest/Woodland","Woody",{"$f":"CONCATENATE(A67,C67)","v":"Central Victorian UplandsSwampy Woodland"},"60",15,15,15,0,5,1,5,null,null,4,20,2,5,1,1,2,10,5,10,2,5,2,10,1,10,3,10,2,5,null,null,null,null,2,10,null,null,null,null,2,0,0,20,null,null,"Continuous",0,15,7,9,30,20,150]
["Central Victorian Uplands","CVU","Valley Grassy Forest","CVU_0047",1,"V","Vulnerable","Forest/Woodland","Woody","Central Victorian UplandsValley Grassy Forest","70",20,25,20,0,5,2,10,null,null,3,10,4,5,2,1,2,1,8,15,2,5,2,10,1,1,7,20,1,5,null,null,null,null,1,5,null,null,null,null,1,1,0,20,null,null,"Continuous",0,15,9,12,25,20,200]
["Central Victorian Uplands","CVU","Valley Heathy Forest","CVU_0127",1,"V","Vulnerable","Forest/Woodland","Woody","Central Victorian UplandsValley Heathy Forest","70",20,15,30,0,5,2,10,null,null,7,15,5,5,2,1,null,null,6,10,3,5,3,5,2,20,6,15,1,1,null,null,null,null,1,1,null,null,null,null,3,5,0,10,null,null,"Episodic",30,14,14,9,30,40,200]
["Central Victorian Uplands","CVU","Valley Slopes Dry Forest","CVU_0177",1,"LC","Least Concern","Forest/Woodland","Woody","Central Victorian UplandsValley Slopes Dry Forest","70",20,20,30,0,5,4,15,null,null,6,20,1,5,null,null,5,10,8,15,3,5,2,5,null,null,6,15,2,5,null,null,null,null,3,5,null,null,null,null,2,5,0,10,"0","10","Continuous",0,14,11,16,40,40,200]
["Central Victorian Uplands","CVU","Wet Forest","CVU_0030",1,"LC","Least Concern","Forest/Woodland","Woody","Central Victorian UplandsWet Forest","90",20,30,40,0,5,4,30,null,null,6,20,1,1,null,null,2,1,5,10,2,1,1,1,1,10,1,5,null,null,null,null,null,null,4,20,"2","10",null,null,2,5,0,20,null,null,"Continuous",0,14,11,9,51,50,300]
["Central Victorian Uplands","CVU","Wetland Formation","CVU_0074",1.36,"E","Endangered","wetlands","Non-woody wetland","Central Victorian UplandsWetland Formation","0",null,0,null,null,null,null,null,null,null,null,null,null,null,null,null,null,null,null,null,null,null,null,null,null,null,null,null,null,null,null,null,null,null,null,null,null,null,null,null,null,null,null,null,null,null,null,0,0,null,null,null,null,0]
["Dundas Tablelands","DunT","Alluvial Terraces Herb-rich Woodland","DunT0067",1,"E","Endangered","Forest/Woodland","Woody","Dundas TablelandsAlluvial Terraces Herb-rich Woodland","70",10,15,10,0,5,1,5,null,null,2,1,2,1,null,null,2,5,10,20,4,10,null,null,null,null,10,20,4,5,"3","0",null,null,null,null,null,null,null,null,null,null,0,10,"0","10","Continuous",0,12,5,16,7,10,150]
["Dundas Tablelands","DunT","Aquatic Herbland","DunT0653",1.36,"E","Endangered","wetlands","Non-woody wetland","Dundas TablelandsAquatic Herbland","0",0,0,null,null,null,null,null,null,null,null,null,null,null,null,null,2,10,5,40,2,10,null,null,1,5,4,10,2,15,null,null,null,null,null,null,null,null,null,null,null,null,null,null,null,null,"Episodic",5,6,null,9,null,10,0]
["Dundas Tablelands","DunT","Basalt Creekline Shrubby Woodland","DunT0705",1,"E","Endangered","Forest/Woodland","Woody","Dundas TablelandsBasalt Creekline Shrubby Woodland","70",10,10,10,0,5,1,10,null,null,4,15,null,null,null,null,2,5,8,15,5,10,2,15,null,null,7,20,2,10,null,null,null,null,null,null,null,null,null,null,null,null,0,10,null,null,"Continuous",0,10,5,15,25,20,200]
["Dundas Tablelands","DunT","Basalt Shrubby Woodland","DunT0642",1,"E","Endangered","Forest/Woodland","Woody","Dundas TablelandsBasalt Shrubby Woodland","0",null,0,null,null,null,null,null,null,null,null,null,null,null,null,null,null,null,null,null,null,null,null,null,null,null,null,null,null,null,null,null,null,null,null,null,null,null,null,null,null,null,null,null,null,null,null,0,0,null,null,null,null,0]
["Dundas Tablelands","DunT","Brackish Sedgeland","DunT0013",1.36,"E","Endangered","wetlands","Non-woody wetland","Dundas TablelandsBrackish Sedgeland","0",0,0,null,null,null,null,null,null,null,null,null,null,null,null,null,1,5,5,10,5,5,1,5,null,null,4,10,3,50,"3","5",null,null,null,null,null,null,null,null,null,null,null,null,null,null,"Episodic",5,7,null,11,null,10,0]
["Dundas Tablelands","DunT","Creekline Grassy Woodland","DunT0068",1,"E","Endangered","Forest/Woodland","Woody","Dundas TablelandsCreekline Grassy Woodland","80",15,15,15,0,5,2,15,null,null,5,10,1,1,null,null,2,5,6,10,3,5,2,10,1,5,10,20,3,10,null,null,null,null,null,null,null,null,null,null,3,10,0,10,null,null,"Continuous",0,13,8,11,26,40,200]
["Dundas Tablelands","DunT","Creekline Sedgy Woodland","DunT0640",1,"E","Endangered","Forest/Woodland","Woody","Dundas TablelandsCreekline Sedgy Woodland","80",15,15,15,0,5,2,10,null,null,2,5,2,1,null,null,2,5,5,10,1,1,3,15,1,5,6,20,null,null,null,null,null,null,null,null,null,null,null,null,null,null,0,10,null,null,"Continuous",0,11,6,8,16,40,200]
["Dundas Tablelands","DunT","Creekline Tussock Grassland","DunT0654",1.36,"E","Endangered","grasslands","Other grassland","Dundas TablelandsCreekline Tussock Grassland","0",0,0,null,null,null,null,null,null,null,null,null,null,null,null,null,4,5,8,10,11,10,3,40,null,null,10,10,4,10,null,null,null,null,null,null,null,null,null,null,null,null,0,20,null,null,"Episodic",10,7,null,23,null,10,0]
["Dundas Tablelands","DunT","Damp Heathland","DunT0710",1.36,"V","Vulnerable","heathlands","Woody","Dundas TablelandsDamp Heathland","0",0,0,null,null,null,null,null,null,null,6,30,5,20,2,5,null,null,6,10,2,1,1,5,1,1,4,10,3,15,null,null,null,null,null,null,null,null,null,null,2,5,0,10,"0","10","Episodic",30,12,11,8,50,20,0]
["Dundas Tablelands","DunT","Damp Heathy Woodland","DunT0793",1,"V","Vulnerable","Forest/Woodland","Woody","Dundas TablelandsDamp Heathy Woodland","60",10,10,10,0,5,3,5,null,null,6,40,2,10,2,1,null,null,6,10,4,5,3,5,2,5,11,20,3,15,null,null,null,null,null,null,null,null,null,null,null,null,0,10,null,null,"Episodic",30,12,11,10,55,20,100]
["Dundas Tablelands","DunT","Damp Sands Herb-rich Woodland","DunT0003",1,"V","Vulnerable","Forest/Woodland","Woody","Dundas TablelandsDamp Sands Herb-rich Woodland","70",15,15,20,0,5,2,10,null,null,4,15,4,10,3,5,3,5,10,15,1,5,3,5,1,5,12,20,3,5,"2","0",null,null,1,10,null,null,null,null,null,null,0,10,null,null,"Continuous",0,15,10,14,35,40,150]
["Dundas Tablelands","DunT","Dry Creekline Woodland","DunT0285",1,"E","Endangered","Forest/Woodland","Woody","Dundas TablelandsDry Creekline Woodland","70",15,15,20,0,5,null,null,null,null,4,20,null,null,null,null,1,1,5,10,null,null,1,5,null,null,5,20,2,5,"2","1",null,null,null,null,null,null,null,null,null,null,0,20,null,null,"Continuous",0,9,4,6,20,20,200]
["Dundas Tablelands","DunT","Dune Soak Woodland","DunT0673",1,"E","Endangered","Forest/Woodland","Woody","Dundas TablelandsDune Soak Woodland","70",15,15,20,0,5,2,10,null,null,8,20,5,10,2,1,3,5,5,10,null,null,1,1,2,5,8,20,6,20,null,null,null,null,1,1,null,null,null,null,1,1,0,10,null,null,"Continuous",0,14,15,8,40,20,150]
["Dundas Tablelands","DunT","Escarpment Shrubland","DunT0895",1.1499999999999999,"E","Endangered","Forest/Woodland","Woody","Dundas TablelandsEscarpment Shrubland","0",0,0,null,null,null,null,null,null,null,3,10,2,5,null,null,3,5,4,10,5,5,1,5,1,5,9,25,3,5,null,null,null,null,1,5,null,null,null,null,1,5,0,10,"0","20","Continuous",0,13,5,12,15,20,50]
["Dundas Tablelands","DunT","Escarpment Shrubland - treed","DunT0895_61",1,"E","Endangered","Forest/Woodland","Woody","Dundas TablelandsEscarpment Shrubland - treed","70",15,0,0,0,5,3,10,null,null,3,10,2,5,null,null,3,5,4,10,5,5,1,5,1,5,9,25,3,5,null,null,null,null,1,5,null,null,null,null,1,5,0,10,"0","20","Continuous",0,15,8,12,25,20,150]
["Dundas Tablelands","DunT","Floodplain Riparian Woodland","DunT0056",1,"V","Vulnerable","Forest/Woodland","Woody","Dundas TablelandsFloodplain Riparian Woodland","80",15,20,20,0,5,1,5,null,null,3,10,null,null,null,null,5,10,4,10,3,10,3,15,1,10,5,15,3,10,null,null,null,null,null,null,null,null,null,null,1,5,0,10,null,null,"Episodic",5,12,4,12,15,40,300]
["Dundas Tablelands","DunT","Floodplain Thicket","DunT0280",1,"V","Vulnerable","Forest/Woodland","Woody","Dundas TablelandsFloodplain Thicket","80",10,15,10,0,5,1,5,null,null,8,50,null,null,null,null,1,5,2,1,1,1,4,15,null,null,2,5,3,15,null,null,null,null,null,null,null,null,null,null,null,null,0,20,null,null,"Episodic",5,10,9,4,55,20,100]
["Dundas Tablelands","DunT","Freshwater Lignum Shrubland","DunT0657",1.36,"E","Endangered","wetlands","Woody","Dundas TablelandsFreshwater Lignum Shrubland","0",0,0,null,null,null,null,null,null,null,null,null,null,null,null,null,null,null,null,null,null,null,null,null,null,null,null,null,null,null,null,null,null,null,null,null,null,null,null,null,null,null,null,null,null,null,"Episodic",5,0,null,null,null,0,50]
["Dundas Tablelands","DunT","Freshwater Meadow","DunT0680",1.36,"E","Endangered","wetlands","Non-woody wetland","Dundas TablelandsFreshwater Meadow","0",null,0,null,null,null,null,null,null,null,null,null,null,null,null,null,null,null,null,null,null,null,null,null,null,null,null,null,null,null,null,null,null,null,null,null,null,null,null,null,null,null,null,null,null,null,null,5,0,null,null,null,null,0]
["Dundas Tablelands","DunT","Grassy Woodland","DunT0175",1,"E","Endangered","Forest/Woodland","Woody","Dundas TablelandsGrassy Woodland","70/40",15,15,15,0,5,2,10,null,null,2,10,2,1,2,5,2,5,8,20,3,5,1,1,null,null,8,40,1,5,null,null,null,null,null,null,null,null,null,null,1,1,0,10,null,null,"Continuous",0,13,6,13,21,20,150]
["Dundas Tablelands","DunT","Heathland Thicket","DunT0279",1.36,"LC","Least Concern","heathlands","Woody","Dundas TablelandsHeathland Thicket","0",0,0,null,null,null,null,null,null,null,8,50,4,10,1,1,2,5,3,5,null,null,1,5,null,null,4,10,2,5,null,null,null,null,null,null,null,null,null,null,2,1,0,10,null,null,"Episodic",30,10,12,5,60,20,0]
["Dundas Tablelands","DunT","Heathy Dry Forest","DunT0020",1,"LC","Least Concern","Forest/Woodland","Woody","Dundas TablelandsHeathy Dry Forest","60",20,20,30,0,5,1,5,null,null,13,30,13,20,4,5,1,1,5,5,3,5,1,1,null,null,7,15,1,5,null,null,null,null,1,5,null,null,null,null,2,1,0,10,"0","10","Episodic",20,15,27,9,55,20,200]
["Dundas Tablelands","DunT","Heathy Herb-rich Woodland","DunT0179",1,"D","Depleted","Forest/Woodland","Woody","Dundas TablelandsHeathy Herb-rich Woodland","70",15,15,20,0,5,2,15,null,null,6,25,7,15,3,5,1,1,7,10,null,null,2,5,null,null,8,15,3,10,"2","1",null,null,1,15,null,null,"1","0",3,5,0,10,null,null,"Continuous",0,15,15,8,55,20,150]
["Dundas Tablelands","DunT","Heathy Woodland","DunT0048",1,"LC","Least Concern","Forest/Woodland","Woody","Dundas TablelandsHeathy Woodland","60",15,10,15,0,5,1,5,null,null,10,35,10,25,4,10,1,1,5,10,5,5,2,5,null,null,10,15,3,5,null,null,null,null,null,null,null,null,null,null,1,1,0,10,"0","10","Episodic",20,14,21,11,65,40,150]
["Dundas Tablelands","DunT","Herb-rich Foothill Forest","DunT0023",1,"D","Depleted","Forest/Woodland","Woody","Dundas TablelandsHerb-rich Foothill Forest","0",0,0,null,null,null,null,null,null,null,null,null,null,null,null,null,null,null,null,null,null,null,null,null,null,null,null,null,null,null,null,null,null,null,null,null,null,null,null,null,null,null,null,null,null,null,null,0,0,null,null,null,0,0]
["Dundas Tablelands","DunT","Hills Herb-rich Woodland","DunT0071",1,"V","Vulnerable","Forest/Woodland","Woody","Dundas TablelandsHills Herb-rich Woodland","70",0,0,null,0,5,null,null,null,null,null,null,null,null,null,null,null,null,null,null,null,null,null,null,null,null,null,null,null,null,null,null,null,null,null,null,null,null,null,null,null,null,0,10,"0","10",null,0,3,null,null,null,0,0]
["Dundas Tablelands","DunT","Lateritic Woodland","DunT0704",1,"D","Depleted","Forest/Woodland","Woody","Dundas TablelandsLateritic Woodland","70",15,15,15,0,5,1,5,null,null,11,25,11,20,4,5,2,5,14,10,4,5,3,10,null,null,15,20,4,10,"4","1",null,null,null,null,null,null,null,null,3,5,0,10,"0","10","Continuous",0,15,23,20,50,20,150]
["Dundas Tablelands","DunT","Lowland Forest","DunT0016",1,"LC","Least Concern","Forest/Woodland","Woody","Dundas TablelandsLowland Forest","70",20,20,30,0,5,2,10,null,null,11,25,9,15,3,5,null,null,12,20,null,null,4,10,1,5,9,20,1,5,null,null,null,null,1,5,null,null,null,null,null,null,0,10,null,null,"Continuous",0,12,22,12,50,40,200]
["Dundas Tablelands","DunT","Lunette Woodland","DunT0652",1,"E","Endangered","Forest/Woodland","Woody","Dundas TablelandsLunette Woodland","80",8,15,10,0,5,1,5,null,null,3,10,2,1,1,1,3,5,8,15,3,5,2,5,null,null,12,45,2,5,null,null,null,null,null,null,null,null,null,null,null,null,0,10,"0","10","Continuous",0,13,6,14,16,10,100]
["Dundas Tablelands","DunT","Plains Grassland","DunT0132",1.36,"E","Endangered","grasslands","Other grassland","Dundas TablelandsPlains Grassland","0",0,0,null,null,null,null,null,null,null,null,null,1,1,null,null,3,5,10,15,3,5,1,5,null,null,13,40,4,10,null,null,null,null,null,null,null,null,null,null,null,null,0,10,"0","10","Episodic",5,9,1,16,1,10,0]
["Dundas Tablelands","DunT","Plains Grassy Wetland","DunT0125",1.36,"E","Endangered","wetlands","Non-woody wetland","Dundas TablelandsPlains Grassy Wetland","0",0,0,null,null,null,null,null,null,null,null,null,null,null,null,null,6,10,11,20,4,10,2,10,null,null,11,30,2,10,"2","1",null,null,null,null,null,null,null,null,null,null,0,10,null,null,"Episodic",5,8,null,21,null,10,50]
["Dundas Tablelands","DunT","Plains Grassy Woodland","DunT0055",1,"E","Endangered","Forest/Woodland","Woody","Dundas TablelandsPlains Grassy Woodland","80",15,15,15,0,5,null,null,null,null,1,5,2,5,1,1,1,1,18,25,4,10,1,1,null,null,15,40,4,5,null,null,null,null,null,null,null,null,null,null,null,null,0,10,null,null,"Continuous",0,11,3,23,10,10,100]
["Dundas Tablelands","DunT","Plains Sedgy Wetland","DunT0647",1.36,"E","Endangered","wetlands","Non-woody wetland","Dundas TablelandsPlains Sedgy Wetland","0",0,0,null,null,null,null,null,null,null,null,null,null,null,null,null,2,5,4,20,2,5,null,null,1,25,4,10,1,5,null,null,null,null,null,null,null,null,null,null,null,null,null,null,null,null,"Episodic",5,6,null,8,null,10,50]
["Dundas Tablelands","DunT","Plains Sedgy Woodland","DunT0283",1,"D","Depleted","Forest/Woodland","Woody","Dundas TablelandsPlains Sedgy Woodland","70/40",15,15,10,0,5,null,null,null,null,2,5,2,1,null,null,4,15,10,20,2,5,2,1,1,1,13,30,4,20,null,null,null,null,null,null,null,null,null,null,null,null,0,10,null,null,"Continuous",0,11,4,16,6,10,150]
["Dundas Tablelands","DunT","Plains Swampy Woodland","DunT0651",1,"E","Endangered","Forest/Woodland","Woody","Dundas TablelandsPlains Swampy Woodland","80",10,15,10,0,5,1,5,null,null,4,15,null,null,null,null,3,5,8,20,5,5,3,30,1,1,7,10,2,5,null,null,null,null,null,null,null,null,null,null,null,null,0,20,null,null,"Continuous",0,11,5,16,20,10,100]
["Dundas Tablelands","DunT","Plains Woodland","DunT0803",1,"E","Endangered","Forest/Woodland","Woody","Dundas TablelandsPlains Woodland","70/40",15,15,15,0,5,null,null,null,null,2,5,2,5,1,1,1,1,20,25,4,10,1,5,1,1,16,30,3,5,null,null,null,null,null,null,null,null,null,null,null,null,0,10,null,null,"Continuous",0,12,4,25,10,20,100]
["Dundas Tablelands","DunT","Red Gum Swamp","DunT0292",1,"E","Endangered","Forest/Woodland","Woody","Dundas TablelandsRed Gum Swamp","80",10,15,15,0,5,null,null,null,null,null,null,null,null,null,null,2,10,7,25,2,1,2,15,null,null,6,20,2,15,null,null,null,null,null,null,null,null,null,null,null,null,null,null,"0","10","Episodic",5,8,null,11,null,10,100]
["Dundas Tablelands","DunT","Riparian Scrub","DunT0191",1.25,"E","Endangered","scrubs/shrublands/mallee without logs","Woody","Dundas TablelandsRiparian Scrub","0",0,0,null,null,null,null,null,null,null,2,10,null,null,null,null,4,10,10,15,4,5,3,20,2,5,10,20,3,10,null,null,null,null,null,null,null,null,null,null,null,null,0,20,null,null,"Continuous",0,9,2,18,10,40,0]
["Dundas Tablelands","DunT","Riparian Shrubland","DunT0019",1.25,"V","Vulnerable","scrubs/shrublands/mallee without logs","Woody","Dundas TablelandsRiparian Shrubland","0",0,0,null,null,null,null,null,null,null,6,40,null,null,null,null,2,5,6,10,2,5,3,10,null,null,3,10,2,1,null,null,null,null,2,5,null,null,null,null,2,5,0,10,null,null,"Episodic",5,10,6,10,40,20,100]
["Dundas Tablelands","DunT","Riparian Woodland","DunT0641",1,"E","Endangered","Forest/Woodland","Woody","Dundas TablelandsRiparian Woodland","80",15,15,20,0,5,2,15,null,null,3,10,1,1,null,null,4,15,5,10,1,5,3,10,1,5,4,20,2,5,null,null,null,null,null,null,null,null,null,null,1,5,0,10,null,null,"Continuous",0,13,6,10,26,30,200]
["Dundas Tablelands","DunT","Rocky Outcrop Herbland","DunT0193",1.36,"LC","Least Concern","grasslands","Non-woody wetland","Dundas TablelandsRocky Outcrop Herbland","0",0,0,null,null,null,2,10,null,null,4,10,4,5,2,1,1,1,3,5,null,null,2,5,null,null,3,5,2,5,null,null,null,null,1,1,null,null,null,null,1,1,0,40,null,null,"Continuous",0,12,10,4,25,10,0]
["Dundas Tablelands","DunT","Rocky Outcrop Shrubland","DunT0028",1.36,"LC","Least Concern","heathlands","Woody","Dundas TablelandsRocky Outcrop Shrubland","0",0,0,null,null,null,null,null,null,null,11,45,4,10,1,1,2,1,3,5,null,null,2,5,null,null,5,10,null,null,null,null,null,null,null,null,null,null,null,null,null,null,0,20,"0","10","Continuous",0,9,15,5,55,40,0]
["Dundas Tablelands","DunT","Sand Forest","DunT0134",1,"E","Endangered","Forest/Woodland","Woody","Dundas TablelandsSand Forest","70",15,20,30,0,5,1,5,null,null,3,5,1,5,2,5,null,null,2,5,null,null,1,1,null,null,7,15,2,1,null,null,null,null,1,50,null,null,null,null,null,null,0,10,null,null,"Continuous",0,11,5,2,15,40,150]
["Dundas Tablelands","DunT","Sand Heathland","DunT0006",1.36,"V","Vulnerable","heathlands","Woody","Dundas TablelandsSand Heathland","0",0,0,null,null,null,null,null,null,null,7,30,8,20,3,5,null,null,5,10,1,1,1,1,null,null,4,10,3,20,null,null,null,null,null,null,null,null,null,null,2,5,0,10,"0","10","Episodic",30,11,15,6,50,20,0]
["Dundas Tablelands","DunT","Sandy Stream Woodland","DunT0674",1,"E","Endangered","Forest/Woodland","Woody","Dundas TablelandsSandy Stream Woodland","80",10,15,10,0,5,2,15,null,null,5,15,null,null,null,null,null,null,6,10,3,5,2,10,2,20,10,30,3,5,null,null,null,null,null,null,null,null,null,null,null,null,0,10,null,null,"Continuous",0,10,7,9,30,40,200]
["Dundas Tablelands","DunT","Seasonally Inundated Shrubby Woodland","DunT0195",1,"D","Depleted","Forest/Woodland","Woody","Dundas TablelandsSeasonally Inundated Shrubby Woodland","70",15,15,15,0,5,null,null,null,null,7,30,3,10,1,1,2,5,3,10,1,1,null,null,null,null,5,15,3,10,null,null,null,null,null,null,null,null,null,null,null,null,0,10,"0","10","Continuous",0,11,10,6,40,30,150]
["Dundas Tablelands","DunT","Sedge Wetland","DunT0136",1.36,"E","Endangered","wetlands","Non-woody wetland","Dundas TablelandsSedge Wetland","0",0,0,null,null,null,null,null,null,null,1,1,null,null,null,null,4,10,10,20,3,10,3,5,null,null,11,30,3,10,"2","5",null,null,null,null,null,null,null,null,null,null,0,10,"0","10","Episodic",5,10,1,17,1,10,0]
["Dundas Tablelands","DunT","Sedgy Riparian Woodland","DunT0198",1,"E","Endangered","Forest/Woodland","Woody","Dundas TablelandsSedgy Riparian Woodland","70",15,15,20,0,5,1,10,null,null,5,20,null,null,null,null,null,null,3,10,null,null,5,30,null,null,2,5,2,5,null,null,null,null,2,10,null,null,null,null,null,null,0,20,null,null,"Continuous",0,9,6,3,30,20,200]
["Dundas Tablelands","DunT","Shallow Freshwater Marsh","DunT0200",1.36,"V","Vulnerable","wetlands","Non-woody wetland","Dundas TablelandsShallow Freshwater Marsh","0",null,0,null,null,null,null,null,null,null,null,null,null,null,null,null,null,null,null,null,null,null,null,null,null,null,null,null,null,null,null,null,null,null,null,null,null,null,null,null,null,null,null,null,null,null,null,0,0,null,null,null,null,0]
["Dundas Tablelands","DunT","Shallow Sands Woodland","DunT0882",1,"V","Vulnerable","Forest/Woodland","Woody","Dundas TablelandsShallow Sands Woodland","70",15,15,15,0,5,2,15,null,null,3,5,4,10,2,5,3,5,17,20,3,5,2,5,null,null,11,25,4,10,"2","0",null,null,null,null,null,null,null,null,1,0,0,10,"0","10","Continuous",0,15,9,23,30,20,150]
["Dundas Tablelands","DunT","Shrubby Woodland","DunT0282",1,"V","Vulnerable","Forest/Woodland","Woody","Dundas TablelandsShrubby Woodland","70",15,15,20,0,5,2,10,null,null,6,40,3,5,1,1,2,1,5,5,2,5,2,10,1,5,4,10,2,10,null,null,null,null,1,1,null,null,null,null,null,null,0,10,null,null,"Continuous",0,14,11,9,55,20,150]
["Dundas Tablelands","DunT","Stony Knoll Shrubland","DunT0649",1.36,"V","Vulnerable","Forest/Woodland","Woody","Dundas TablelandsStony Knoll Shrubland","0",0,0,null,null,null,null,null,null,null,3,10,null,null,1,1,2,1,11,10,4,5,null,null,null,null,10,25,2,5,"2","5",null,null,2,5,null,null,null,null,1,0,0,10,"0","10","Continuous",0,11,3,17,10,20,0]
["Dundas Tablelands","DunT","Stony Knoll Shrubland - treed","DunT0649_61",1.1499999999999999,"V","Vulnerable","Forest/Woodland","Woody","Dundas TablelandsStony Knoll Shrubland - treed","0",0,8,15,null,null,null,null,null,null,3,10,null,null,1,1,2,1,11,10,4,5,null,null,null,null,10,25,2,5,"2","5",null,null,2,5,null,null,null,null,1,0,0,10,"0","10","Continuous",0,11,3,17,10,20,50]
["Dundas Tablelands","DunT","Swamp Scrub","DunT0053",1.25,"E","Endangered","scrubs/shrublands/mallee without logs","Woody","Dundas TablelandsSwamp Scrub","0",0,0,null,null,null,null,null,null,null,2,10,1,1,null,null,5,5,9,15,3,10,2,15,2,5,4,15,3,15,null,null,null,null,2,5,null,null,null,null,1,5,0,20,null,null,"Continuous",0,12,3,17,11,40,0]
["Dundas Tablelands","DunT","Tall Marsh","DunT0821",1.36,"TBC","TBC","wetlands","Non-woody wetland","Dundas TablelandsTall Marsh","0",0,0,null,null,null,null,null,null,null,null,null,null,null,null,null,3,10,2,5,6,10,1,5,2,40,null,null,1,1,null,null,null,null,null,null,null,null,null,null,null,null,null,null,null,null,"Episodic",5,6,null,11,null,10,0]
["Dundas Tablelands","DunT","Wet Heathland","DunT0008",1.36,"D","Depleted","heathlands","Woody","Dundas TablelandsWet Heathland","0",0,0,null,null,null,null,null,null,null,7,40,4,5,1,1,2,5,1,5,2,1,2,20,1,5,4,15,3,10,null,null,null,null,1,1,null,null,null,null,1,5,0,20,null,null,"Episodic",30,13,11,5,45,20,0]
["East Gippsland Lowlands","EGL","Banksia Woodland","EGL_0014",1,"LC","Least Concern","Forest/Woodland","Woody","East Gippsland LowlandsBanksia Woodland","50",15,10,15,0,5,1,5,null,null,10,25,7,15,null,null,1,1,5,10,1,1,3,10,1,5,5,10,2,5,null,null,null,null,2,10,null,null,null,null,3,1,0,10,null,null,"Episodic",30,14,18,7,45,40,150]
["East Gippsland Lowlands","EGL","Blackthorn Scrub","EGL_0027",1.25,"R","Rare","scrubs/shrublands/mallee without logs","Woody","East Gippsland LowlandsBlackthorn Scrub","0",0,0,null,null,null,null,null,null,null,8,40,1,1,null,null,2,1,3,5,null,null,1,1,null,null,3,5,1,1,null,null,null,null,1,1,null,null,null,null,3,5,0,10,null,null,"Continuous",0,10,9,5,41,40,100]
["East Gippsland Lowlands","EGL","Brackish Sedgeland","EGL_0013",1.36,"V","Vulnerable","wetlands","Non-woody wetland",{"$f":"CONCATENATE(A131,C131)","v":"East Gippsland LowlandsBrackish Sedgeland"},"0",0,0,null,null,null,null,null,null,null,null,null,null,null,null,null,1,1,2,5,2,1,null,null,null,null,null,null,2,55,null,null,null,null,null,null,null,null,null,null,null,null,null,null,null,null,"Continuous",0,4,null,5,null,0,0]
["East Gippsland Lowlands","EGL","Clay Heathland","EGL_0007",1.36,"V","Vulnerable","heathlands","Woody","East Gippsland LowlandsClay Heathland","0",0,0,null,null,null,null,null,null,null,6,30,7,20,2,1,2,1,8,10,2,1,3,5,null,null,4,5,4,5,null,null,null,null,2,1,null,null,null,null,null,null,0,10,"0","10","Episodic",30,12,13,12,50,20,0]
["East Gippsland Lowlands","EGL","Clay Heathland - treed","EGL_0007_61",1,"V","Vulnerable","heathlands","Woody","East Gippsland LowlandsClay Heathland - treed","40",10,8,10,null,null,null,null,null,null,6,30,7,20,2,1,2,1,8,10,2,1,3,5,null,null,4,5,4,5,null,null,null,null,2,1,null,null,null,null,null,null,0,10,"0","10","Episodic",30,12,13,12,50,20,50]
["East Gippsland Lowlands","EGL","Coast Banksia Woodland","EGL_0002",1,"LC","Least Concern","Forest/Woodland","Woody","East Gippsland LowlandsCoast Banksia Woodland","50/70",10,15,15,0,5,2,10,null,null,5,15,3,5,1,1,2,1,4,10,null,null,2,5,null,null,3,5,null,null,null,null,null,null,1,5,null,null,null,null,2,5,0,20,null,null,"Episodic",30,12,10,6,30,40,100]
["East Gippsland Lowlands","EGL","Coastal Lagoon Wetland","EGL_0011",1.36,"V","Vulnerable","wetlands","Non-woody wetland","East Gippsland LowlandsCoastal Lagoon Wetland","0",0,0,null,null,null,null,null,null,null,5,15,2,1,null,null,1,1,2,5,1,1,2,10,2,15,1,1,2,5,null,null,null,null,1,5,null,null,null,null,1,1,0,10,null,null,"Continuous",0,12,7,4,16,20,0]
["East Gippsland Lowlands","EGL","Coastal Saltmarsh","EGL_0009",1.36,"D","Depleted","grasslands","Non-woody wetland","East Gippsland LowlandsCoastal Saltmarsh","0",0,0,null,null,null,null,null,null,null,3,10,2,1,1,1,null,null,4,20,1,5,1,1,2,10,2,5,1,15,null,null,null,null,null,null,null,null,null,null,1,1,null,null,"0","10","Continuous",0,11,5,5,11,10,0]
["East Gippsland Lowlands","EGL","Coastal Sand Heathland","EGL_0005",1.36,"R","Rare","heathlands","Woody","East Gippsland LowlandsCoastal Sand Heathland","0",0,0,null,null,null,null,null,null,null,8,40,6,15,null,null,1,1,5,10,null,null,3,5,null,null,4,5,4,15,null,null,null,null,2,5,null,null,null,null,1,1,0,10,null,null,"Episodic",30,10,14,6,55,20,0]
["East Gippsland Lowlands","EGL","Coastal Vine-rich Forest","EGL_0004",1,"V","Vulnerable","Forest/Woodland","Woody","East Gippsland LowlandsCoastal Vine-rich Forest","70/80",20,25,40,0,5,2,10,null,null,7,25,3,10,null,null,null,null,4,10,1,1,3,10,1,1,3,5,null,null,null,null,null,null,2,10,"1","1",null,null,5,10,0,20,null,null,"Continuous",0,13,12,5,45,50,200]
["East Gippsland Lowlands","EGL","Damp Forest","EGL_0029",1,"LC","Least Concern","Forest/Woodland","Woody","East Gippsland LowlandsDamp Forest","90",20,30,40,0,5,3,20,null,null,8,25,3,5,1,1,1,1,6,10,null,null,2,5,1,5,4,5,1,1,null,null,null,null,3,15,"1","5",null,null,4,5,0,20,null,null,"Continuous",0,15,14,7,50,50,300]
["East Gippsland Lowlands","EGL","Damp Sands Herb-rich Woodland","EGL_0003",1,"V","Vulnerable","Forest/Woodland","Woody","East Gippsland LowlandsDamp Sands Herb-rich Woodland","50/70",15,15,15,0,5,1,5,null,null,5,25,3,5,1,1,2,5,8,15,5,10,2,10,1,1,4,10,2,10,null,null,null,null,1,15,null,null,null,null,2,0,0,10,null,null,"Continuous",0,15,9,15,35,40,150]
["East Gippsland Lowlands","EGL","Dry Rainforest","EGL_0034",1,"E","Endangered","Forest/Woodland","Woody","East Gippsland LowlandsDry Rainforest","60",10,15,50,0,5,3,20,null,null,9,20,null,null,null,null,5,5,12,15,5,5,2,5,null,null,3,5,3,5,null,null,null,null,5,10,null,null,"2","1",6,10,0,20,null,null,"Continuous",0,13,12,22,40,50,100]
["East Gippsland Lowlands","EGL","Dry Valley Forest","EGL_0169",1,"V","Vulnerable","Forest/Woodland","Woody","East Gippsland LowlandsDry Valley Forest","70",20,20,30,0,5,4,15,null,null,4,40,null,null,null,null,null,null,9,10,4,5,1,5,null,null,1,10,2,10,null,null,null,null,3,10,null,null,null,null,3,5,0,10,null,null,"Continuous",0,11,8,13,55,40,200]
["East Gippsland Lowlands","EGL","Estuarine Swamp Scrub","EGL_0053_62",1.25,"E","Endangered","scrubs/shrublands/mallee without logs","Woody","East Gippsland LowlandsEstuarine Swamp Scrub","0",0,0,null,null,null,null,null,null,null,2,10,null,null,null,null,null,null,3,20,2,5,null,null,null,null,2,10,2,15,null,null,null,null,null,null,null,null,null,null,null,null,null,null,null,null,"Continuous",0,5,2,5,10,20,0]
["East Gippsland Lowlands","EGL","Estuarine Wetland","EGL_0010",1.36,"V","Vulnerable","wetlands","Non-woody wetland","East Gippsland LowlandsEstuarine Wetland","0",0,0,null,null,null,null,null,null,null,1,10,2,5,null,null,2,5,6,15,2,10,2,10,1,5,2,5,3,20,null,null,null,null,1,5,null,null,null,null,1,1,null,null,null,null,"Episodic",5,11,3,10,15,10,0]
["East Gippsland Lowlands","EGL","Floodplain Reedbed","EGL_0863",1.36,"E","Endangered","wetlands","Non-woody wetland","East Gippsland LowlandsFloodplain Reedbed","0",0,0,null,null,null,null,null,null,null,1,5,null,null,null,null,2,10,2,5,2,5,null,null,2,30,1,5,null,null,null,null,null,null,null,null,null,null,null,null,1,1,null,null,null,null,"Episodic",5,7,1,6,5,10,0]
["East Gippsland Lowlands","EGL","Gallery Rainforest","EGL_0135",1,"E","Endangered","Forest/Woodland","Woody","East Gippsland LowlandsGallery Rainforest","70",20,20,50,0,5,4,20,null,null,12,30,2,5,1,1,1,1,6,10,2,1,4,15,1,1,4,5,2,5,null,null,null,null,6,20,"1","1","2","5",8,10,0,20,null,null,"Continuous",0,17,18,9,55,40,200]
["East Gippsland Lowlands","EGL","Grassy Dry Forest","EGL_0022",1,"LC","Least Concern","Forest/Woodland","Woody","East Gippsland LowlandsGrassy Dry Forest","60",20,20,30,0,5,1,5,null,null,7,25,3,5,1,5,3,5,11,20,2,5,1,1,1,5,6,20,1,1,null,null,null,null,2,5,null,null,null,null,3,5,0,10,"0","10","Continuous",0,16,11,16,35,20,200]
["East Gippsland Lowlands","EGL","Heathy Dry Forest","EGL_0020",1,"LC","Least Concern","Forest/Woodland","Woody","East Gippsland LowlandsHeathy Dry Forest","60",20,20,30,0,5,null,null,null,null,9,30,5,10,2,5,3,5,8,10,1,1,1,1,null,null,5,20,null,null,null,null,null,null,null,null,null,null,"1","0",2,1,0,10,"0","10","Episodic",20,13,14,12,40,20,200]
["East Gippsland Lowlands","EGL","Heathy Woodland","EGL_0048",1,"D","Depleted","Forest/Woodland","Woody","East Gippsland LowlandsHeathy Woodland","40/50",15,10,10,0,5,null,null,null,null,5,30,5,20,null,null,null,null,2,5,2,5,1,5,1,1,1,1,2,5,null,null,null,null,1,5,null,null,null,null,null,null,0,10,"0","10","Episodic",20,12,10,4,50,40,150]
["East Gippsland Lowlands","EGL","Herb-rich Foothill Forest","EGL_0023",1,"LC","Least Concern","Forest/Woodland","Woody","East Gippsland LowlandsHerb-rich Foothill Forest","70",20,25,40,0,5,2,10,null,null,4,10,3,5,1,5,4,5,13,20,3,5,2,1,null,null,7,30,2,5,null,null,null,null,2,10,null,null,null,null,2,5,0,20,null,null,"Continuous",0,14,9,20,25,40,200]
["East Gippsland Lowlands","EGL","Limestone Box Forest","EGL_0015",1,"V","Vulnerable","Forest/Woodland","Woody","East Gippsland LowlandsLimestone Box Forest","70",20,20,30,0,5,3,15,null,null,5,15,1,1,null,null,2,1,8,10,3,5,2,5,2,5,4,5,3,5,null,null,null,null,3,15,null,null,null,null,6,10,0,10,null,null,"Continuous",0,14,9,13,31,20,150]
["East Gippsland Lowlands","EGL","Limestone Grassy Woodland","EGL_0175_62",1,"D","Depleted","Forest/Woodland","Woody","East Gippsland LowlandsLimestone Grassy Woodland","70",15,15,15,0,5,3,10,null,null,3,15,2,5,null,null,4,5,8,15,3,10,1,5,null,null,5,25,1,5,null,null,null,null,2,5,null,null,null,null,3,5,0,10,null,null,"Continuous",0,13,8,15,30,20,150]
["East Gippsland Lowlands","EGL","Limestone Pomaderris Shrubland","EGL_0133",1.25,"E","Endangered","Forest/Woodland","Woody","East Gippsland LowlandsLimestone Pomaderris Shrubland","0",0,0,null,null,null,2,10,null,null,7,45,2,1,null,null,5,5,10,15,3,5,2,5,null,null,7,20,null,null,null,null,null,null,null,null,null,null,null,null,3,5,0,10,"0","10","Continuous",0,11,11,18,56,40,0]
["East Gippsland Lowlands","EGL","Lowland Forest","EGL_0016",1,"LC","Least Concern","Forest/Woodland","Woody","East Gippsland LowlandsLowland Forest","70",20,25,30,0,5,2,10,null,null,10,30,6,15,2,5,1,1,6,10,null,null,2,10,1,5,6,10,2,5,null,null,null,null,3,10,null,null,null,null,3,5,0,10,null,null,"Continuous",0,14,18,7,55,40,200]
["East Gippsland Lowlands","EGL","Lowland Herb-rich Forest","EGL_0877",1,"D","Depleted","Forest/Woodland","Woody","East Gippsland LowlandsLowland Herb-rich Forest","70",20,20,30,0,5,3,10,null,null,4,20,1,1,1,5,2,5,13,30,4,5,1,15,null,null,5,5,2,10,null,null,null,null,null,null,null,null,null,null,null,null,0,10,null,null,"Continuous",0,12,8,19,31,40,200]
["East Gippsland Lowlands","EGL","Plains Grassy Forest","EGL_0151",1,"E","Endangered","Forest/Woodland","Woody","East Gippsland LowlandsPlains Grassy Forest","70",20,20,30,0,5,3,15,null,null,6,20,3,5,2,5,3,5,6,10,2,5,2,10,1,5,4,15,2,1,null,null,null,null,2,10,null,null,null,null,null,null,0,10,null,null,"Continuous",0,14,12,11,40,20,200]
["East Gippsland Lowlands","EGL","Plains Grassy Wetland","EGL_0125",1.36,"E","Endangered","wetlands","Non-woody wetland","East Gippsland LowlandsPlains Grassy Wetland","0",null,0,null,null,null,null,null,null,null,null,null,null,null,null,null,null,null,null,null,null,null,null,null,null,null,null,null,null,null,null,null,null,null,null,null,null,null,null,null,null,null,null,null,null,null,null,0,0,null,null,null,null,0]
["East Gippsland Lowlands","EGL","Plains Grassy Woodland","EGL_0055",1,"E","Endangered","Forest/Woodland","Woody","East Gippsland LowlandsPlains Grassy Woodland","80",10,15,20,0,5,1,5,null,null,2,10,1,1,1,1,1,5,10,20,3,5,2,5,1,10,9,35,2,10,null,null,null,null,null,null,null,null,null,null,null,null,0,10,null,null,"Continuous",0,13,4,14,16,10,100]
["East Gippsland Lowlands","EGL","Rainshadow Grassy Woodland","EGL_0175_61",1,"D","Depleted","Forest/Woodland","Woody","East Gippsland LowlandsRainshadow Grassy Woodland","70",15,15,15,0,5,4,15,null,null,4,15,2,5,null,null,4,5,8,15,3,5,1,1,null,null,5,20,1,5,null,null,null,null,2,5,null,null,null,null,3,5,0,10,null,null,"Continuous",0,13,10,15,35,20,150]
["East Gippsland Lowlands","EGL","Riparian Forest","EGL_0018",1,"D","Depleted","Forest/Woodland","Woody","East Gippsland LowlandsRiparian Forest","80",20,30,40,0,5,4,15,null,null,13,25,2,5,1,1,2,1,7,10,2,1,4,10,1,5,4,5,2,5,null,null,null,null,5,15,"1","5","1","0",7,15,0,20,null,null,"Continuous",0,17,19,11,45,50,300]
["East Gippsland Lowlands","EGL","Riparian Scrub","EGL_0191",1.25,"LC","Least Concern","scrubs/shrublands/mallee without logs","Woody","East Gippsland LowlandsRiparian Scrub","0",0,0,null,null,null,null,null,null,null,3,10,1,1,null,null,null,null,1,1,1,1,1,10,1,5,1,1,3,15,null,null,null,null,1,5,null,null,null,null,2,15,0,20,null,null,"Continuous",0,11,4,2,11,40,0]
["East Gippsland Lowlands","EGL","Riparian Shrubland","EGL_0019",1.25,"R","Rare","scrubs/shrublands/mallee without logs","Woody","East Gippsland LowlandsRiparian Shrubland","0",0,0,null,null,null,null,null,null,null,6,25,null,null,null,null,6,5,9,10,3,5,3,5,null,null,2,10,2,1,null,null,null,null,2,1,null,null,null,null,2,1,0,20,null,null,"Episodic",5,10,6,18,25,20,100]
["East Gippsland Lowlands","EGL","Riverine Escarpment Scrub","EGL_0082",1.25,"R","Rare","scrubs/shrublands/mallee without logs","Woody","East Gippsland LowlandsRiverine Escarpment Scrub","0",0,0,null,0,5,null,null,null,null,7,20,1,1,null,null,3,5,10,10,2,5,2,5,null,null,4,15,2,10,null,null,null,null,2,5,null,null,null,null,4,10,0,10,null,null,"Continuous",0,12,8,15,21,40,50]
["East Gippsland Lowlands","EGL","Rocky Outcrop Shrubland","EGL_0028",1.36,"R","Rare","heathlands","Woody","East Gippsland LowlandsRocky Outcrop Shrubland","0",0,0,null,null,null,null,null,null,null,8,45,2,10,1,1,2,5,2,5,null,null,1,5,null,null,5,10,null,null,null,null,null,null,null,null,null,null,null,null,1,1,0,20,"0","10","Continuous",0,10,10,4,55,40,0]
["East Gippsland Lowlands","EGL","Sandy Flood Scrub","EGL_0141",1.25,"E","Endangered","scrubs/shrublands/mallee without logs","Woody","East Gippsland LowlandsSandy Flood Scrub","0",0,0,null,null,null,null,null,null,null,3,15,1,1,null,null,null,null,2,5,1,1,3,15,1,10,1,1,2,5,null,null,null,null,1,5,null,null,null,null,null,null,0,20,null,null,"Episodic",5,10,4,3,16,10,50]
["East Gippsland Lowlands","EGL","Shrubby Damp Forest","EGL_0316",1,"LC","Least Concern","Forest/Woodland","Woody","East Gippsland LowlandsShrubby Damp Forest","90",20,30,40,0,5,3,20,null,null,8,30,2,5,null,null,4,10,9,20,2,5,2,10,1,1,4,10,1,1,null,null,null,null,2,15,"1","1",null,null,2,5,0,20,null,null,"Continuous",0,15,13,15,55,50,300]
["East Gippsland Lowlands","EGL","Shrubby Dry Forest","EGL_0021",1,"LC","Least Concern","Forest/Woodland","Woody","East Gippsland LowlandsShrubby Dry Forest","70",20,25,30,0,5,1,10,null,null,6,30,2,5,null,null,null,null,5,5,null,null,1,1,2,10,3,10,1,1,null,null,null,null,2,5,null,null,null,null,3,5,0,10,"0","10","Episodic",20,13,9,5,45,20,200]
["East Gippsland Lowlands","EGL","Swamp Scrub","EGL_0053_61",1.25,"E","Endangered","scrubs/shrublands/mallee without logs","Woody","East Gippsland LowlandsSwamp Scrub","0",0,0,null,null,null,null,null,null,null,2,10,2,1,null,null,2,5,3,15,2,5,2,10,3,10,2,5,2,15,null,null,null,null,1,5,null,null,null,null,1,1,0,20,null,null,"Continuous",0,12,4,7,11,40,0]
["East Gippsland Lowlands","EGL","Valley Grassy Forest","EGL_0047",1,"D","Depleted","Forest/Woodland","Woody","East Gippsland LowlandsValley Grassy Forest","70",20,25,20,0,5,3,10,null,null,9,20,3,5,1,1,3,5,17,20,4,5,2,5,2,5,7,20,4,15,null,null,null,null,3,5,"1","0","1","0",6,5,0,20,null,null,"Continuous",0,17,15,24,35,20,200]
["East Gippsland Lowlands","EGL","Valley Slopes Dry Forest","EGL_0177",1,"R","Rare","Forest/Woodland","Woody","East Gippsland LowlandsValley Slopes Dry Forest","70",20,20,30,0,5,2,15,null,null,5,20,null,null,1,5,1,5,3,10,1,5,null,null,null,null,3,10,1,5,null,null,null,null,null,null,null,null,null,null,2,5,0,10,null,null,"Continuous",0,11,7,5,35,40,200]
["East Gippsland Lowlands","EGL","Warm Temperate Rainforest","EGL_0032",1,"R","Rare","Forest/Woodland","Woody","East Gippsland LowlandsWarm Temperate Rainforest","70",20,25,50,0,5,3,20,null,null,7,15,null,null,null,null,3,5,5,10,2,5,2,5,1,1,2,1,2,1,null,null,null,null,8,30,"1","15","3","1",9,15,0,20,null,null,"Continuous",0,15,10,10,35,50,200]
["East Gippsland Lowlands","EGL","Wet Forest","EGL_0030",1,"LC","Least Concern","Forest/Woodland","Woody","East Gippsland LowlandsWet Forest","90",20,30,40,0,5,3,20,null,null,6,15,null,null,null,null,1,1,6,15,2,1,2,5,1,1,3,15,1,10,null,null,null,null,4,20,"1","15",null,null,3,5,0,20,null,null,"Continuous",0,14,18,18,70,50,300]
["East Gippsland Lowlands","EGL","Wet Heathland","EGL_0008",1.36,"LC","Least Concern","heathlands","Woody","East Gippsland LowlandsWet Heathland","0",0,0,null,null,null,null,null,null,null,7,40,4,5,1,1,1,1,4,5,null,null,2,15,null,null,3,5,5,10,null,null,null,null,1,1,null,null,null,null,1,1,0,20,null,null,"Episodic",30,11,11,5,45,20,0]
["East Gippsland Lowlands","EGL","Wet Swale Herbland","EGL_0012",1.36,"V","Vulnerable","wetlands","Non-woody wetland","East Gippsland LowlandsWet Swale Herbland","0",0,0,null,null,null,null,null,null,null,null,null,1,1,null,null,1,1,7,15,3,5,2,5,1,1,4,10,4,25,null,null,null,null,1,5,null,null,null,null,2,1,null,null,null,null,"Episodic",5,10,1,11,1,10,0]
["East Gippsland Uplands","EGU","Banksia Woodland","EGU_0014",1,"LC","Least Concern","Forest/Woodland","Woody","East Gippsland UplandsBanksia Woodland","50",15,10,15,0,5,1,5,null,null,10,25,7,15,null,null,1,1,5,10,1,1,3,10,1,5,5,10,2,5,null,null,null,null,2,10,null,null,null,null,3,1,0,10,null,null,"Episodic",30,14,18,7,45,40,150]
["East Gippsland Uplands","EGU","Blackthorn Scrub","EGU_0027",1.25,"R","Rare","scrubs/shrublands/mallee without logs","Woody","East Gippsland UplandsBlackthorn Scrub","0",0,0,null,null,null,null,null,null,null,8,40,1,1,null,null,2,1,3,5,null,null,1,1,null,null,3,5,1,1,null,null,null,null,1,1,null,null,null,null,3,5,0,10,null,null,"Continuous",0,10,9,5,41,40,100]
["East Gippsland Uplands","EGU","Clay Heathland","EGU_0007",1.36,"V","Vulnerable","heathlands","Woody","East Gippsland UplandsClay Heathland","0",0,0,null,null,null,null,null,null,null,9,30,6,10,3,5,null,null,8,10,2,1,5,10,1,5,7,10,2,5,null,null,null,null,null,null,null,null,null,null,null,null,0,10,"0","10","Episodic",30,11,15,10,40,20,0]
["East Gippsland Uplands","EGU","Clay Heathland - treed","EGU_0007_61",1,"V","Vulnerable","heathlands","Woody","East Gippsland UplandsClay Heathland - treed","40",10,8,10,null,null,null,null,null,null,9,30,6,10,3,5,null,null,8,10,2,1,5,10,1,5,7,10,2,5,null,null,null,null,null,null,null,null,null,null,null,null,0,10,"0","10","Episodic",30,11,15,10,40,20,50]
["East Gippsland Uplands","EGU","Cool Temperate Rainforest","EGU_0031",1,"R","Rare","Forest/Woodland","Woody","East Gippsland UplandsCool Temperate Rainforest","70",20,25,50,0,5,2,15,null,null,4,10,null,null,null,null,null,null,3,10,null,null,1,1,null,null,1,1,1,1,null,null,null,null,6,25,"2","25","2","5",2,1,0,20,null,null,"Continuous",0,12,6,3,25,50,200]
["East Gippsland Uplands","EGU","Damp Forest","EGU_0029",1,"LC","Least Concern","Forest/Woodland","Woody","East Gippsland UplandsDamp Forest","90",20,30,40,0,5,3,15,null,null,10,25,2,5,null,null,2,1,6,15,1,1,2,5,1,5,4,10,1,1,null,null,null,null,4,20,"1","5",null,null,4,10,0,20,null,null,"Continuous",0,15,15,9,45,50,300]
["East Gippsland Uplands","EGU","Damp Sands Herb-rich Woodland","EGU_0003",1,"V","Vulnerable","Forest/Woodland","Woody","East Gippsland UplandsDamp Sands Herb-rich Woodland","70",15,15,20,0,5,2,10,null,null,4,20,null,null,1,1,2,5,6,15,5,10,1,1,null,null,7,20,1,5,null,null,null,null,1,10,null,null,null,null,2,5,0,10,null,null,"Continuous",0,13,6,13,30,40,150]
["East Gippsland Uplands","EGU","Dry Rainforest","EGU_0034",1,"E","Endangered","Forest/Woodland","Woody","East Gippsland UplandsDry Rainforest","70",10,15,40,0,5,2,10,null,null,5,10,null,null,null,null,3,5,4,10,null,null,null,null,null,null,null,null,1,1,null,null,null,null,5,20,"2","30","2","1",3,5,0,20,null,null,"Continuous",0,11,7,7,20,40,100]
["East Gippsland Uplands","EGU","Dry Valley Forest","EGU_0169",1,"V","Vulnerable","Forest/Woodland","Woody","East Gippsland UplandsDry Valley Forest","70",20,20,30,0,5,3,15,null,null,6,30,1,1,null,null,4,5,10,15,4,5,1,1,2,5,2,10,2,5,null,null,null,null,3,5,null,null,null,null,2,5,0,20,null,null,"Continuous",0,14,10,18,46,40,200]
["East Gippsland Uplands","EGU","Foothill Box Ironbark Forest","EGU_0024",1,"V","Vulnerable","Forest/Woodland","Woody","East Gippsland UplandsFoothill Box Ironbark Forest","60",15,20,30,0,5,2,10,null,null,4,20,null,null,null,null,2,1,2,1,2,1,1,1,null,null,3,5,null,null,null,null,null,null,null,null,null,null,"1","1",3,5,0,10,"0","10","Continuous",0,12,6,6,30,20,200]
["East Gippsland Uplands","EGU","Gallery Rainforest","EGU_0135",1,"E","Endangered","Forest/Woodland","Woody","East Gippsland UplandsGallery Rainforest","70",20,20,50,0,5,2,15,null,null,12,25,null,null,null,null,3,1,11,15,3,5,3,5,2,5,6,10,3,5,null,null,null,null,8,20,"2","5","2","1",8,10,0,20,null,null,"Continuous",0,15,14,17,40,50,200]
["East Gippsland Uplands","EGU","Grassy Dry Forest","EGU_0022",1,"LC","Least Concern","Forest/Woodland","Woody","East Gippsland UplandsGrassy Dry Forest","60",20,20,30,0,5,1,10,null,null,7,20,3,5,1,5,3,1,11,20,2,1,2,5,1,5,6,25,2,5,null,null,null,null,2,5,null,null,null,null,3,5,0,10,"0","10","Continuous",0,16,11,16,35,20,200]
["East Gippsland Uplands","EGU","Heathy Dry Forest","EGU_0020",1,"LC","Least Concern","Forest/Woodland","Woody","East Gippsland UplandsHeathy Dry Forest","60",20,20,30,0,5,2,10,null,null,8,30,5,10,2,5,3,5,8,10,1,1,1,1,null,null,5,20,null,null,null,null,null,null,null,null,null,null,null,null,2,1,0,10,"0","10","Episodic",20,13,15,12,50,20,200]
["East Gippsland Uplands","EGU","Herb-rich Foothill Forest","EGU_0023",1,"LC","Least Concern","Forest/Woodland","Woody","East Gippsland UplandsHerb-rich Foothill Forest","70",20,25,40,0,5,2,10,null,null,4,10,3,5,1,5,4,5,13,20,3,5,2,1,null,null,7,30,2,5,null,null,null,null,2,10,null,null,null,null,2,5,0,20,null,null,"Continuous",0,14,9,20,25,40,200]
["East Gippsland Uplands","EGU","Limestone Box Forest","EGU_0015",1,"V","Vulnerable","Forest/Woodland","Woody","East Gippsland UplandsLimestone Box Forest","70",20,20,30,0,5,3,15,null,null,5,15,1,1,null,null,2,1,8,10,3,5,2,5,2,5,4,5,3,5,null,null,null,null,3,15,null,null,null,null,6,10,0,10,null,null,"Continuous",0,14,9,13,31,40,150]
["East Gippsland Uplands","EGU","Limestone Grassy Woodland","EGU_0175_62",1,"D","Depleted","Forest/Woodland","Woody","East Gippsland UplandsLimestone Grassy Woodland","70",15,15,15,4,5,3,10,null,null,3,15,2,5,null,null,4,5,8,15,3,10,1,5,null,null,5,25,1,5,null,null,null,null,2,5,null,null,null,null,3,5,0,10,null,null,"Continuous",0,13,8,15,30,20,150]
["East Gippsland Uplands","EGU","Limestone Pomaderris Shrubland","EGU_0133",1,"E","Endangered","Forest/Woodland","Woody","East Gippsland UplandsLimestone Pomaderris Shrubland","0",0,0,null,null,null,null,null,null,null,9,45,2,1,null,null,5,5,10,15,3,5,2,5,null,null,7,20,null,null,null,null,null,null,null,null,null,null,null,null,3,1,0,10,"0","10","Continuous",0,10,11,18,46,40,0]
["East Gippsland Uplands","EGU","Limestone Pomaderris Shrubland - treed","EGU_0133_61",1,"E","Endangered","Forest/Woodland","Woody","East Gippsland UplandsLimestone Pomaderris Shrubland - treed","60",10,10,10,0,5,2,10,null,null,9,45,2,1,null,null,5,5,10,15,3,5,2,5,null,null,7,20,null,null,null,null,null,null,null,null,null,null,null,null,3,1,0,10,"0","10","Continuous",0,12,13,18,56,40,50]
["East Gippsland Uplands","EGU","Lowland Forest","EGU_0016",1,"LC","Least Concern","Forest/Woodland","Woody","East Gippsland UplandsLowland Forest","70",20,25,30,0,5,2,10,null,null,7,25,3,10,1,1,1,1,4,10,null,null,1,5,2,10,3,10,1,1,null,null,null,null,1,5,null,null,null,null,3,5,0,10,null,null,"Continuous",0,14,12,5,45,40,200]
["East Gippsland Uplands","EGU","Lowland Herb-rich Forest","EGU_0877",1,"LC","Least Concern","Forest/Woodland","Woody","East Gippsland UplandsLowland Herb-rich Forest","70",20,20,30,0,5,null,null,null,null,4,20,2,5,null,null,4,10,8,15,null,null,1,5,1,0,5,15,null,null,null,null,null,null,null,null,null,null,"1","0",1,1,0,10,null,null,"Continuous",0,11,6,12,25,40,200]
["East Gippsland Uplands","EGU","Montane Damp Forest","EGU_0038",1,"LC","Least Concern","Forest/Woodland","Woody",{"$f":"CONCATENATE(A195,C195)","v":"East Gippsland UplandsMontane Damp Forest"},"90",20,30,40,0,5,3,20,null,null,7,25,4,10,1,1,3,5,8,15,2,5,1,1,null,null,6,15,1,1,null,null,null,null,2,10,"1","1",null,null,1,5,0,20,null,null,"Continuous",0,15,14,13,55,50,300]
["East Gippsland Uplands","EGU","Montane Dry Woodland","EGU_0036",1,"LC","Least Concern","Forest/Woodland","Woody","East Gippsland UplandsMontane Dry Woodland","50",15,15,20,0,5,2,20,"1","1",6,20,2,5,null,null,2,5,9,20,2,5,2,5,null,null,6,15,1,5,null,null,null,null,1,5,null,null,null,null,null,null,0,10,"0","10","Continuous",0,14,10,13,45,20,150]
["East Gippsland Uplands","EGU","Montane Grassy Woodland","EGU_0037",1,"V","Vulnerable","Forest/Woodland","Woody","East Gippsland UplandsMontane Grassy Woodland","50",15,10,20,0,5,1,5,null,null,2,10,3,5,1,1,1,1,8,20,2,5,1,5,null,null,5,25,1,5,null,null,null,null,1,1,null,null,null,null,1,1,0,10,"0","10","Continuous",0,15,6,11,20,20,150]
["East Gippsland Uplands","EGU","Montane Herb-rich Woodland","EGU_0319",1,"LC","Least Concern","Forest/Woodland","Woody","East Gippsland UplandsMontane Herb-rich Woodland","70",15,25,40,0,5,1,10,null,null,6,15,2,5,1,1,5,10,12,20,3,5,1,1,null,null,7,20,1,1,null,null,null,null,2,5,null,null,null,null,2,5,0,10,null,null,"Continuous",0,14,9,20,30,20,150]
["East Gippsland Uplands","EGU","Montane Riparian Thicket","EGU_0041",1.25,"LC","Least Concern","scrubs/shrublands/mallee without logs","Woody","East Gippsland UplandsMontane Riparian Thicket","0",15,0,null,null,null,null,null,null,null,3,5,null,null,null,null,null,null,null,null,2,1,2,40,null,null,2,1,null,null,null,null,null,null,3,20,"1","5","2","1",null,null,0,20,null,null,"Continuous",0,8,3,2,5,40,50]
["East Gippsland Uplands","EGU","Montane Riparian Woodland","EGU_0040",1,"E","Endangered","Forest/Woodland","Woody","East Gippsland UplandsMontane Riparian Woodland","60",15,10,15,0,5,1,10,null,null,3,10,3,5,null,null,4,10,12,20,4,10,3,5,1,1,6,30,3,5,null,null,null,null,2,5,null,null,null,null,null,null,0,20,null,null,"Continuous",0,13,7,20,25,40,150]
["East Gippsland Uplands","EGU","Montane Swamp","EGU_0318",1.36,"E","Endangered","wetlands","Woody","East Gippsland UplandsMontane Swamp","0",0,0,null,null,null,null,null,null,null,5,20,2,5,null,null,1,1,3,10,2,5,1,5,null,null,4,10,4,15,null,null,null,null,1,1,null,null,null,null,null,null,0,40,null,null,"Episodic",30,10,7,6,25,10,0]
["East Gippsland Uplands","EGU","Montane Wet Forest","EGU_0039",1,"LC","Least Concern","Forest/Woodland","Woody","East Gippsland UplandsMontane Wet Forest","90",20,30,40,0,5,5,30,null,null,5,25,1,1,null,null,null,null,3,5,null,null,1,1,1,1,2,10,null,null,null,null,null,null,4,30,"2","10",null,null,1,1,0,20,null,null,"Continuous",0,12,11,3,56,50,300]
["East Gippsland Uplands","EGU","Rainshadow Grassy Woodland","EGU_0175_61",1,"D","Depleted","Forest/Woodland","Woody","East Gippsland UplandsRainshadow Grassy Woodland","70",15,15,15,1,5,4,15,null,null,4,15,2,5,null,null,4,5,8,15,3,5,1,1,null,null,5,20,1,5,null,null,null,null,2,5,null,null,null,null,3,5,0,10,null,null,"Continuous",0,13,10,15,35,20,150]
["East Gippsland Uplands","EGU","Riparian Forest","EGU_0018",1,"LC","Least Concern","Forest/Woodland","Woody","East Gippsland UplandsRiparian Forest","80",20,30,40,0,5,4,15,null,null,11,30,null,null,null,null,3,5,9,10,2,5,3,5,1,5,6,10,2,5,null,null,null,null,4,15,"1","5",null,null,5,10,0,20,null,null,"Continuous",0,14,15,14,45,50,300]
["East Gippsland Uplands","EGU","Riparian Shrubland","EGU_0019",1.25,"R","Rare","scrubs/shrublands/mallee without logs","Woody","East Gippsland UplandsRiparian Shrubland","0",0,0,null,null,null,null,null,null,null,6,25,null,null,null,null,6,5,5,10,3,5,3,5,null,null,2,10,2,1,null,null,null,null,3,5,null,null,null,null,2,1,0,20,null,null,"Episodic",5,10,6,14,25,20,100]
["East Gippsland Uplands","EGU","Riverine Escarpment Scrub","EGU_0082",1.25,"LC","Least Concern","scrubs/shrublands/mallee without logs","Woody","East Gippsland UplandsRiverine Escarpment Scrub","0",0,0,null,0,5,null,null,null,null,10,30,1,1,null,null,2,5,9,15,2,1,2,1,null,null,4,10,1,1,null,null,null,null,3,10,null,null,null,null,2,5,0,10,null,null,"Continuous",0,12,11,13,31,40,50]
["East Gippsland Uplands","EGU","Rocky Outcrop Shrubland","EGU_0028",1.36,"R","Rare","heathlands","Woody","East Gippsland UplandsRocky Outcrop Shrubland","0",0,0,null,null,null,null,null,null,null,7,25,2,5,1,1,3,5,3,5,null,null,1,5,null,null,5,10,null,null,null,null,null,null,null,null,null,null,null,null,2,1,0,20,"0","10","Continuous",0,10,9,6,30,40,0]
["East Gippsland Uplands","EGU","Sand Heathland","EGU_0006",1.36,"TBC","TBC","heathlands","Woody","East Gippsland UplandsSand Heathland","0",0,0,null,null,null,null,null,null,null,5,30,5,20,null,null,null,null,2,5,2,5,1,5,1,1,1,1,2,5,null,null,null,null,1,5,null,null,null,null,null,null,0,10,"0","10","Episodic",20,11,10,4,50,40,0]
["East Gippsland Uplands","EGU","Sand Heathland - treed","EGU_0006_61",1,"TBC","TBC","heathlands","Woody","East Gippsland UplandsSand Heathland - treed","40/50",15,10,10,0,5,null,null,null,null,5,30,5,20,null,null,null,null,2,5,2,5,1,5,1,1,1,1,2,5,null,null,null,null,1,5,null,null,null,null,null,null,0,10,"0","10","Episodic",20,12,10,4,50,40,150]
["East Gippsland Uplands","EGU","Shrubby Damp Forest","EGU_0316",1,"LC","Least Concern","Forest/Woodland","Woody","East Gippsland UplandsShrubby Damp Forest","90",20,25,40,0,5,2,10,null,null,6,25,2,1,null,null,2,5,10,15,2,5,2,1,2,5,4,15,null,null,null,null,null,null,2,15,"1","5","1","0",3,5,0,20,null,null,"Continuous",0,15,10,14,36,80,300]
["East Gippsland Uplands","EGU","Shrubby Dry Forest","EGU_0021",1,"LC","Least Concern","Forest/Woodland","Woody","East Gippsland UplandsShrubby Dry Forest","70",20,25,30,0,5,1,10,null,null,6,30,2,5,null,null,null,null,5,5,null,null,1,1,2,5,3,10,1,1,null,null,null,null,2,5,null,null,null,null,3,5,0,10,"0","10","Episodic",20,13,9,5,45,30,200]
["East Gippsland Uplands","EGU","Shrubby Foothill Forest","EGU_0045",1,"LC","Least Concern","Forest/Woodland","Woody","East Gippsland UplandsShrubby Foothill Forest","70",20,25,40,0,5,2,10,null,null,9,30,5,15,1,1,2,5,5,5,1,1,2,5,1,1,4,5,1,1,null,null,null,null,1,5,null,null,null,null,2,1,0,10,null,null,"Episodic",30,15,16,8,55,40,200]
["East Gippsland Uplands","EGU","Shrubby Wet Forest","EGU_0201",1,"LC","Least Concern","Forest/Woodland","Woody","East Gippsland UplandsShrubby Wet Forest","90",20,30,40,0,5,2,20,null,null,7,25,3,10,null,null,2,1,8,15,2,1,1,1,null,null,6,15,1,1,null,null,null,null,2,5,null,null,null,null,null,null,0,20,null,null,"Continuous",0,12,12,12,55,50,300]
["East Gippsland Uplands","EGU","Sub-alpine Grassland","EGU_0206",1.36,"R","Rare","grasslands","Other grassland","East Gippsland UplandsSub-alpine Grassland","0",20,0,null,null,null,null,null,null,null,1,5,3,5,1,1,3,5,11,20,3,10,1,1,null,null,5,20,2,10,null,null,null,null,null,null,null,null,null,null,null,null,0,20,"0","10","Continuous",0,11,4,17,10,10,0]
["East Gippsland Uplands","EGU","Sub-alpine Shrubland","EGU_0042",1.25,"R","Rare","scrubs/shrublands/mallee without logs","Woody","East Gippsland UplandsSub-alpine Shrubland","0",0,0,null,null,null,null,null,null,null,6,40,4,15,2,1,3,5,8,15,2,5,null,null,null,null,5,20,1,5,null,null,null,null,null,null,null,null,null,null,null,null,0,20,null,null,"Continuous",0,9,10,13,55,40,100]
["East Gippsland Uplands","EGU","Sub-alpine Woodland","EGU_0043",1,"LC","Least Concern","Forest/Woodland","Woody","East Gippsland UplandsSub-alpine Woodland","40",15,10,15,0,5,1,5,null,null,5,20,2,10,null,null,3,10,8,20,2,5,null,null,null,null,4,20,1,5,null,null,null,null,1,1,null,null,null,null,null,null,0,20,"0","10","Continuous",0,12,8,13,35,20,100]
["East Gippsland Uplands","EGU","Swampy Riparian Woodland","EGU_0083",1,"E","Endangered","Forest/Woodland","Woody","East Gippsland UplandsSwampy Riparian Woodland","70",10,15,20,0,5,4,25,null,null,4,20,1,1,1,1,3,5,6,10,2,5,3,15,2,10,6,15,2,5,null,null,null,null,2,5,null,null,null,null,2,5,0,10,null,null,"Continuous",0,15,9,11,46,20,200]
["East Gippsland Uplands","EGU","Tableland Damp Forest","EGU_0035",1,"LC","Least Concern","Forest/Woodland","Woody","East Gippsland UplandsTableland Damp Forest","90",20,30,40,0,5,3,20,null,null,7,20,2,10,null,null,2,5,8,15,2,15,1,5,1,1,3,15,1,5,null,null,null,null,2,5,null,null,null,null,1,1,0,20,null,null,"Continuous",0,14,12,12,50,50,300]
["East Gippsland Uplands","EGU","Valley Grassy Forest","EGU_0047",1,"D","Depleted","Forest/Woodland","Woody","East Gippsland UplandsValley Grassy Forest","70",20,25,20,0,5,3,15,null,null,7,25,1,1,2,1,3,5,10,20,3,5,3,15,null,null,5,20,2,5,null,null,null,null,2,5,null,null,null,null,5,5,0,20,null,null,"Continuous",0,14,11,16,41,20,200]
["East Gippsland Uplands","EGU","Valley Heathy Forest","EGU_0127",1,"V","Vulnerable","Forest/Woodland","Woody","East Gippsland UplandsValley Heathy Forest","70",20,15,30,0,5,2,10,null,null,5,20,5,10,2,15,1,5,12,15,5,5,1,5,null,null,7,20,1,5,null,null,null,null,null,null,null,null,null,null,null,null,0,10,null,null,"Episodic",30,12,12,18,40,40,200]
["East Gippsland Uplands","EGU","Valley Slopes Dry Forest","EGU_0177",1,"R","Rare","Forest/Woodland","Woody","East Gippsland UplandsValley Slopes Dry Forest","70",20,20,30,0,5,2,15,null,null,5,20,null,null,1,5,1,5,3,10,1,5,null,null,null,null,3,10,1,5,null,null,null,null,null,null,null,null,null,null,2,5,0,10,null,null,"Continuous",0,11,7,5,35,40,200]
["East Gippsland Uplands","EGU","Warm Temperate Rainforest","EGU_0032",1,"R","Rare","Forest/Woodland","Woody","East Gippsland UplandsWarm Temperate Rainforest","70",20,20,50,0,5,5,30,null,null,6,15,null,null,null,null,2,1,5,10,1,1,1,1,1,1,2,5,1,1,null,null,null,null,8,25,"2","20","4","10",9,20,0,20,null,null,"Continuous",0,15,11,8,45,50,200]
["East Gippsland Uplands","EGU","Wet Forest","EGU_0030",1,"LC","Least Concern","Forest/Woodland","Woody","East Gippsland UplandsWet Forest","90",20,30,40,0,5,4,20,null,null,7,25,null,null,null,null,1,1,5,15,1,1,1,1,1,1,3,5,1,1,null,null,null,null,4,30,"2","15","1","1",4,10,0,20,null,null,"Continuous",0,15,11,7,45,50,300]
["East Gippsland Uplands","EGU","Wet Heathland","EGU_0008",1.36,"LC","Least Concern","heathlands","Woody","East Gippsland UplandsWet Heathland","0",10,0,null,null,null,null,null,null,null,7,30,3,5,null,null,2,5,4,5,null,null,2,10,3,10,4,10,3,10,null,null,null,null,1,1,null,null,null,null,2,10,0,20,null,null,"Episodic",30,11,10,6,35,20,0]
["Gippsland Plain","GipP","Aquatic Herbland","GipP0653",1.36,"E","Endangered","wetlands","Non-woody wetland","Gippsland PlainAquatic Herbland","0",0,0,null,null,null,null,null,null,null,null,null,null,null,null,null,2,10,3,20,3,15,2,20,null,null,2,10,1,5,null,null,null,null,null,null,null,null,null,null,null,null,null,null,null,null,"Episodic",5,6,null,8,null,10,0]
["Gippsland Plain","GipP","Banksia Woodland","GipP0014",1,"LC","Least Concern","Forest/Woodland","Woody","Gippsland PlainBanksia Woodland","50",15,10,15,0,5,1,5,null,null,10,25,7,15,null,null,1,1,5,10,1,1,3,10,1,5,5,10,2,5,null,null,null,null,2,10,null,null,null,null,3,1,0,10,null,null,"Episodic",30,14,18,7,45,40,150]
["Gippsland Plain","GipP","Berm Grassy Shrubland","GipP0311",1.36,"E","Endangered","grasslands","Woody","Gippsland PlainBerm Grassy Shrubland","0",0,0,null,null,null,null,null,null,null,2,20,2,5,null,null,2,5,2,10,2,5,1,1,null,null,2,25,2,10,null,null,null,null,null,null,null,null,null,null,null,null,null,null,null,null,"Continuous",0,8,4,6,25,10,0]
["Gippsland Plain","GipP","Bird Colony Succulent Herbland","GipP0155",1.36,"R","Rare","grasslands","Non-woody wetland","Gippsland PlainBird Colony Succulent Herbland","0",0,0,null,null,null,null,null,null,null,1,10,null,null,null,null,2,5,5,10,1,10,null,null,1,5,3,30,2,5,null,null,null,null,null,null,null,null,null,null,1,5,null,null,null,null,"Continuous",0,8,1,8,10,0,0]
["Gippsland Plain","GipP","Blocked Coastal Stream Swamp","GipP0875",1.36,"R","Rare","wetlands","Non-woody wetland","Gippsland PlainBlocked Coastal Stream Swamp","0",0,0,null,null,null,null,null,null,null,null,null,null,null,null,null,3,25,1,5,1,1,null,null,1,55,3,5,1,1,null,null,null,null,null,null,null,null,null,null,null,null,null,null,null,null,"Episodic",5,6,null,5,null,10,0]
["Gippsland Plain","GipP","Box Ironbark Forest","GipP0061",1,"V","Vulnerable","Forest/Woodland","Woody","Gippsland PlainBox Ironbark Forest","70",15,20,30,0,5,null,null,null,null,4,20,3,10,2,1,2,5,10,15,2,1,1,1,null,null,5,10,null,null,null,null,null,null,1,1,null,null,null,null,null,null,0,10,"0","20","Continuous",0,12,7,14,30,20,200]
["Gippsland Plain","GipP","Brackish Grassland","GipP0934",1.36,"E","Endangered","grasslands","Other grassland","Gippsland PlainBrackish Grassland","0",0,0,null,null,null,null,null,null,null,null,null,null,null,null,null,1,1,3,5,5,5,2,20,null,null,4,20,1,10,null,null,null,null,null,null,null,null,null,null,null,null,0,10,null,null,"Continuous",0,7,null,9,null,10,0]
["Gippsland Plain","GipP","Brackish Wetland","GipP0656",1.36,"E","Endangered","wetlands","Non-woody wetland","Gippsland PlainBrackish Wetland","0",0,0,null,null,null,null,null,null,null,null,null,null,null,null,null,1,5,4,20,2,5,1,15,1,10,2,5,3,15,null,null,null,null,null,null,null,null,null,null,1,5,null,null,null,null,"Episodic",5,8,null,7,null,10,0]
["Gippsland Plain","GipP","Calcareous Swale Grassland","GipP0309",1.36,"V","Vulnerable","grasslands","Other grassland","Gippsland PlainCalcareous Swale Grassland","0",0,0,null,null,null,null,null,null,null,3,30,1,1,1,1,1,1,2,5,2,5,2,5,null,null,4,10,1,20,null,null,null,null,null,null,null,null,null,null,2,5,0,20,null,null,"Continuous",0,11,4,5,31,10,0]
["Gippsland Plain","GipP","Clay Heathland","GipP0007",1.36,"D","Depleted","heathlands","Woody","Gippsland PlainClay Heathland","0",0,0,null,null,null,null,null,null,null,6,40,7,10,2,1,2,1,8,10,2,1,3,5,null,null,4,5,4,5,null,null,null,null,2,1,null,null,null,null,null,null,0,10,"0","10","Episodic",30,12,13,12,50,20,0]
["Gippsland Plain","GipP","Coast Banksia Woodland","GipP0002",1,"V","Vulnerable","Forest/Woodland","Woody","Gippsland PlainCoast Banksia Woodland","50/70",10,15,15,0,5,null,null,null,null,3,40,1,1,null,null,2,1,3,15,2,10,1,1,null,null,1,5,1,10,null,null,null,null,1,10,null,null,null,null,2,10,0,20,null,null,"Episodic",30,12,4,7,41,40,100]
["Gippsland Plain","GipP","Coastal Alkaline Scrub","GipP0858",1.1499999999999999,"V","Vulnerable","scrubs/shrublands/mallee with logs","Woody","Gippsland PlainCoastal Alkaline Scrub","0",0,0,null,null,null,null,null,null,null,4,30,2,5,null,null,1,1,5,10,2,5,1,5,null,null,4,10,2,5,null,null,null,null,null,null,null,null,null,null,2,1,0,20,null,null,"Continuous",0,10,6,8,35,40,50]
["Gippsland Plain","GipP","Coastal Dune Grassland","GipP0879",1.36,"D","Depleted","grasslands","Other grassland","Gippsland PlainCoastal Dune Grassland","0",0,0,null,null,null,null,null,null,null,1,5,1,5,1,1,2,5,4,5,3,10,null,null,null,null,3,10,2,25,null,null,null,null,null,null,null,null,null,null,1,1,null,null,null,null,"Continuous",0,9,2,9,10,10,0]
["Gippsland Plain","GipP","Coastal Dune Scrub","GipP0160",1.36,"D","Depleted","heathlands","Woody","Gippsland PlainCoastal Dune Scrub","0",0,0,null,null,null,null,null,null,null,6,50,null,null,null,null,1,1,3,10,1,1,2,5,null,null,6,15,1,1,null,null,null,null,null,null,null,null,null,null,3,5,0,10,null,null,"Episodic",30,9,6,5,50,40,0]
["Gippsland Plain","GipP","Coastal Headland Scrub","GipP0161",1.36,"D","Depleted","heathlands","Woody","Gippsland PlainCoastal Headland Scrub","0",0,0,null,null,null,null,null,null,null,7,50,2,5,null,null,2,1,4,5,2,5,1,1,null,null,4,10,2,5,null,null,null,null,null,null,null,null,null,null,2,5,0,10,null,null,"Continuous",0,10,9,8,55,40,0]
["Gippsland Plain","GipP","Coastal Lagoon Wetland","GipP0011",1.36,"V","Vulnerable","wetlands","Non-woody wetland","Gippsland PlainCoastal Lagoon Wetland","0",0,0,null,null,null,null,null,null,null,4,15,2,1,null,null,1,1,2,5,1,1,1,5,2,15,1,5,2,5,null,null,null,null,1,5,null,null,null,null,1,1,0,10,null,null,"Continuous",0,12,6,4,16,20,0]
["Gippsland Plain","GipP","Coastal Saltmarsh","GipP0009",1.36,"LC","Least Concern","grasslands","Non-woody wetland","Gippsland PlainCoastal Saltmarsh","0",0,0,null,null,null,null,null,null,null,2,20,1,1,null,null,null,null,3,20,2,15,null,null,1,1,1,5,2,10,null,null,null,null,null,null,null,null,null,null,null,null,null,null,"0","10","Continuous",0,8,3,5,21,10,0]
["Gippsland Plain","GipP","Coastal Tussock Grassland","GipP0163",1.36,"V","Vulnerable","grasslands","Other grassland","Gippsland PlainCoastal Tussock Grassland","0",0,0,null,null,null,null,null,null,null,3,20,1,5,1,1,2,5,5,10,3,5,3,10,null,null,4,25,2,5,null,null,null,null,null,null,null,null,null,null,null,null,0,10,"0","10","Continuous",0,11,4,10,25,20,0]
["Gippsland Plain","GipP","Creekline Grassy Woodland","GipP0068",1,"E","Endangered","Forest/Woodland","Woody","Gippsland PlainCreekline Grassy Woodland","80",15,15,15,0,5,2,10,null,null,2,5,2,1,null,null,2,5,8,15,1,1,3,15,null,null,12,20,3,15,null,null,null,null,null,null,null,null,null,null,null,null,0,10,null,null,"Continuous",0,11,6,11,16,40,200]
["Gippsland Plain","GipP","Creekline Herb-rich Woodland","GipP0164",1,"E","Endangered","Forest/Woodland","Woody","Gippsland PlainCreekline Herb-rich Woodland","70",10,15,20,0,5,2,10,null,null,5,15,null,null,null,null,2,1,5,5,1,1,3,15,1,5,2,5,2,10,null,null,null,null,2,20,null,null,null,null,1,0,0,20,null,null,"Continuous",0,13,7,8,25,20,100]
["Gippsland Plain","GipP","Damp Forest","GipP0029",1,"E","Endangered","Forest/Woodland","Woody","Gippsland PlainDamp Forest","90",20,30,40,0,5,3,20,null,null,9,25,2,5,1,1,2,1,6,10,1,1,3,5,1,5,3,5,1,1,null,null,null,null,3,20,"1","5",null,null,4,10,0,20,null,null,"Continuous",0,16,14,9,50,50,300]
["Gippsland Plain","GipP","Damp Heathland","GipP0710",1.36,"R","Rare","heathlands","Woody","Gippsland PlainDamp Heathland","0",0,0,null,null,null,null,null,null,null,5,50,5,10,1,1,null,null,4,10,3,10,2,5,1,1,4,5,2,10,null,null,null,null,null,null,null,null,null,null,3,5,0,20,null,null,"Episodic",30,11,10,7,60,20,0]
["Gippsland Plain","GipP","Damp Heathy Woodland","GipP0793",1,"V","Vulnerable","Forest/Woodland","Woody","Gippsland PlainDamp Heathy Woodland","60",10,10,15,0,5,null,null,null,null,5,30,4,5,2,1,null,null,3,5,3,20,2,5,null,null,3,10,1,5,null,null,null,null,1,5,null,null,null,null,null,null,0,20,"0","10","Episodic",30,12,9,6,35,20,100]
["Gippsland Plain","GipP","Damp Sands Herb-rich Woodland","GipP0003",1,"V","Vulnerable","Forest/Woodland","Woody","Gippsland PlainDamp Sands Herb-rich Woodland","70",15,15,15,0,5,1,5,null,null,5,25,3,5,1,1,2,5,8,15,5,10,2,10,1,1,4,10,2,10,null,null,null,null,1,15,null,null,null,null,null,null,0,10,null,null,"Continuous",0,14,9,15,35,40,150]
["Gippsland Plain","GipP","Deep Freshwater Marsh","GipP0681",1.36,"V","Vulnerable","wetlands","Non-woody wetland","Gippsland PlainDeep Freshwater Marsh","0",null,0,null,null,null,null,null,null,null,null,null,null,null,null,null,null,null,null,null,null,null,null,null,null,null,null,null,null,null,null,null,null,null,null,null,null,null,null,null,null,null,null,null,null,null,null,5,0,null,null,null,null,0]
["Gippsland Plain","GipP","Dry Rainforest","GipP0034",1,"E","Endangered","Forest/Woodland","Woody","Gippsland PlainDry Rainforest","60",10,15,50,0,5,3,20,null,null,9,20,null,null,null,null,5,5,12,15,5,5,2,5,null,null,3,5,3,5,null,null,null,null,5,10,null,null,"2","1",6,10,0,20,null,null,"Continuous",0,13,12,22,40,50,100]
["Gippsland Plain","GipP","Dry Valley Forest","GipP0169",1,"E","Endangered","Forest/Woodland","Woody","Gippsland PlainDry Valley Forest","70",20,20,30,0,5,2,10,null,null,4,30,null,null,null,null,null,null,9,20,4,10,1,5,null,null,1,5,2,10,null,null,null,null,3,10,null,null,null,null,3,5,0,10,null,null,"Continuous",0,11,6,13,40,40,200]
["Gippsland Plain","GipP","Escarpment Shrubland","GipP0895",1.1499999999999999,"E","Endangered","Forest/Woodland","Woody","Gippsland PlainEscarpment Shrubland","0",0,0,null,null,null,null,null,null,null,3,10,2,5,null,null,3,5,4,10,5,5,1,5,1,5,9,25,3,5,null,null,null,null,1,5,null,null,null,null,1,5,0,20,"0","10","Continuous",0,13,5,12,15,20,150]
["Gippsland Plain","GipP","Escarpment Shrubland - treed","GipP0895_61",1,"E","Endangered","Forest/Woodland","Woody","Gippsland PlainEscarpment Shrubland - treed","70",15,0,0,0,5,3,10,null,null,3,10,2,5,null,null,3,5,4,10,5,5,1,5,1,5,9,25,3,5,null,null,null,null,1,5,null,null,null,null,1,5,0,20,"0","10","Continuous",0,15,8,12,25,20,150]
["Gippsland Plain","GipP","Estuarine Flats Grassland","GipP0914",1.36,"E","Endangered","wetlands","Non-woody wetland","Gippsland PlainEstuarine Flats Grassland","0",0,0,null,null,null,null,null,null,null,2,5,1,5,null,null,1,1,3,15,4,15,2,15,null,null,2,20,3,15,null,null,null,null,null,null,null,null,null,null,null,null,null,null,null,null,"Continuous",0,8,3,8,10,10,0]
["Gippsland Plain","GipP","Estuarine Scrub","GipP0953",1.1499999999999999,"TBC","TBC","scrubs/shrublands/mallee without logs","Woody","Gippsland PlainEstuarine Scrub","0",0,6,50,null,null,null,null,null,null,2,10,null,null,null,null,null,null,3,20,2,5,null,null,null,null,2,10,2,15,null,null,null,null,null,null,null,null,null,null,null,null,null,null,null,null,"Continuous",0,5,2,5,10,20,50]
["Gippsland Plain","GipP","Estuarine Wetland","GipP0010",1.36,"E","Endangered","scrubs/shrublands/mallee without logs","Woody","Gippsland PlainEstuarine Wetland","0",0,0,null,null,null,null,null,null,null,1,10,2,5,null,null,2,5,6,20,2,10,2,10,1,5,2,5,3,20,null,null,null,null,null,null,null,null,null,null,null,null,null,null,null,null,"Episodic",5,9,3,10,15,10,0]
["Gippsland Plain","GipP","Floodplain Reedbed","GipP0863",1.36,"E","Endangered","wetlands","Non-woody wetland","Gippsland PlainFloodplain Reedbed","0",0,0,null,null,null,null,null,null,null,1,5,null,null,null,null,2,10,2,5,2,5,null,null,2,30,1,5,null,null,null,null,null,null,null,null,null,null,null,null,1,1,null,null,null,null,"Episodic",5,7,1,6,5,10,0]
["Gippsland Plain","GipP","Floodplain Riparian Woodland","GipP0056",1,"E","Endangered","Forest/Woodland","Woody","Gippsland PlainFloodplain Riparian Woodland","80",15,20,20,0,5,2,10,null,null,5,15,null,null,null,null,7,15,5,10,2,5,2,10,1,10,5,10,2,10,null,null,null,null,null,null,null,null,null,null,2,5,0,10,null,null,"Episodic",5,12,7,14,25,40,300]
["Gippsland Plain","GipP","Gallery Rainforest","GipP0135",1,"E","Endangered","Forest/Woodland","Woody",{"$f":"CONCATENATE(A259,C259)","v":"Gippsland PlainGallery Rainforest"},"70",20,20,50,0,5,4,20,null,null,12,30,2,5,1,1,1,1,6,10,2,1,4,15,1,1,4,5,2,5,null,null,null,null,6,20,"1","1","2","5",8,10,0,20,null,null,"Continuous",0,17,18,9,55,40,200]
["Gippsland Plain","GipP","Granitic Hills Woodland","GipP0072",1,"TBC","TBC","Forest/Woodland","Woody","Gippsland PlainGranitic Hills Woodland","60",15,10,10,0,5,2,10,null,null,5,10,5,5,null,null,1,5,5,5,5,5,2,5,null,null,3,15,2,10,null,null,null,null,2,5,null,null,null,null,1,1,0,10,null,null,"Continuous",0,13,12,11,25,40,150]
["Gippsland Plain","GipP","Grassy Dry Forest","GipP0022",1,"LC","Least Concern","Forest/Woodland","Woody","Gippsland PlainGrassy Dry Forest","60",20,20,30,3,5,2,10,null,null,9,20,4,5,2,1,2,5,8,15,2,5,3,5,null,null,11,30,2,10,null,null,null,null,null,null,null,null,null,null,3,5,0,10,"0","10","Continuous",0,14,15,12,35,20,200]
["Gippsland Plain","GipP","Grassy Forest","GipP0128",1,"E","Endangered","Forest/Woodland","Woody","Gippsland PlainGrassy Forest","70",20,20,20,0,5,2,10,null,null,4,10,2,1,2,5,1,1,5,10,3,5,2,5,1,1,3,45,null,null,null,null,null,null,1,1,null,null,null,null,3,5,0,10,null,null,"Continuous",0,14,8,9,21,40,200]
["Gippsland Plain","GipP","Grassy Woodland","GipP0175",1,"E","Endangered","Forest/Woodland","Woody","Gippsland PlainGrassy Woodland","40/70",15,15,15,0,5,2,10,null,null,6,15,2,5,2,1,2,5,8,10,3,5,2,10,1,10,6,20,2,10,null,null,null,null,1,5,null,null,null,null,2,5,0,10,null,null,"Continuous",0,15,10,13,30,20,150]
["Gippsland Plain","GipP","Gully Woodland","GipP0902",1,"E","Endangered","Forest/Woodland","Woody","Gippsland PlainGully Woodland","70",10,20,20,0,5,4,15,null,null,6,15,1,1,null,null,2,1,6,10,2,5,2,5,1,5,8,20,2,10,null,null,null,null,3,10,null,null,null,null,4,10,0,20,null,null,"Continuous",0,14,11,10,31,20,100]
["Gippsland Plain","GipP","Heathy Woodland","GipP0048",1,"LC","Least Concern","Forest/Woodland","Woody","Gippsland PlainHeathy Woodland","40/50",15,10,10,0,5,null,null,null,null,5,30,5,20,null,null,null,null,2,5,2,5,1,5,1,1,1,5,2,5,null,null,null,null,1,5,null,null,null,null,null,null,0,10,"0","10","Episodic",20,12,10,4,50,40,150]
["Gippsland Plain","GipP","Herb-rich Foothill Forest","GipP0023",1,"V","Vulnerable","Forest/Woodland","Woody","Gippsland PlainHerb-rich Foothill Forest","70",20,25,40,0,5,2,10,null,null,5,10,2,5,1,1,2,1,7,10,2,1,1,5,2,5,3,20,1,1,null,null,null,null,2,25,null,null,null,null,2,5,0,20,null,null,"Continuous",0,15,9,11,25,40,200]
["Gippsland Plain","GipP","Plains Grassland - LaTrobe Valley ","GipP0132_61",1.36,"E","Endangered","grasslands","High rain. VVP/GiP grassland","Gippsland PlainPlains Grassland - LaTrobe Valley ","0",0,0,null,null,null,null,null,null,null,null,null,1,1,null,null,2,5,12,30,3,5,1,1,null,null,10,40,2,5,null,null,null,null,null,null,null,null,null,null,null,null,0,10,null,null,"Episodic",5,8,1,17,1,10,0]
["Gippsland Plain","GipP","Limestone Box Forest","GipP0015",1,"V","Vulnerable","Forest/Woodland","Woody","Gippsland PlainLimestone Box Forest","70",20,20,25,0,5,3,20,null,null,2,5,null,null,null,null,2,1,4,10,2,5,null,null,null,null,null,null,2,5,null,null,null,null,3,15,null,null,null,null,4,10,0,10,null,null,"Continuous",0,10,5,8,25,20,150]
["Gippsland Plain","GipP","Limestone Pomaderris Shrubland","GipP0133",1.25,"E","Endangered","Forest/Woodland","Woody","Gippsland PlainLimestone Pomaderris Shrubland","0",0,0,null,null,null,null,null,null,null,9,45,2,1,null,null,5,5,10,15,3,5,2,1,null,null,7,30,null,null,null,null,null,null,null,null,null,null,null,null,3,1,0,10,"0","10","Continuous",0,10,11,18,46,20,0]
["Gippsland Plain","GipP","Limestone Pomaderris Shrubland - treed","GipP0133_61",1,"E","Endangered","Forest/Woodland","Woody","Gippsland PlainLimestone Pomaderris Shrubland - treed","60",10,10,10,0,5,2,10,null,null,9,45,2,1,null,null,5,5,10,15,3,5,2,1,null,null,7,30,null,null,null,null,null,null,null,null,null,null,null,null,3,1,0,10,"0","10","Continuous",0,12,13,18,56,20,50]
["Gippsland Plain","GipP","Lowland Forest","GipP0016",1,"V","Vulnerable","Forest/Woodland","Woody","Gippsland PlainLowland Forest","70",20,20,30,0,5,2,10,null,null,7,30,5,10,2,5,1,1,7,10,7,5,2,15,1,5,7,15,1,1,null,null,null,null,2,15,null,null,null,null,3,1,0,10,null,null,"Continuous",0,15,14,15,50,40,200]
["Gippsland Plain","GipP","Lowland Herb-rich Forest","GipP0877",1,"D","Depleted","Forest/Woodland","Woody","Gippsland PlainLowland Herb-rich Forest","70",20,20,30,0,5,3,10,null,null,4,20,1,1,1,5,2,5,13,30,4,5,1,15,null,null,5,5,2,10,null,null,null,null,null,null,null,null,null,null,null,null,0,10,null,null,"Continuous",0,12,8,19,31,40,200]
["Gippsland Plain","GipP","Mangrove Shrubland","GipP0140",1.36,"LC","Least Concern","heathlands","Woody","Gippsland PlainMangrove Shrubland","0",0,0,null,null,null,null,null,null,null,1,40,null,null,null,null,null,null,null,null,null,null,null,null,null,null,null,null,1,5,null,null,null,null,null,null,null,null,null,null,null,null,null,null,null,null,"Continuous",0,2,1,null,40,0,0]
["Gippsland Plain","GipP","Plains Grassy Forest","GipP0151",1,"V","Vulnerable","Forest/Woodland","Woody","Gippsland PlainPlains Grassy Forest","70",20,20,30,0,5,3,15,null,null,6,20,3,5,2,5,3,5,6,10,2,5,2,10,1,5,4,15,2,1,null,null,null,null,2,10,null,null,null,null,null,null,0,10,null,null,"Continuous",0,14,12,11,40,20,200]
["Gippsland Plain","GipP","Plains Grassy Wetland","GipP0125",1.36,"E","Endangered","wetlands","Non-woody wetland","Gippsland PlainPlains Grassy Wetland","0",0,0,null,null,null,null,null,null,null,null,null,null,null,null,null,3,10,10,20,2,10,2,5,2,10,10,20,4,10,null,null,null,null,null,null,null,null,null,null,null,null,0,10,null,null,"Episodic",5,8,null,15,null,10,50]
["Gippsland Plain","GipP","Plains Grassy Woodland","GipP0055",1,"E","Endangered","Forest/Woodland","Woody","Gippsland PlainPlains Grassy Woodland","80",10,15,20,0,5,1,5,null,null,2,10,1,1,1,1,1,5,10,20,3,5,2,5,1,10,9,35,2,10,null,null,null,null,null,null,null,null,null,null,null,null,0,10,null,null,"Continuous",0,13,4,14,16,10,100]
["Gippsland Plain","GipP","Plains Swampy Woodland","GipP0651",1,"E","Endangered","Forest/Woodland","Woody","Gippsland PlainPlains Swampy Woodland","80",10,15,10,0,5,1,5,null,null,3,15,null,null,null,null,3,5,8,20,4,5,3,30,1,1,7,10,2,5,null,null,null,null,null,null,null,null,null,null,null,null,0,20,null,null,"Continuous",0,11,4,15,20,10,100]
["Gippsland Plain","GipP","Riparian Forest","GipP0018",1,"V","Vulnerable","Forest/Woodland","Woody","Gippsland PlainRiparian Forest","80",20,30,40,0,5,2,15,null,null,8,25,1,5,null,null,3,5,10,10,2,5,3,15,1,5,4,10,3,10,null,null,null,null,3,15,"1","1",null,null,2,5,0,20,null,null,"Continuous",0,15,11,15,45,50,300]
["Gippsland Plain","GipP","Riparian Scrub","GipP0191",1.25,"V","Vulnerable","scrubs/shrublands/mallee without logs","Woody","Gippsland PlainRiparian Scrub","0",0,0,null,null,null,null,null,null,null,3,10,1,1,null,null,null,null,1,1,1,1,1,10,1,5,1,1,3,15,null,null,null,null,1,5,null,null,null,null,2,15,0,20,null,null,"Continuous",0,11,4,2,11,40,0]
["Gippsland Plain","GipP","Riparian Shrubland","GipP0019",1.25,"E","Endangered","scrubs/shrublands/mallee without logs","Woody","Gippsland PlainRiparian Shrubland","0",0,0,null,null,null,null,null,null,null,9,25,null,null,null,null,4,5,9,15,2,5,3,5,null,null,3,10,2,1,null,null,null,null,4,10,null,null,null,null,2,5,0,10,null,null,"Episodic",5,10,9,15,25,20,100]
["Gippsland Plain","GipP","Riparian Thicket","GipP0059",1.25,"V","Vulnerable","heathlands","Woody","Gippsland PlainRiparian Thicket","0",0,6,50,null,null,null,null,null,null,8,30,3,5,1,1,2,5,5,10,1,5,3,10,2,5,2,5,3,15,null,null,null,null,3,10,"1","5",null,null,2,5,0,20,null,null,"Continuous",0,14,11,8,35,40,0]
["Gippsland Plain","GipP","Riparian Woodland","GipP0641",1,"E","Endangered","Forest/Woodland","Woody","Gippsland PlainRiparian Woodland","80",15,20,20,0,5,2,10,null,null,4,10,1,5,null,null,4,15,5,10,1,5,3,15,1,5,4,20,2,5,null,null,null,null,null,null,null,null,null,null,1,5,0,10,null,null,"Continuous",0,13,7,10,25,30,200]
["Gippsland Plain","GipP","Riverine Escarpment Scrub","GipP0082",1.25,"E","Endangered","scrubs/shrublands/mallee without logs","Woody","Gippsland PlainRiverine Escarpment Scrub","0",0,0,null,0,5,null,null,null,null,10,20,null,null,null,null,4,5,13,20,6,10,2,5,null,null,6,10,2,10,null,null,null,null,7,20,null,null,null,null,4,5,0,10,null,null,"Continuous",0,11,10,23,20,40,50]
["Gippsland Plain","GipP","Sand Forest","GipP0134",1,"TBC","TBC","Forest/Woodland","Woody","Gippsland PlainSand Forest","70",15,20,30,3,5,1,5,null,null,3,5,1,5,2,5,null,null,2,5,null,null,1,1,null,null,7,15,2,1,null,null,null,null,1,50,null,null,null,null,null,null,0,10,null,null,"Continuous",0,11,5,2,15,40,150]
["Gippsland Plain","GipP","Sand Heathland","GipP0006",1.36,"R","Rare","heathlands","Woody","Gippsland PlainSand Heathland","0",0,0,null,null,null,null,null,null,null,7,55,4,10,null,null,null,null,3,5,2,5,1,5,1,1,2,5,2,15,null,null,null,null,1,1,null,null,null,null,null,null,0,10,"0","10","Episodic",30,11,11,5,65,20,0]
["Gippsland Plain","GipP","Sandy Flood Scrub","GipP0141",1.25,"E","Endangered","scrubs/shrublands/mallee without logs","Woody","Gippsland PlainSandy Flood Scrub","0",0,0,null,null,null,null,null,null,null,3,15,1,1,null,null,null,null,2,5,1,1,3,15,1,10,1,1,2,5,null,null,null,null,1,5,null,null,null,null,null,null,0,20,null,null,"Episodic",5,10,4,3,16,10,50]
["Gippsland Plain","GipP","Sandy Stream Woodland","GipP0674",1,"TBC","TBC","Forest/Woodland","Woody","Gippsland PlainSandy Stream Woodland","80",10,15,10,0,5,2,15,null,null,5,15,null,null,null,null,null,null,6,10,3,5,2,10,2,20,10,30,3,5,null,null,null,null,2,5,"1","1",null,null,null,null,0,10,null,null,"Continuous",0,12,7,9,30,40,200]
["Gippsland Plain","GipP","Seasonally Inundated Shrubby Woodland","GipP0195",1,"E","Endangered","Forest/Woodland","Woody","Gippsland PlainSeasonally Inundated Shrubby Woodland","0",null,0,null,null,null,null,null,null,null,null,null,null,null,null,null,null,null,null,null,null,null,null,null,null,null,null,null,null,null,null,null,null,null,null,null,null,null,null,null,null,null,null,null,null,null,null,0,0,null,null,null,null,0]
["Gippsland Plain","GipP","Sedge Wetland","GipP0136",1.36,"V","Vulnerable","wetlands","Non-woody wetland","Gippsland PlainSedge Wetland","0",0,0,null,null,null,null,null,null,null,1,5,null,null,null,null,1,5,4,10,null,null,1,15,2,30,1,1,2,10,null,null,null,null,null,null,null,null,null,null,null,null,0,10,null,null,"Episodic",5,8,1,5,5,10,0]
["Gippsland Plain","GipP","Sedgy Swamp Woodland","GipP0707",1,"E","Endangered","Forest/Woodland","Woody","Gippsland PlainSedgy Swamp Woodland","80",10,15,10,0,5,null,null,null,null,2,5,null,null,null,null,3,5,6,10,5,5,1,10,2,40,4,5,2,1,null,null,null,null,null,null,null,null,null,null,null,null,0,5,null,null,"Continuous",0,10,2,14,5,20,100]
["Gippsland Plain","GipP","Shrubby Damp Forest","GipP0316",1,"LC","Least Concern","Forest/Woodland","Woody","Gippsland PlainShrubby Damp Forest","90",20,30,40,0,5,4,20,null,null,8,20,2,10,1,1,4,5,8,15,2,5,2,5,1,1,3,10,1,5,null,null,null,null,2,15,"1","1",null,null,2,5,0,20,null,null,"Continuous",0,16,14,14,50,50,300]
["Gippsland Plain","GipP","Shrubby Dry Forest","GipP0021",1,"LC","Least Concern","Forest/Woodland","Woody","Gippsland PlainShrubby Dry Forest","60",20,25,30,0,5,1,5,null,null,11,40,9,15,1,1,null,null,4,5,null,null,null,null,null,null,4,5,1,1,null,null,null,null,1,1,null,null,null,null,null,null,0,10,null,null,"Episodic",20,10,21,4,60,20,200]
["Gippsland Plain","GipP","Shrubby Foothill Forest","GipP0045",1,"E","Endangered","Forest/Woodland","Woody","Gippsland PlainShrubby Foothill Forest","70",20,25,40,0,5,1,5,null,null,8,35,3,10,1,5,null,null,3,5,1,1,2,5,1,10,2,5,null,null,null,null,null,null,2,10,null,null,null,null,1,1,0,10,null,null,"Episodic",30,13,12,4,50,40,200]
["Gippsland Plain","GipP","Shrubby Gully Forest","GipP0938",1,"TBC","TBC","Forest/Woodland","Woody","Gippsland PlainShrubby Gully Forest","70",20,20,30,0,5,2,10,null,null,5,20,null,null,null,null,null,null,5,10,3,5,3,15,2,10,3,10,1,5,null,null,null,null,4,20,null,null,null,null,2,1,0,20,null,null,"Continuous",0,12,7,8,30,20,150]
["Gippsland Plain","GipP","Plains Grassland - South Gippsland ","GipP0132_62",1.36,"E","Endangered","grasslands","High rain. VVP/GiP grassland","Gippsland PlainPlains Grassland - South Gippsland ","0",0,0,null,null,null,null,null,null,null,null,null,null,null,null,null,5,5,12,5,6,5,3,10,null,null,5,50,2,10,null,null,null,null,null,null,null,null,null,null,null,null,0,10,null,null,"Episodic",5,7,null,23,null,10,0]
["Gippsland Plain","GipP","Spray-zone Coastal Shrubland","GipP0876",1.36,"TBC","TBC","scrubs/shrublands/mallee without logs","Woody","Gippsland PlainSpray-zone Coastal Shrubland","0",0,0,null,null,null,null,null,null,null,2,5,4,30,null,null,null,null,2,5,4,5,2,5,null,null,4,10,1,1,null,null,null,null,null,null,null,null,null,null,1,5,null,null,"0","10","Continuous",0,9,6,6,35,10,0]
["Gippsland Plain","GipP","Swamp Scrub","GipP0053",1.25,"E","Endangered","scrubs/shrublands/mallee without logs","Woody","Gippsland PlainSwamp Scrub","0",0,8,50,0,null,null,null,null,null,2,10,2,1,null,null,2,5,3,15,2,5,2,10,3,10,2,5,2,15,null,null,null,null,1,5,null,null,null,null,1,1,0,20,null,null,"Continuous",0,12,4,7,11,40,0]
["Gippsland Plain","GipP","Swampy Riparian Woodland","GipP0083",1,"E","Endangered","Forest/Woodland","Woody","Gippsland PlainSwampy Riparian Woodland","70",15,15,20,0,5,4,30,null,null,5,20,1,1,1,1,3,5,7,10,3,5,3,15,1,5,5,10,2,10,null,null,null,null,2,10,null,null,null,null,2,5,0,10,null,null,"Continuous",0,15,10,13,51,20,200]
["Gippsland Plain","GipP","Swampy Woodland","GipP0937",1,"E","Endangered","Forest/Woodland","Woody","Gippsland PlainSwampy Woodland","70",15,15,15,0,5,1,5,null,null,2,20,null,null,null,null,null,null,5,10,3,10,4,30,2,10,4,10,null,null,null,null,null,null,null,null,null,null,null,null,null,null,0,20,null,null,"Continuous",0,9,3,8,25,20,150]
["Gippsland Plain","GipP","Tall Marsh","GipP0821",1.36,"TBC","TBC","wetlands","Non-woody wetland","Gippsland PlainTall Marsh","0",0,0,null,null,null,null,null,null,null,null,null,null,null,null,null,3,10,2,5,6,10,1,5,2,40,null,null,1,1,null,null,null,null,null,null,null,null,null,null,null,null,null,null,null,null,"Episodic",5,6,null,11,null,10,0]
["Gippsland Plain","GipP","Valley Grassy Forest","GipP0047",1,"V","Vulnerable","Forest/Woodland","Woody","Gippsland PlainValley Grassy Forest","70",20,20,20,0,5,2,10,null,null,2,15,null,null,1,1,2,5,11,25,3,5,2,5,2,10,16,40,2,5,null,null,null,null,null,null,null,null,null,null,1,1,0,20,null,null,"Continuous",0,13,4,16,25,20,200]
["Gippsland Plain","GipP","Valley Heathy Forest","GipP0127",1,"E","Endangered","Forest/Woodland","Woody","Gippsland PlainValley Heathy Forest","70",20,15,30,0,5,2,10,null,null,7,15,5,5,2,1,null,null,6,10,3,5,2,5,2,20,7,15,1,1,null,null,null,null,1,1,null,null,null,null,3,5,0,10,null,null,"Episodic",30,14,14,9,30,40,200]
["Gippsland Plain","GipP","Warm Temperate Rainforest","GipP0032",1,"E","Endangered","Forest/Woodland","Woody","Gippsland PlainWarm Temperate Rainforest","70",20,20,50,0,5,3,30,null,null,2,10,null,null,null,null,2,5,3,5,1,5,1,1,null,null,1,1,2,5,null,null,null,null,4,25,null,null,"1","5",7,20,0,20,null,null,"Continuous",0,13,5,6,40,50,200]
["Gippsland Plain","GipP","Wet Forest","GipP0030",1,"D","Depleted","Forest/Woodland","Woody","Gippsland PlainWet Forest","90",20,30,40,0,5,3,20,null,null,6,15,null,null,null,null,1,1,6,10,2,1,2,5,1,1,3,15,1,10,null,null,null,null,4,15,"1","15",null,null,2,5,0,20,null,null,"Continuous",0,14,9,9,35,50,300]
["Gippsland Plain","GipP","Wet Heathland","GipP0008",1.36,"D","Depleted","heathlands","Woody","Gippsland PlainWet Heathland","0",0,0,null,null,null,null,null,null,null,6,40,3,5,1,1,null,null,3,5,2,5,1,5,2,10,2,5,5,20,null,null,null,null,1,1,null,null,null,null,null,null,0,20,null,null,"Episodic",30,11,9,5,45,20,0]
["Gippsland Plain","GipP","Wet Swale Herbland","GipP0012",1.36,"V","Vulnerable","wetlands","Non-woody wetland","Gippsland PlainWet Swale Herbland","0",0,0,null,null,null,null,null,null,null,null,null,1,1,null,null,1,1,7,15,3,5,2,5,1,1,4,10,4,25,null,null,null,null,1,5,null,null,null,null,2,1,null,null,null,null,"Episodic",5,10,1,11,1,10,0]
["Gippsland Plain","GipP","Wetland Formation","GipP0074",1.36,"E","Endangered","wetlands","Non-woody wetland","Gippsland PlainWetland Formation","0",null,0,null,null,null,null,null,null,null,null,null,null,null,null,null,null,null,null,null,null,null,null,null,null,null,null,null,null,null,null,null,null,null,null,null,null,null,null,null,null,null,null,null,null,null,null,5,0,null,null,null,null,0]
["Glenelg Plain","GleP","Aquatic Herbland","GleP0653",1.36,"E","Endangered","wetlands","Non-woody wetland","Glenelg PlainAquatic Herbland","0",0,0,null,null,null,null,null,null,null,null,null,null,null,null,null,null,null,3,20,null,null,1,25,null,null,4,25,1,1,null,null,null,null,null,null,null,null,null,null,null,null,null,null,null,null,"Episodic",5,4,null,3,null,10,0]
["Glenelg Plain","GleP","Basalt Shrubby Woodland","GleP0642",1,"E","Endangered","Forest/Woodland","Woody","Glenelg PlainBasalt Shrubby Woodland","0",null,0,null,null,null,null,null,null,null,null,null,null,null,null,null,null,null,null,null,null,null,null,null,null,null,null,null,null,null,null,null,null,null,null,null,null,null,null,null,null,null,null,null,null,null,null,0,0,null,null,null,null,0]
["Glenelg Plain","GleP","Bird Colony Succulent Herbland","GleP0155",1.36,"V","Vulnerable","grasslands","Non-woody wetland","Glenelg PlainBird Colony Succulent Herbland","0",0,0,null,null,null,null,null,null,null,1,30,null,null,null,null,null,null,2,5,2,20,1,1,null,null,null,null,null,null,null,null,null,null,null,null,null,null,null,null,2,40,null,null,null,null,"Continuous",0,5,1,4,30,10,0]
["Glenelg Plain","GleP","Brackish Sedgeland","GleP0013",1.36,"V","Vulnerable","wetlands","Non-woody wetland","Glenelg PlainBrackish Sedgeland","0",0,0,null,null,null,null,null,null,null,null,null,null,null,null,null,1,5,5,10,5,5,1,5,null,null,4,10,3,50,"3","5",null,null,null,null,null,null,null,null,null,null,null,null,null,null,"Episodic",5,7,null,11,null,10,0]
["Glenelg Plain","GleP","Brackish Wetland","GleP0656",1.36,"V","Vulnerable","wetlands","Non-woody wetland","Glenelg PlainBrackish Wetland","0",0,0,null,null,null,null,null,null,null,null,null,null,null,null,null,1,5,3,15,3,10,1,10,2,10,2,5,3,15,null,null,null,null,null,null,null,null,null,null,1,1,null,null,"0","10","Episodic",5,9,null,7,null,10,0]
["Glenelg Plain","GleP","Coastal Alkaline Scrub","GleP0858",1.1499999999999999,"E","Endangered","scrubs/shrublands/mallee with logs","Woody","Glenelg PlainCoastal Alkaline Scrub","0",0,0,null,null,null,null,null,null,null,4,30,null,null,null,null,3,5,2,1,2,10,1,5,null,null,3,5,2,30,null,null,null,null,null,null,null,null,null,null,2,1,0,20,null,null,"Continuous",0,9,4,7,30,40,50]
["Glenelg Plain","GleP","Coastal Dune Scrub","GleP0160",1.36,"TBC","TBC","scrubs/shrublands/mallee without logs","Woody","Glenelg PlainCoastal Dune Scrub","0",0,0,null,null,null,null,null,null,null,7,50,null,null,null,null,3,5,7,15,3,10,null,null,null,null,2,15,2,5,null,null,null,null,null,null,null,null,null,null,3,5,0,10,null,null,"Episodic",30,8,7,13,50,40,0]
["Glenelg Plain","GleP","Coastal Headland Scrub","GleP0161",1.36,"E","Endangered","heathlands","Woody","Glenelg PlainCoastal Headland Scrub","0",0,0,null,null,null,null,null,null,null,7,50,null,null,null,null,2,1,4,5,2,5,1,1,null,null,4,10,2,5,null,null,null,null,null,null,null,null,null,null,2,5,0,10,"0","10","Continuous",0,10,7,8,50,40,0]
["Glenelg Plain","GleP","Coastal Mallee Scrub","GleP0665",1.1499999999999999,"E","Endangered","scrubs/shrublands/mallee with logs","Woody","Glenelg PlainCoastal Mallee Scrub","0",0,4,40,null,null,null,null,null,null,6,10,6,10,null,null,2,1,3,5,1,1,2,5,null,null,7,15,null,null,null,null,null,null,null,null,null,null,null,null,1,1,0,10,"0","10","Continuous",0,10,12,6,20,20,50]
["Glenelg Plain","GleP","Coastal Sand Heathland","GleP0005",1.36,"R","Rare","heathlands","Woody","Glenelg PlainCoastal Sand Heathland","0",null,0,null,null,null,null,null,null,null,null,null,null,null,null,null,null,null,null,null,null,null,null,null,null,null,null,null,null,null,null,null,null,null,null,null,null,null,null,null,null,null,null,null,null,null,null,0,0,null,null,null,null,0]
["Glenelg Plain","GleP","Creekline Grassy Woodland","GleP0068",1,"E","Endangered","Forest/Woodland","Woody","Glenelg PlainCreekline Grassy Woodland","80",15,15,15,0,5,2,10,null,null,5,10,1,1,null,null,2,5,6,10,3,5,2,10,1,5,10,25,3,10,null,null,null,null,null,null,null,null,null,null,3,10,0,10,null,null,"Continuous",0,13,8,11,21,40,200]
["Glenelg Plain","GleP","Creekline Herb-rich Woodland","GleP0164",1,"E","Endangered","Forest/Woodland","Woody","Glenelg PlainCreekline Herb-rich Woodland","70",10,15,15,0,5,2,10,null,null,2,10,null,null,1,5,2,5,9,15,1,5,3,20,1,5,5,15,1,5,null,null,null,null,1,5,null,null,null,null,2,1,0,20,null,null,"Continuous",0,14,4,12,20,20,100]
["Glenelg Plain","GleP","Creekline Sedgy Woodland","GleP0640",1,"E","Endangered","Forest/Woodland","Woody","Glenelg PlainCreekline Sedgy Woodland","80",15,15,15,0,5,2,10,null,null,1,5,1,1,null,null,null,null,5,10,null,null,3,15,null,null,6,20,null,null,null,null,null,null,null,null,null,null,null,null,null,null,0,10,null,null,"Continuous",0,8,4,5,16,40,200]
["Glenelg Plain","GleP","Damp Heathland","GleP0710",1.36,"D","Depleted","heathlands","Woody","Glenelg PlainDamp Heathland","0",0,0,null,null,null,null,null,null,null,6,30,5,20,2,5,null,null,6,10,2,1,1,5,1,1,4,10,3,15,null,null,null,null,null,null,null,null,null,null,2,5,0,10,"0","10","Episodic",30,12,11,8,50,20,0]
["Glenelg Plain","GleP","Damp Heathy Woodland","GleP0793",1,"D","Depleted","Forest/Woodland","Woody","Glenelg PlainDamp Heathy Woodland","60",10,10,10,0,5,null,null,null,null,8,30,7,20,4,10,2,1,7,10,null,null,2,10,2,5,9,10,4,10,null,null,null,null,null,null,null,null,null,null,2,5,0,10,"0","10","Episodic",30,13,15,9,50,20,100]
["Glenelg Plain","GleP","Damp Sands Herb-rich Woodland","GleP0003",1,"V","Vulnerable","Forest/Woodland","Woody",{"$f":"CONCATENATE(A323,C323)","v":"Glenelg PlainDamp Sands Herb-rich Woodland"},"70",15,15,15,0,5,2,10,null,null,4,5,3,5,2,5,3,5,10,15,3,5,2,10,1,15,7,15,3,5,"1","0",null,null,1,5,null,null,null,null,2,1,0,10,null,null,"Continuous",0,16,9,16,20,40,150]
["Glenelg Plain","GleP","Deep Freshwater Marsh","GleP0681",1.36,"V","Vulnerable","wetlands","Non-woody wetland","Glenelg PlainDeep Freshwater Marsh","0",null,0,null,null,null,null,null,null,null,null,null,null,null,null,null,null,null,null,null,null,null,null,null,null,null,null,null,null,null,null,null,null,null,null,null,null,null,null,null,null,null,null,null,null,null,null,5,0,null,null,null,null,0]
["Glenelg Plain","GleP","Escarpment Shrubland","GleP0895",1.1499999999999999,"E","Endangered","Forest/Woodland","Woody","Glenelg PlainEscarpment Shrubland","0",0,0,null,null,null,null,null,null,null,3,10,2,5,null,null,3,5,4,10,5,5,1,5,1,5,9,25,3,5,null,null,null,null,1,5,null,null,null,null,1,5,0,20,"0","10","Continuous",0,13,5,12,15,20,150]
["Glenelg Plain","GleP","Escarpment Shrubland - treed","GleP0895_61",1,"E","Endangered","Forest/Woodland","Woody","Glenelg PlainEscarpment Shrubland - treed","70",15,0,0,0,5,3,10,null,null,3,10,2,5,null,null,3,5,4,10,5,5,1,5,1,5,9,25,3,5,null,null,null,null,1,5,null,null,null,null,1,5,0,20,"0","10","Continuous",0,15,8,12,25,20,150]
["Glenelg Plain","GleP","Floodplain Riparian Woodland","GleP0056",1,"V","Vulnerable","Forest/Woodland","Woody","Glenelg PlainFloodplain Riparian Woodland","80",15,20,20,0,5,1,5,null,null,3,15,null,null,null,null,2,5,3,10,3,10,2,15,1,10,5,15,1,5,null,null,null,null,null,null,null,null,null,null,1,5,0,10,null,null,"Episodic",5,12,4,8,20,40,300]
["Glenelg Plain","GleP","Freshwater Lignum Shrubland","GleP0657",1.36,"E","Endangered","wetlands","Woody","Glenelg PlainFreshwater Lignum Shrubland","0",0,0,null,null,null,null,null,null,null,1,20,null,null,null,null,2,5,3,20,3,10,1,5,null,null,6,25,3,10,null,null,null,null,null,null,null,null,null,null,null,null,0,10,"0","10","Episodic",10,9,1,8,20,10,0]
["Glenelg Plain","GleP","Freshwater Meadow","GleP0680",1.36,"E","Endangered","wetlands","Non-woody wetland","Glenelg PlainFreshwater Meadow","0",null,0,null,null,null,null,null,null,null,null,null,null,null,null,null,null,null,null,null,null,null,null,null,null,null,null,null,null,null,null,null,null,null,null,null,null,null,null,null,null,null,null,null,null,null,null,5,0,null,null,null,null,0]
["Glenelg Plain","GleP","Heathy Herb-rich Woodland","GleP0179",1,"D","Depleted","Forest/Woodland","Woody","Glenelg PlainHeathy Herb-rich Woodland","70",15,15,20,0,5,2,10,null,null,5,15,7,10,3,5,2,5,8,10,2,5,3,10,1,5,8,15,3,10,null,null,null,null,1,20,null,null,null,null,null,null,0,10,null,null,"Continuous",0,14,14,12,35,20,150]
["Glenelg Plain","GleP","Heathy Woodland","GleP0048",1,"LC","Least Concern","Forest/Woodland","Woody","Glenelg PlainHeathy Woodland","60",15,10,15,2,5,null,null,null,null,8,30,8,20,3,5,null,null,5,10,1,1,2,10,1,5,5,10,2,10,null,null,null,null,1,5,null,null,null,null,null,null,0,10,"0","10","Episodic",20,13,16,6,50,40,150]
["Glenelg Plain","GleP","Herb-rich Foothill Forest","GleP0023",1,"V","Vulnerable","Forest/Woodland","Woody","Glenelg PlainHerb-rich Foothill Forest","70",20,25,40,0,5,2,10,null,null,5,15,1,1,1,1,3,5,10,20,5,5,3,5,1,5,10,20,2,10,null,null,null,null,3,10,null,null,null,null,null,null,0,20,null,null,"Continuous",0,14,8,18,26,40,200]
["Glenelg Plain","GleP","Hills Herb-rich Woodland","GleP0071",1,"V","Vulnerable","Forest/Woodland","Woody","Glenelg PlainHills Herb-rich Woodland","70",15,15,15,0,5,1,5,null,null,null,null,1,1,1,1,1,5,20,30,7,10,1,1,null,null,15,25,5,15,null,null,null,null,null,null,null,null,null,null,null,null,0,10,"0","10","Continuous",0,12,2,28,6,20,150]
["Glenelg Plain","GleP","Lateritic Woodland","GleP0704",1,"V","Vulnerable","Forest/Woodland","Woody","Glenelg PlainLateritic Woodland","70",15,15,15,0,5,1,5,null,null,11,25,11,20,4,5,2,5,14,10,4,5,2,5,1,1,15,20,4,5,"4","1",null,null,null,null,null,null,null,null,3,5,0,10,"0","10","Continuous",0,16,23,20,50,20,150]
["Glenelg Plain","GleP","Limestone Pomaderris Shrubland","GleP0133",1.36,"V","Vulnerable","Forest/Woodland","Woody","Glenelg PlainLimestone Pomaderris Shrubland","0",0,0,null,null,null,2,10,null,null,9,45,2,1,2,1,5,15,5,10,3,5,2,1,null,null,7,20,null,null,null,null,null,null,1,1,null,null,null,null,2,1,0,10,"0","10","Continuous",0,13,13,13,56,20,0]
["Glenelg Plain","GleP","Limestone Ridge Woodland","GleP0664",1,"V","Vulnerable","Forest/Woodland","Woody","Glenelg PlainLimestone Ridge Woodland","60",15,10,15,0,5,2,15,null,null,3,10,5,10,null,null,4,10,4,5,1,1,2,5,null,null,4,30,null,null,null,null,null,null,null,null,null,null,null,null,1,1,0,10,"0","10","Continuous",0,12,10,9,35,30,150]
["Glenelg Plain","GleP","Limestone Woodland","GleP0670",1,"V","Vulnerable","Forest/Woodland","Woody","Glenelg PlainLimestone Woodland","60",15,15,15,0,5,2,15,null,null,5,20,3,10,3,5,3,10,4,5,1,1,3,5,null,null,4,10,2,5,null,null,null,null,null,null,null,null,null,null,null,null,0,10,"0","10","Continuous",0,13,10,8,45,40,150]
["Glenelg Plain","GleP","Lowland Forest","GleP0016",1,"LC","Least Concern","Forest/Woodland","Woody","Glenelg PlainLowland Forest","70",20,20,30,0,5,2,10,null,null,7,15,5,10,4,10,2,5,15,20,4,5,3,5,2,5,8,15,1,5,null,null,null,null,2,10,null,null,null,null,2,1,0,10,null,null,"Continuous",0,15,14,21,35,40,200]
["Glenelg Plain","GleP","Lunette Woodland","GleP0652",1,"E","Endangered","Forest/Woodland","Woody","Glenelg PlainLunette Woodland","80",8,15,10,0,5,1,5,null,null,3,10,2,1,1,1,3,5,8,15,3,5,2,5,null,null,12,45,2,5,null,null,null,null,null,null,null,null,null,null,null,null,0,10,"0","10","Continuous",0,13,6,14,16,10,100]
["Glenelg Plain","GleP","Plains Grassy Wetland","GleP0125",1.36,"E","Endangered","wetlands","Non-woody wetland","Glenelg PlainPlains Grassy Wetland","0",0,0,null,null,null,null,null,null,null,null,null,null,null,null,null,6,10,11,20,4,10,2,10,null,null,11,30,2,10,"2","1",null,null,null,null,null,null,null,null,null,null,0,10,null,null,"Episodic",5,8,null,21,null,10,50]
["Glenelg Plain","GleP","Plains Grassy Woodland","GleP0055",1,"E","Endangered","Forest/Woodland","Woody","Glenelg PlainPlains Grassy Woodland","80",15,15,10,0,5,1,1,null,null,1,5,2,5,1,1,1,1,18,25,4,10,1,1,null,null,15,40,4,5,null,null,null,null,null,null,null,null,null,null,null,null,0,10,null,null,"Continuous",0,12,4,23,11,10,100]
["Glenelg Plain","GleP","Plains Sedgy Wetland","GleP0647",1.36,"E","Endangered","wetlands","Non-woody wetland","Glenelg PlainPlains Sedgy Wetland","0",0,0,null,null,null,null,null,null,null,null,null,null,null,null,null,1,5,4,10,null,null,1,5,1,10,4,40,1,10,null,null,null,null,null,null,null,null,null,null,null,null,null,null,null,null,"Episodic",5,6,null,5,null,10,0]
["Glenelg Plain","GleP","Plains Sedgy Woodland","GleP0283",1,"V","Vulnerable","Forest/Woodland","Woody","Glenelg PlainPlains Sedgy Woodland","70/40",15,15,10,0,5,null,null,null,null,1,5,2,1,null,null,4,15,10,20,2,5,2,1,1,1,13,30,4,20,null,null,null,null,null,null,null,null,null,null,null,null,0,10,"0","10","Continuous",0,12,3,16,6,10,150]
["Glenelg Plain","GleP","Plains Swampy Woodland","GleP0651",1,"E","Endangered","Forest/Woodland","Woody","Glenelg PlainPlains Swampy Woodland","80",10,15,10,0,5,1,5,null,null,4,15,null,null,null,null,3,5,8,20,5,5,3,30,1,1,7,10,2,5,null,null,null,null,null,null,null,null,null,null,null,null,0,20,null,null,"Continuous",0,11,5,16,20,10,100]
["Glenelg Plain","GleP","Plains Woodland","GleP0803",1,"E","Endangered","Forest/Woodland","Woody","Glenelg PlainPlains Woodland","70/40",15,15,15,0,5,null,null,null,null,1,5,null,null,1,1,1,1,20,25,4,10,1,5,1,1,16,30,3,5,null,null,null,null,null,null,null,null,null,null,null,null,0,10,null,null,"Continuous",0,11,1,25,5,20,100]
["Glenelg Plain","GleP","Red Gum Swamp","GleP0292",1,"E","Endangered","Forest/Woodland","Woody","Glenelg PlainRed Gum Swamp","80",10,15,15,0,5,null,null,null,null,null,null,null,null,null,null,2,10,7,25,2,1,2,15,null,null,6,20,2,15,null,null,null,null,null,null,null,null,null,null,null,null,null,null,null,null,"Episodic",5,7,null,11,null,10,100]
["Glenelg Plain","GleP","Riparian Forest","GleP0018",1,"V","Vulnerable","Forest/Woodland","Woody","Glenelg PlainRiparian Forest","80",20,30,40,0,5,3,25,null,null,4,15,null,null,null,null,1,1,4,10,2,1,3,10,1,1,2,0,1,1,null,null,null,null,5,30,"1","5","2","1",2,1,0,10,null,null,"Continuous",0,15,7,7,40,50,300]
["Glenelg Plain","GleP","Riparian Scrub","GleP0191",1.25,"D","Depleted","scrubs/shrublands/mallee without logs","Woody","Glenelg PlainRiparian Scrub","0",0,0,null,null,null,null,null,null,null,4,10,2,1,1,1,1,5,4,5,null,null,2,25,null,null,1,10,3,15,null,null,null,null,null,null,null,null,null,null,null,null,0,20,null,null,"Continuous",0,9,6,5,11,40,0]
["Glenelg Plain","GleP","Riparian Woodland","GleP0641",1,"V","Vulnerable","Forest/Woodland","Woody","Glenelg PlainRiparian Woodland","80",15,20,20,0,5,null,null,null,null,3,10,1,1,null,null,3,5,9,20,2,5,3,30,null,null,2,10,null,null,null,null,null,null,1,1,null,null,null,null,3,10,0,10,null,null,"Episodic",5,11,4,14,11,20,200]
["Glenelg Plain","GleP","Sand Heathland","GleP0006",1.36,"R","Rare","heathlands","Woody","Glenelg PlainSand Heathland","0",0,0,null,null,null,null,null,null,null,7,30,8,20,3,5,null,null,5,10,1,1,1,1,null,null,4,10,3,20,null,null,null,null,null,null,null,null,null,null,2,5,0,10,"0","10","Episodic",30,11,15,6,50,20,0]
["Glenelg Plain","GleP","Sandy Stream Woodland","GleP0674",1,"E","Endangered","Forest/Woodland","Woody","Glenelg PlainSandy Stream Woodland","80",10,15,10,0,5,2,15,null,null,5,15,null,null,null,null,null,null,6,10,3,5,2,10,2,20,10,30,3,5,null,null,null,null,null,null,null,null,null,null,null,null,0,10,null,null,"Continuous",0,10,7,9,30,40,200]
["Glenelg Plain","GleP","Seasonally Inundated Shrubby Woodland","GleP0195",1,"E","Endangered","Forest/Woodland","Woody","Glenelg PlainSeasonally Inundated Shrubby Woodland","70",15,15,15,0,5,null,null,null,null,7,30,3,10,1,1,2,5,3,10,1,1,null,null,null,null,6,15,3,10,null,null,null,null,null,null,null,null,null,null,null,null,0,10,"0","10","Continuous",0,11,10,6,40,30,150]
["Glenelg Plain","GleP","Sedge Wetland","GleP0136",1.36,"V","Vulnerable","wetlands","Non-woody wetland","Glenelg PlainSedge Wetland","0",0,0,null,null,null,null,null,null,null,null,null,null,null,null,null,1,5,null,null,1,1,2,20,1,20,null,null,null,null,null,null,null,null,null,null,null,null,null,null,null,null,0,10,null,null,"Episodic",5,5,null,2,null,10,0]
["Glenelg Plain","GleP","Sedgy Riparian Woodland","GleP0198",1,"V","Vulnerable","Forest/Woodland","Woody","Glenelg PlainSedgy Riparian Woodland","70",15,15,20,0,5,1,10,null,null,5,20,null,null,null,null,null,null,3,10,null,null,5,30,null,null,2,5,2,5,null,null,null,null,2,10,null,null,null,null,null,null,0,20,null,null,"Continuous",0,9,6,3,30,20,200]
["Glenelg Plain","GleP","Sedgy Swamp Woodland","GleP0707",1,"E","Endangered","Forest/Woodland","Woody","Glenelg PlainSedgy Swamp Woodland","80",10,15,10,0,5,null,null,null,null,2,15,null,null,null,null,3,10,6,15,5,5,2,10,2,30,3,10,2,1,null,null,null,null,null,null,null,null,null,null,null,null,0,20,null,null,"Continuous",0,10,2,14,15,10,100]
["Glenelg Plain","GleP","Shallow Freshwater Marsh","GleP0200",1.36,"E","Endangered","wetlands","Non-woody wetland","Glenelg PlainShallow Freshwater Marsh","0",null,0,null,null,null,null,null,null,null,null,null,null,null,null,null,null,null,null,null,null,null,null,null,null,null,null,null,null,null,null,null,null,null,null,null,null,null,null,null,null,null,null,null,null,null,null,5,0,null,null,null,null,0]
["Glenelg Plain","GleP","Shallow Sands Woodland","GleP0882",1,"V","Vulnerable","Forest/Woodland","Woody","Glenelg PlainShallow Sands Woodland","70",15,15,15,0,5,2,15,null,null,3,5,4,10,2,5,3,5,17,20,3,5,2,5,null,null,11,25,4,10,"2","0",null,null,null,null,null,null,null,null,1,0,0,10,"0","10","Continuous",0,15,9,23,30,20,150]
["Glenelg Plain","GleP","Spray-zone Coastal Shrubland","GleP0876",1.36,"E","Endangered","grasslands","Woody","Glenelg PlainSpray-zone Coastal Shrubland","0",0,0,null,null,null,null,null,null,null,null,null,1,5,null,null,null,null,4,10,1,1,null,null,null,null,null,null,null,null,null,null,null,null,null,null,null,null,null,null,null,null,0,20,"0","20","Continuous",0,5,1,5,5,10,0]
["Glenelg Plain","GleP","Swamp Scrub","GleP0053",1.25,"V","Vulnerable","scrubs/shrublands/mallee without logs","Woody","Glenelg PlainSwamp Scrub","0",0,0,null,null,null,null,null,null,null,2,10,1,1,null,null,5,5,9,15,3,10,2,15,2,5,4,15,3,15,null,null,null,null,2,5,null,null,null,null,1,5,0,20,null,null,"Continuous",0,12,3,17,11,40,0]
["Glenelg Plain","GleP","Wet Forest","GleP0030",1,"LC","Least Concern","Forest/Woodland","Woody","Glenelg PlainWet Forest","90",20,30,40,0,5,2,15,null,null,3,10,null,null,null,null,1,1,3,5,null,null,2,5,null,null,4,5,2,5,null,null,null,null,6,20,"2","25",null,null,1,1,0,20,null,null,"Continuous",0,12,5,4,25,50,300]
["Glenelg Plain","GleP","Wet Heathland","GleP0008",1.36,"LC","Least Concern","heathlands","Woody","Glenelg PlainWet Heathland","0",0,0,null,null,null,null,null,null,null,7,40,4,5,1,1,2,5,1,5,2,1,2,20,1,5,4,15,3,10,null,null,null,null,1,1,null,null,null,null,1,5,0,20,null,null,"Episodic",30,13,11,5,45,20,0]
["Goldfields","Gold","Alluvial Terraces Herb-rich Woodland","Gold0067",1,"E","Endangered","Forest/Woodland","Woody","GoldfieldsAlluvial Terraces Herb-rich Woodland","50/70",8,15,15,0,5,1,5,null,null,3,5,3,5,1,1,3,5,15,30,5,10,1,1,null,null,12,30,2,5,null,null,null,null,1,1,null,null,null,null,null,null,0,10,"0","10","Continuous",0,14,7,23,15,10,150]
["Goldfields","Gold","Box Ironbark Forest","Gold0061",1,"D","Depleted","Forest/Woodland","Woody","GoldfieldsBox Ironbark Forest","70",15,20,30,0,5,null,null,null,null,7,25,4,5,2,1,null,null,9,20,null,null,1,1,null,null,8,15,null,null,null,null,null,null,null,null,null,null,null,null,null,null,0,10,"0","20","Continuous",0,9,11,9,30,20,200]
["Goldfields","Gold","Creekline Grassy Woodland","Gold0068",1,"E","Endangered","Forest/Woodland","Woody","GoldfieldsCreekline Grassy Woodland","80",15,15,15,0,5,null,null,null,null,4,10,3,5,null,null,2,5,9,15,3,5,2,5,null,null,16,40,3,5,null,null,null,null,null,null,null,null,null,null,null,null,0,10,null,null,"Continuous",0,10,7,14,15,40,300]
["Goldfields","Gold","Creekline Herb-rich Woodland","Gold0164",1,"E","Endangered","Forest/Woodland","Woody","GoldfieldsCreekline Herb-rich Woodland","70",10,15,15,0,5,1,5,null,null,3,15,null,null,null,null,1,0,6,20,1,5,1,20,1,5,2,5,1,5,null,null,null,null,null,null,null,null,null,null,null,null,0,20,null,null,"Continuous",0,11,4,8,20,20,100]
["Goldfields","Gold","Damp Sands Herb-rich Woodland","Gold0003",1,"E","Endangered","Forest/Woodland","Woody","GoldfieldsDamp Sands Herb-rich Woodland","70",15,15,15,0,5,2,10,null,null,3,10,3,5,null,null,null,null,16,20,7,15,1,10,null,null,10,15,2,10,null,null,null,null,1,10,null,null,null,null,null,null,0,10,null,null,"Continuous",0,11,8,23,25,40,150]
["Goldfields","Gold","Drainage-line Woodland","Gold0679",1,"E","Endangered","Forest/Woodland","Woody","GoldfieldsDrainage-line Woodland","80",15,15,15,0,5,null,null,null,null,null,null,null,null,null,null,2,5,9,15,3,5,2,10,null,null,16,30,3,5,null,null,null,null,null,null,null,null,null,null,null,null,0,10,null,null,"Continuous",0,8,null,14,null,40,300]
["Goldfields","Gold","Floodplain Riparian Woodland","Gold0056",1,"E","Endangered","Forest/Woodland","Woody","GoldfieldsFloodplain Riparian Woodland","80",15,0,20,0,5,1,5,null,null,2,5,1,1,null,null,null,null,4,10,2,1,2,5,1,5,6,40,2,10,null,null,null,null,null,null,null,null,null,null,null,null,0,10,null,null,"Episodic",10,11,4,6,11,40,300]
["Goldfields","Gold","Granitic Grassy Woodland","Gold0175_62",1,"V","Vulnerable","Forest/Woodland","Woody","GoldfieldsGranitic Grassy Woodland","70",15,15,15,0,5,2,10,null,null,2,15,1,1,1,1,null,null,8,20,3,10,1,1,null,null,8,40,1,5,null,null,null,null,1,5,null,null,null,null,null,null,0,10,null,null,"Continuous",0,12,5,11,26,20,150]
["Goldfields","Gold","Granitic Hills Woodland","Gold0072",1,"E","Endangered","Forest/Woodland","Woody","GoldfieldsGranitic Hills Woodland","60",15,10,10,0,5,1,1,null,null,null,null,null,null,null,null,3,5,11,15,2,1,null,null,null,null,6,10,4,10,"2","1",null,null,1,10,null,null,null,null,null,null,0,10,"0","10","Continuous",0,11,1,16,1,20,150]
["Goldfields","Gold","Grassy Dry Forest","Gold0022",1,"D","Depleted","Forest/Woodland","Woody","GoldfieldsGrassy Dry Forest","60",20,20,30,0,5,1,5,null,null,3,5,3,5,2,1,3,10,16,30,3,5,2,5,null,null,13,30,4,5,null,null,null,null,1,5,null,null,null,null,1,1,0,10,"0","10","Continuous",0,15,7,22,15,20,200]
["Goldfields","Gold","Heathy Dry Forest","Gold0020",1,"LC","Least Concern","Forest/Woodland","Woody","GoldfieldsHeathy Dry Forest","60",20,20,30,0,5,1,5,null,null,8,25,6,15,2,5,3,5,10,20,2,5,2,5,null,null,10,25,2,1,null,null,null,null,null,null,null,null,null,null,null,null,0,10,"0","10","Episodic",20,13,15,15,45,20,200]
["Goldfields","Gold","Heathy Woodland","Gold0048",1,"D","Depleted","Forest/Woodland","Woody","GoldfieldsHeathy Woodland","40/60",15,10,15,0,5,null,null,null,null,9,30,7,20,2,1,2,5,9,15,null,null,1,1,null,null,7,15,null,null,null,null,null,null,null,null,null,null,null,null,null,null,0,10,"0","10","Episodic",20,10,16,11,50,40,150]
["Goldfields","Gold","Herb-rich Foothill Forest","Gold0023",1,"D","Depleted","Forest/Woodland","Woody","GoldfieldsHerb-rich Foothill Forest","70",20,25,40,0,5,2,10,null,null,2,5,2,1,1,1,4,5,11,25,3,5,2,5,1,5,6,20,2,5,null,null,null,null,2,10,null,null,null,null,3,5,0,20,null,null,"Continuous",0,15,6,18,16,40,200]
["Goldfields","Gold","Hillcrest Herb-rich Woodland","Gold0070",1,"D","Depleted","Forest/Woodland","Woody","GoldfieldsHillcrest Herb-rich Woodland","70",15,10,15,0,5,2,10,null,null,2,5,2,1,null,null,4,10,14,20,2,5,1,1,null,null,12,30,3,5,null,null,null,null,1,1,null,null,null,null,null,null,0,10,"0","10","Continuous",0,13,6,20,16,20,150]
["Goldfields","Gold","Hills Herb-rich Woodland","Gold0071",1,"D","Depleted","Forest/Woodland","Woody","GoldfieldsHills Herb-rich Woodland","70",15,15,15,0,5,1,5,null,null,5,15,null,null,null,null,4,5,15,20,3,5,2,1,null,null,11,30,5,10,null,null,null,null,2,10,null,null,null,null,null,null,0,10,"0","10","Continuous",0,12,6,22,20,20,150]
["Goldfields","Gold","Lateritic Woodland","Gold0704",1,"E","Endangered","Forest/Woodland","Woody","GoldfieldsLateritic Woodland","70",15,15,15,0,5,1,5,null,null,11,25,11,20,4,5,2,5,14,10,4,5,2,5,1,1,15,20,4,5,"4","1",null,null,null,null,null,null,null,null,3,5,0,10,"0","10","Continuous",0,16,23,20,50,20,150]
["Goldfields","Gold","Lignum Swamp","Gold0104",1.36,"V","Vulnerable","wetlands","Woody","GoldfieldsLignum Swamp","0",0,0,null,null,null,null,null,null,null,1,20,null,null,null,null,4,5,8,25,1,0,1,5,null,null,2,5,2,5,null,null,null,null,null,null,null,null,null,null,1,1,null,null,"0","10","Continuous",0,9,1,13,20,5,0]
["Goldfields","Gold","Low Rises Grassy Woodland","Gold0175_61",1,"V","Vulnerable","Forest/Woodland","Woody","GoldfieldsLow Rises Grassy Woodland","70",15,15,15,0,5,null,null,null,null,6,15,3,5,1,1,4,10,10,15,2,5,2,5,null,null,11,25,3,5,null,null,null,null,null,null,null,null,null,null,null,null,0,10,"0","10","Continuous",0,12,9,16,20,20,150]
["Goldfields","Gold","Metamorphic Slopes Shrubby Woodland","Gold0069",1,"D","Depleted","Forest/Woodland","Woody","GoldfieldsMetamorphic Slopes Shrubby Woodland","40",15,8,15,null,null,1,5,null,null,7,25,3,5,1,1,2,5,11,20,2,1,1,5,null,null,7,15,null,null,null,null,null,null,1,5,null,null,null,null,null,null,0,10,"0","20","Continuous",0,12,11,15,35,20,150]
["Goldfields","Gold","Plains Grassland","Gold0132",1.36,"E","Endangered","grasslands","Other grassland","GoldfieldsPlains Grassland","0",null,null,null,null,null,null,null,null,null,null,null,null,null,null,null,null,null,null,null,null,null,null,null,null,null,null,null,null,null,null,null,null,null,null,null,null,null,null,null,null,null,null,null,null,null,null,null,0,null,null,null,null,0]
["Goldfields","Gold","Plains Grassy Wetland","Gold0125",1.36,"E","Endangered","wetlands","Non-woody wetland","GoldfieldsPlains Grassy Wetland","0",0,0,null,null,null,null,null,null,null,null,null,null,null,null,null,5,5,11,20,6,10,2,5,null,null,7,20,3,30,null,null,null,null,null,null,null,null,null,null,null,null,0,10,null,null,"Episodic",5,7,null,22,null,10,50]
["Goldfields","Gold","Plains Grassy Woodland","Gold0055",1,"E","Endangered","Forest/Woodland","Woody","GoldfieldsPlains Grassy Woodland","40/70",15,15,15,0,5,null,null,null,null,1,5,1,1,null,null,3,5,10,30,3,10,null,null,null,null,18,40,2,5,null,null,null,null,null,null,null,null,null,null,null,null,0,10,"0","10","Continuous",0,10,2,16,6,10,100]
["Goldfields","Gold","Plains Woodland","Gold0803",1,"E","Endangered","Forest/Woodland","Woody","GoldfieldsPlains Woodland","40/70",15,15,15,0,5,null,null,null,null,1,5,1,1,null,null,3,5,10,30,3,10,null,null,null,null,18,40,2,5,null,null,null,null,null,null,null,null,null,null,null,null,0,10,"0","10","Continuous",0,10,2,16,6,10,100]
["Goldfields","Gold","Red Gum Swamp","Gold0292",1,"E","Endangered","Forest/Woodland","Woody","GoldfieldsRed Gum Swamp","80",10,15,10,0,5,1,10,null,null,null,null,null,null,null,null,null,null,1,15,null,null,2,5,null,null,2,10,2,40,null,null,null,null,null,null,null,null,null,null,null,null,0,10,null,null,"Episodic",5,7,1,1,10,20,150]
["Goldfields","Gold","Riparian Shrubland","Gold0019",1.25,"D","Depleted","scrubs/shrublands/mallee without logs","Woody","GoldfieldsRiparian Shrubland","0",0,0,null,null,null,null,null,null,null,6,40,null,null,null,null,2,5,6,10,2,5,3,10,null,null,3,10,2,1,null,null,null,null,2,5,null,null,null,null,2,5,0,10,null,null,"Episodic",5,10,6,10,40,20,100]
["Goldfields","Gold","Riparian Woodland","Gold0641",1,"E","Endangered","Forest/Woodland","Woody",{"$f":"CONCATENATE(A387,C387)","v":"GoldfieldsRiparian Woodland"},"80",15,15,20,0,5,2,15,null,null,3,10,1,1,null,null,4,15,5,10,1,5,3,10,1,5,4,20,2,5,null,null,null,null,null,null,null,null,null,null,1,5,0,10,null,null,"Continuous",0,13,6,10,26,30,200]
["Goldfields","Gold","Riverine Grassy Woodland","Gold0295",1,"V","Vulnerable","Forest/Woodland","Woody","GoldfieldsRiverine Grassy Woodland","80",15,20,20,0,5,1,5,null,null,null,null,1,1,null,null,null,null,2,1,2,1,2,5,null,null,5,20,2,20,null,null,null,null,null,null,null,null,null,null,null,null,0,10,null,null,"Continuous",0,9,2,4,6,10,200]
["Goldfields","Gold","Riverine Swampy Woodland","Gold0815",1,"V","Vulnerable","Forest/Woodland","Woody","GoldfieldsRiverine Swampy Woodland","70",15,15,20,0,5,null,null,null,null,null,null,null,null,null,null,2,5,3,10,1,5,3,10,null,null,2,10,3,20,null,null,null,null,null,null,null,null,null,null,null,null,null,null,null,null,"Episodic",5,7,null,6,null,10,100]
["Goldfields","Gold","Rocky Outcrop Shrubland","Gold0028",1.36,"LC","Least Concern","heathlands","Woody","GoldfieldsRocky Outcrop Shrubland","0",null,null,null,null,null,null,null,null,null,null,null,null,null,null,null,null,null,null,null,null,null,null,null,null,null,null,null,null,null,null,null,null,null,null,null,null,null,null,null,null,null,null,null,null,null,null,null,0,null,null,null,null,0]
["Goldfields","Gold","Sand Ridge Woodland","Gold0264",1,"E","Endangered","Forest/Woodland","Woody","GoldfieldsSand Ridge Woodland","40/70",15,15,15,0,5,null,null,null,null,4,20,3,10,2,5,2,5,10,15,5,5,3,10,null,null,8,15,null,null,null,null,null,null,1,5,null,null,null,null,1,5,0,10,"0","10","Continuous",0,13,7,17,30,10,150]
["Goldfields","Gold","Sandstone Ridge Shrubland","Gold0093",1.1499999999999999,"LC","Least Concern","scrubs/shrublands/mallee with logs","Woody","GoldfieldsSandstone Ridge Shrubland","0",0,3,30,null,null,null,null,null,null,9,30,5,10,1,1,1,1,6,15,null,null,null,null,null,null,3,5,null,null,null,null,null,null,null,null,null,null,null,null,null,null,0,20,"0","20","Episodic",30,8,14,7,40,20,50]
["Goldfields","Gold","Scoria Cone Woodland","Gold0894",1,"E","Endangered","Forest/Woodland","Woody","GoldfieldsScoria Cone Woodland","50/70",15,15,15,0,5,1,5,null,null,2,10,null,null,null,null,3,5,6,10,3,5,1,15,null,null,4,15,1,5,null,null,null,null,2,20,null,null,null,null,null,null,0,10,"0","10","Continuous",0,12,3,12,15,20,100]
["Goldfields","Gold","Sedge-rich Woodland","Gold0065",1,"E","Endangered","Forest/Woodland","Woody","GoldfieldsSedge-rich Woodland","40/70",15,15,10,0,5,null,null,null,null,2,5,2,1,null,null,1,5,10,20,2,5,null,null,1,1,13,30,3,15,null,null,null,null,null,null,null,null,null,null,null,null,0,10,"0","10","Continuous",0,11,4,13,6,10,150]
["Goldfields","Gold","Sedgy Riparian Woodland","Gold0198",1,"V","Vulnerable","Forest/Woodland","Woody","GoldfieldsSedgy Riparian Woodland","70",15,15,20,0,5,1,10,null,null,4,20,2,5,null,null,1,1,7,10,2,5,3,30,2,10,7,10,2,15,null,null,null,null,1,5,null,null,null,null,null,null,0,10,null,null,"Continuous",0,13,7,10,35,30,200]
["Goldfields","Gold","Semi-arid Woodland","Gold0097",1,"V","Vulnerable","Forest/Woodland","Woody","GoldfieldsSemi-arid Woodland","40",20,12,20,0,5,null,null,null,null,5,15,5,20,null,null,2,5,7,5,2,5,null,null,null,null,2,10,1,1,null,null,null,null,null,null,null,null,null,null,null,null,0,10,"0","20","Continuous",0,10,10,11,35,20,200]
["Goldfields","Gold","Shrubby Dry Forest","Gold0021",1,"V","Vulnerable","Forest/Woodland","Woody","GoldfieldsShrubby Dry Forest","70",20,25,30,0,5,1,5,null,null,4,20,3,10,1,1,1,1,2,5,null,null,1,15,null,null,2,10,null,null,null,null,null,null,null,null,null,null,null,null,null,null,0,10,"0","10","Episodic",20,11,8,3,35,20,200]
["Goldfields","Gold","Shrubby Woodland","Gold0282",1,"LC","Least Concern","Forest/Woodland","Woody","GoldfieldsShrubby Woodland","80",15,15,20,0,5,1,5,null,null,2,30,3,15,null,null,null,null,2,1,null,null,1,5,null,null,1,1,null,null,null,null,null,null,null,null,null,null,null,null,null,null,0,10,null,null,"Continuous",0,8,6,2,50,20,150]
["Goldfields","Gold","Stream Bank Shrubland","Gold0851",1,"E","Endangered","Forest/Woodland","Woody","GoldfieldsStream Bank Shrubland","70",15,15,10,0,5,1,10,null,null,10,40,null,null,null,null,4,5,9,20,2,5,3,15,null,null,3,10,2,10,null,null,null,null,1,1,null,null,null,null,2,5,0,10,null,null,"Continuous",0,12,11,15,50,20,100]
["Goldfields","Gold","Swamp Scrub","Gold0053",1.25,"E","Endangered","scrubs/shrublands/mallee without logs","Woody","GoldfieldsSwamp Scrub","0",null,null,null,null,null,null,null,null,null,null,null,null,null,null,null,null,null,null,null,null,null,null,null,null,null,null,null,null,null,null,null,null,null,null,null,null,null,null,null,null,null,null,null,null,null,null,null,0,null,null,null,null,0]
["Goldfields","Gold","Swampy Riparian Woodland","Gold0083",1,"E","Endangered","Forest/Woodland","Woody","GoldfieldsSwampy Riparian Woodland","70",10,15,20,0,5,2,10,null,null,2,5,null,null,null,null,5,10,9,20,4,10,4,10,1,5,9,25,2,5,null,null,null,null,1,1,null,null,null,null,2,5,0,20,null,null,"Continuous",0,13,4,18,15,20,200]
["Goldfields","Gold","Valley Grassy Forest","Gold0047",1,"V","Vulnerable","Forest/Woodland","Woody","GoldfieldsValley Grassy Forest","70",20,20,20,0,5,1,5,null,null,3,5,2,5,1,5,2,5,11,20,2,5,2,5,null,null,8,30,2,10,null,null,null,null,1,1,null,null,null,null,null,null,0,20,null,null,"Continuous",0,13,6,15,15,40,200]
["Goldfields","Gold","Valley Heathy Forest","Gold0127",1,"E","Endangered","Forest/Woodland","Woody","GoldfieldsValley Heathy Forest","70",20,15,30,0,5,2,10,null,null,7,15,5,5,2,1,null,null,6,10,3,5,3,5,2,20,6,15,1,1,null,null,null,null,1,1,null,null,null,null,3,5,0,10,null,null,"Episodic",30,14,14,9,30,40,200]
["Goldfields","Gold","Wetland Formation","Gold0074",1.36,"E","Endangered","wetlands","Non-woody wetland","GoldfieldsWetland Formation","0",null,0,null,null,null,null,null,null,null,null,null,null,null,null,null,null,null,null,null,null,null,null,null,null,null,null,null,null,null,null,null,null,null,null,null,null,null,null,null,null,null,null,null,null,null,null,5,0,null,null,null,null,0]
["Greater Grampians","GGr","Alluvial Terraces Herb-rich Woodland","GGr_0067",1,"LC","Least Concern","Forest/Woodland","Woody","Greater GrampiansAlluvial Terraces Herb-rich Woodland","70",10,15,15,0,5,1,10,null,null,5,15,4,5,2,5,2,5,15,15,8,10,2,5,null,null,10,15,4,10,null,null,null,null,null,null,null,null,null,null,null,null,0,10,"0","10","Continuous",0,13,10,25,30,10,150]
["Greater Grampians","GGr","Aquatic Herbland","GGr_0653",1.36,"E","Endangered","wetlands","Non-woody wetland","Greater GrampiansAquatic Herbland","0",0,0,null,null,null,null,null,null,null,null,null,null,null,null,null,2,10,5,40,2,10,null,null,1,5,4,10,2,15,null,null,null,null,null,null,null,null,null,null,null,null,null,null,null,null,"Episodic",5,6,null,9,null,10,0]
["Greater Grampians","GGr","Basalt Shrubby Woodland","GGr_0642",1,"E","Endangered","Forest/Woodland","Woody","Greater GrampiansBasalt Shrubby Woodland","70",15,15,15,0,5,2,10,null,null,2,5,null,null,2,1,2,1,10,15,5,10,3,5,1,5,10,25,3,10,null,null,null,null,1,15,null,null,null,null,null,null,0,10,"0","10","Continuous",0,14,4,17,15,20,150]
["Greater Grampians","GGr","Claypan Ephemeral Wetland","GGr_0284",1.36,"V","Vulnerable","wetlands","Non-woody wetland","Greater GrampiansClaypan Ephemeral Wetland","0",0,0,null,null,null,null,null,null,null,null,null,null,null,null,null,null,null,3,20,7,15,null,null,null,null,4,20,1,1,null,null,null,null,null,null,null,null,null,null,null,null,null,null,"0","10","Episodic",5,5,null,10,null,10,0]
["Greater Grampians","GGr","Creekline Grassy Woodland","GGr_0068",1,"E","Endangered","Forest/Woodland","Woody","Greater GrampiansCreekline Grassy Woodland","80",15,15,15,0,5,2,15,null,null,5,10,1,1,null,null,2,5,6,10,3,5,2,10,1,5,10,30,3,10,null,null,null,null,null,null,null,null,null,null,3,10,0,10,null,null,"Continuous",0,13,8,11,26,40,200]
["Greater Grampians","GGr","Creekline Sedgy Woodland","GGr_0640",1,"E","Endangered","Forest/Woodland","Woody","Greater GrampiansCreekline Sedgy Woodland","80",15,15,15,0,5,2,10,null,null,2,5,2,1,null,null,2,5,5,10,1,1,3,15,1,5,6,20,null,null,null,null,null,null,null,null,null,null,null,null,null,null,0,10,null,null,"Continuous",0,11,6,8,16,40,200]
["Greater Grampians","GGr","Damp Forest","GGr_0029",1,"LC","Least Concern","Forest/Woodland","Woody","Greater GrampiansDamp Forest","90",20,30,40,0,5,1,10,null,null,3,10,null,null,null,null,1,5,3,10,null,null,null,null,1,5,1,5,1,10,null,null,null,null,2,20,"1","5",null,null,1,5,0,20,null,null,"Continuous",0,12,4,4,20,50,300]
["Greater Grampians","GGr","Damp Heath Scrub","GGr_0165",1.36,"LC","Least Concern","heathlands","Woody","Greater GrampiansDamp Heath Scrub","0",0,0,null,null,null,null,null,null,null,8,40,5,10,null,null,1,1,2,5,1,0,3,10,1,5,4,10,3,30,null,null,null,null,null,null,null,null,null,null,null,null,0,10,null,null,"Episodic",20,10,13,4,50,40,0]
["Greater Grampians","GGr","Damp Heathland","GGr_0710",1.36,"LC","Least Concern","heathlands","Woody","Greater GrampiansDamp Heathland","0",0,0,null,null,null,null,null,null,null,6,30,5,20,2,5,null,null,6,10,2,1,1,5,1,1,4,10,3,15,null,null,null,null,null,null,null,null,null,null,2,5,0,10,"0","10","Episodic",30,12,11,8,50,20,0]
["Greater Grampians","GGr","Damp Sands Herb-rich Woodland","GGr_0003",1,"LC","Least Concern","Forest/Woodland","Woody","Greater GrampiansDamp Sands Herb-rich Woodland","70",15,15,15,0,5,1,5,null,null,6,30,3,5,1,1,null,null,6,10,5,5,2,10,null,null,2,5,2,10,null,null,null,null,1,10,null,null,null,null,null,null,0,20,null,null,"Continuous",0,12,10,11,40,40,150]
["Greater Grampians","GGr","Dry Creekline Woodland","GGr_0285",1,"E","Endangered","Forest/Woodland","Woody","Greater GrampiansDry Creekline Woodland","70",15,15,20,0,5,null,null,null,null,4,20,null,null,null,null,1,1,5,10,3,0,1,5,null,null,5,20,2,5,"2","1",null,null,null,null,null,null,null,null,null,null,0,20,null,null,"Continuous",0,10,4,9,20,20,200]
["Greater Grampians","GGr","Floodplain Thicket","GGr_0280",1,"LC","Least Concern","Forest/Woodland","Woody","Greater GrampiansFloodplain Thicket","80",10,15,10,0,5,1,5,null,null,8,50,1,5,null,null,1,5,2,1,1,1,4,15,null,null,2,5,3,15,null,null,null,null,null,null,null,null,null,null,null,null,0,20,null,null,"Episodic",5,11,10,4,60,20,100]
["Greater Grampians","GGr","Freshwater Meadow","GGr_0680",1.36,"E","Endangered","wetlands","Non-woody wetland","Greater GrampiansFreshwater Meadow","0",null,0,null,null,null,null,null,null,null,null,null,null,null,null,null,null,null,null,null,null,null,null,null,null,null,null,null,null,null,null,null,null,null,null,null,null,null,null,null,null,null,null,null,null,null,null,0,0,null,null,null,null,0]
["Greater Grampians","GGr","Grassy Dry Forest","GGr_0022",1,"D","Depleted","Forest/Woodland","Woody","Greater GrampiansGrassy Dry Forest","60",20,20,30,0,5,2,5,null,null,3,10,3,5,2,5,3,5,7,20,3,5,2,5,null,null,6,25,1,5,null,null,null,null,1,1,null,null,null,null,1,1,0,10,"0","10","Continuous",0,15,8,13,20,20,200]
["Greater Grampians","GGr","Grassy Woodland","GGr_0175",1,"E","Endangered","Forest/Woodland","Woody","Greater GrampiansGrassy Woodland","70",15,15,15,0,5,2,10,null,null,2,10,2,1,2,5,2,5,8,20,3,5,1,1,null,null,8,40,1,5,null,null,null,null,null,null,null,null,null,null,1,1,0,10,null,null,"Continuous",0,13,6,13,21,20,150]
["Greater Grampians","GGr","Heathland Thicket","GGr_0279",1.36,"LC","Least Concern","heathlands","Woody","Greater GrampiansHeathland Thicket","0",0,0,null,null,null,null,null,null,null,8,50,4,10,1,1,2,5,3,5,null,null,1,5,null,null,4,10,2,5,null,null,null,null,null,null,null,null,null,null,2,1,0,10,null,null,"Episodic",30,10,12,5,60,20,0]
["Greater Grampians","GGr","Heathy Dry Forest","GGr_0020",1,"LC","Least Concern","Forest/Woodland","Woody","Greater GrampiansHeathy Dry Forest","60",20,20,30,0,5,1,5,null,null,13,25,12,20,3,5,null,null,10,20,3,5,1,5,2,5,7,10,2,5,null,null,null,null,1,1,null,null,null,null,2,5,0,10,"0","10","Episodic",20,15,26,13,50,20,200]
["Greater Grampians","GGr","Heathy Woodland","GGr_0048",1,"LC","Least Concern","Forest/Woodland","Woody","Greater GrampiansHeathy Woodland","60",15,10,15,0,5,null,null,null,null,10,40,10,20,3,5,1,1,6,10,2,1,2,5,1,5,6,10,2,10,null,null,null,null,null,null,null,null,null,null,2,5,0,10,"0","10","Episodic",20,14,20,9,60,40,150]
["Greater Grampians","GGr","Herb-rich Foothill Forest","GGr_0023",1,"D","Depleted","Forest/Woodland","Woody","Greater GrampiansHerb-rich Foothill Forest","70",20,25,40,0,5,2,10,null,null,7,25,2,1,null,null,4,5,10,15,3,5,2,5,1,5,3,10,2,5,null,null,null,null,3,10,null,null,null,null,2,5,0,20,null,null,"Continuous",0,14,11,17,36,40,200]
["Greater Grampians","GGr","Herb-rich Heathy Forest","GGr_0278",1,"LC","Least Concern","Forest/Woodland","Woody","Greater GrampiansHerb-rich Heathy Forest","70",20,15,30,0,5,null,null,null,null,10,20,5,5,2,5,3,5,10,20,5,5,3,5,null,null,8,15,2,10,null,null,null,null,2,5,null,null,null,null,3,5,0,20,null,null,"Episodic",30,13,15,18,25,40,200]
["Greater Grampians","GGr","Hills Herb-rich Woodland","GGr_0071",1,"LC","Least Concern","Forest/Woodland","Woody","Greater GrampiansHills Herb-rich Woodland","70",15,15,15,0,5,1,5,null,null,6,10,6,10,3,5,4,5,15,25,5,10,2,5,null,null,8,15,2,5,null,null,null,null,null,null,null,null,null,null,null,null,0,10,"0","10","Continuous",0,13,13,24,25,20,150]
["Greater Grampians","GGr","Lateritic Woodland","GGr_0704",1,"D","Depleted","Forest/Woodland","Woody","Greater GrampiansLateritic Woodland","70",15,15,15,0,5,1,5,null,null,11,25,11,20,4,5,2,5,14,10,4,5,3,10,null,null,15,20,4,10,"4","1",null,null,null,null,null,null,null,null,3,5,0,10,"0","10","Continuous",0,15,23,20,50,20,150]
["Greater Grampians","GGr","Lowland Forest","GGr_0016",1,"LC","Least Concern","Forest/Woodland","Woody","Greater GrampiansLowland Forest","70",20,25,30,0,5,2,10,null,null,14,30,6,10,2,5,1,1,8,15,2,5,2,5,1,5,5,10,2,5,null,null,null,null,2,5,null,null,null,null,3,5,0,10,null,null,"Continuous",0,15,22,11,50,40,200]
["Greater Grampians","GGr","Montane Grassy Woodland","GGr_0037",1,"LC","Least Concern","Forest/Woodland","Woody","Greater GrampiansMontane Grassy Woodland","0",20,5,20,null,null,null,null,null,null,6,20,3,10,2,5,2,5,15,20,3,10,2,5,null,null,7,20,1,1,null,null,null,null,null,null,null,null,null,null,null,null,0,10,"0","10","Continuous",0,11,9,20,30,20,150]
["Greater Grampians","GGr","Montane Rocky Shrubland","GGr_0192",1.25,"LC","Least Concern","scrubs/shrublands/mallee without logs","Woody","Greater GrampiansMontane Rocky Shrubland","0",15,0,null,null,null,null,null,null,null,10,40,4,10,1,1,null,null,2,1,null,null,2,5,null,null,4,5,1,1,null,null,null,null,null,null,null,null,"1","1",null,null,0,20,null,null,"Episodic",30,9,14,2,50,40,100]
["Greater Grampians","GGr","Montane Wet Heathland","GGr_0184",1.36,"LC","Least Concern","heathlands","Woody","Greater GrampiansMontane Wet Heathland","0",0,0,null,null,null,null,null,null,null,6,40,2,5,null,null,null,null,2,1,null,null,1,5,null,null,4,20,2,20,null,null,null,null,null,null,null,null,null,null,null,null,0,20,null,null,"Episodic",30,7,8,2,45,20,0]
["Greater Grampians","GGr","Plains Grassy Wetland","GGr_0125",1.36,"E","Endangered","wetlands","Non-woody wetland","Greater GrampiansPlains Grassy Wetland","0",0,0,null,null,null,null,null,null,null,null,null,null,null,null,null,6,10,11,20,4,10,2,10,null,null,11,30,2,10,"2","1",null,null,null,null,null,null,null,null,null,null,0,10,null,null,"Episodic",5,8,null,21,null,10,50]
["Greater Grampians","GGr","Plains Grassy Woodland","GGr_0055",1,"V","Vulnerable","Forest/Woodland","Woody","Greater GrampiansPlains Grassy Woodland","80",15,15,15,0,5,1,1,null,null,1,5,2,5,1,1,1,1,18,25,4,10,3,5,null,null,15,40,4,5,null,null,null,null,null,null,null,null,null,null,null,null,0,10,null,null,"Continuous",0,12,4,23,11,10,100]
["Greater Grampians","GGr","Plains Sedgy Wetland","GGr_0647",1.36,"E","Endangered","wetlands","Non-woody wetland","Greater GrampiansPlains Sedgy Wetland","0",0,0,null,null,null,null,null,null,null,null,null,null,null,null,null,2,5,5,40,5,10,2,5,1,5,4,25,2,5,null,null,null,null,null,null,null,null,null,null,null,null,null,null,null,null,"Episodic",5,7,null,12,null,10,50]
["Greater Grampians","GGr","Plains Sedgy Woodland","GGr_0283",1,"V","Vulnerable","Forest/Woodland","Woody","Greater GrampiansPlains Sedgy Woodland","70",15,15,10,0,5,null,null,null,null,2,5,2,1,null,null,4,15,10,20,2,5,2,1,1,1,13,30,4,20,null,null,null,null,null,null,null,null,null,null,null,null,0,10,null,null,"Continuous",0,11,4,16,6,10,150]
["Greater Grampians","GGr","Plains Woodland","GGr_0803",1,"E","Endangered","Forest/Woodland","Woody","Greater GrampiansPlains Woodland","40/70",15,15,15,0,5,null,null,null,null,2,5,2,5,1,1,1,1,20,25,4,10,1,5,1,1,16,30,3,5,null,null,null,null,null,null,null,null,null,null,null,null,0,10,null,null,"Continuous",0,12,4,25,10,20,100]
["Greater Grampians","GGr","Red Gum Swamp","GGr_0292",1,"V","Vulnerable","Forest/Woodland","Woody","Greater GrampiansRed Gum Swamp","80",10,15,15,0,5,null,null,null,null,null,null,null,null,null,null,2,10,7,25,2,1,2,15,null,null,6,20,2,15,null,null,null,null,null,null,null,null,null,null,null,null,null,null,null,null,"Episodic",5,7,null,11,null,10,100]
["Greater Grampians","GGr","Riparian Forest","GGr_0018",1,"D","Depleted","Forest/Woodland","Woody","Greater GrampiansRiparian Forest","80",20,30,40,0,5,2,10,null,null,8,20,2,1,null,null,null,null,3,5,1,1,4,20,null,null,3,5,3,5,null,null,null,null,5,25,"1","5",null,null,1,1,0,20,null,null,"Continuous",0,13,12,4,31,50,300]
["Greater Grampians","GGr","Riparian Scrub","GGr_0191",1.25,"LC","Least Concern","scrubs/shrublands/mallee without logs","Woody","Greater GrampiansRiparian Scrub","0",0,0,null,null,null,null,null,null,null,6,20,3,5,null,null,2,1,4,5,2,1,2,20,null,null,3,5,5,10,"1","0",null,null,1,5,null,null,null,null,3,15,0,20,null,null,"Continuous",0,12,9,8,25,40,0]
["Greater Grampians","GGr","Riparian Shrubland","GGr_0019",1.25,"LC","Least Concern","scrubs/shrublands/mallee without logs","Woody","Greater GrampiansRiparian Shrubland","0",20,0,null,null,null,null,null,null,null,6,40,null,null,null,null,2,5,6,10,2,5,3,10,null,null,3,10,2,1,null,null,null,null,2,5,null,null,null,null,2,5,0,10,null,null,"Episodic",5,10,6,10,40,20,100]
["Greater Grampians","GGr","Riparian Woodland","GGr_0641",1,"E","Endangered","Forest/Woodland","Woody","Greater GrampiansRiparian Woodland","80",15,15,10,0,5,2,10,null,null,2,10,1,1,null,null,4,10,5,10,1,5,3,10,null,null,4,30,2,5,null,null,null,null,null,null,null,null,null,null,1,5,0,10,null,null,"Continuous",0,12,5,10,21,30,200]
["Greater Grampians","GGr","Rocky Outcrop Herbland","GGr_0193",1.36,"LC","Least Concern","grasslands","Non-woody wetland","Greater GrampiansRocky Outcrop Herbland","0",0,0,null,null,null,2,10,null,null,4,10,4,5,2,1,1,1,3,5,null,null,2,5,null,null,3,5,2,5,null,null,null,null,1,1,null,null,null,null,1,1,0,40,null,null,"Continuous",0,12,10,4,25,10,0]
["Greater Grampians","GGr","Rocky Outcrop Shrubland","GGr_0028",1.36,"LC","Least Concern","heathlands","Woody","Greater GrampiansRocky Outcrop Shrubland","0",0,0,null,null,null,null,null,null,null,13,55,7,15,2,5,1,1,4,5,2,1,2,5,null,null,6,10,2,5,null,null,null,null,null,null,null,null,null,null,1,1,0,20,"0","10","Continuous",0,12,20,7,70,40,0]
["Greater Grampians","GGr","Sand Forest","GGr_0134",1,"E","Endangered","Forest/Woodland","Woody","Greater GrampiansSand Forest","70",15,20,30,0,5,1,5,null,null,3,5,1,5,2,5,null,null,2,5,null,null,1,1,null,null,7,15,2,1,null,null,null,null,1,50,null,null,null,null,null,null,0,10,null,null,"Continuous",0,11,5,2,15,40,150]
["Greater Grampians","GGr","Sand Heathland","GGr_0006",1.36,"LC","Least Concern","heathlands","Woody","Greater GrampiansSand Heathland","0",0,0,null,null,null,null,null,null,null,9,45,9,20,2,1,1,1,5,10,2,1,2,10,1,5,5,15,3,15,null,null,null,null,null,null,null,null,null,null,1,1,0,10,"0","10","Episodic",30,13,18,8,65,20,0]
["Greater Grampians","GGr","Seasonally Inundated Shrubby Woodland","GGr_0195",1,"LC","Least Concern","Forest/Woodland","Woody","Greater GrampiansSeasonally Inundated Shrubby Woodland","70",15,15,15,0,5,null,null,null,null,7,40,6,20,1,1,null,null,4,10,1,1,null,null,null,null,5,15,2,10,null,null,null,null,null,null,null,null,null,null,null,null,0,10,"0","10","Continuous",0,10,13,5,60,20,150]
["Greater Grampians","GGr","Sedge Wetland","GGr_0136",1.36,"E","Endangered","wetlands","Non-woody wetland","Greater GrampiansSedge Wetland","80",5,15,10,0,5,null,null,null,null,1,5,null,null,null,null,1,1,1,1,null,null,1,1,1,10,2,15,2,35,null,null,null,null,null,null,null,null,null,null,1,5,null,null,null,null,"Episodic",5,9,1,2,5,0,0]
["Greater Grampians","GGr","Sedgy Riparian Woodland","GGr_0198",1,"LC","Least Concern","Forest/Woodland","Woody","Greater GrampiansSedgy Riparian Woodland","70",15,15,20,0,5,3,15,null,null,6,25,1,5,1,1,null,null,5,10,null,null,3,20,1,5,3,5,2,10,null,null,null,null,2,10,null,null,null,null,null,null,0,20,null,null,"Continuous",0,12,10,5,45,30,200]
["Greater Grampians","GGr","Shallow Freshwater Marsh","GGr_0200",1.36,"V","Vulnerable","wetlands","Non-woody wetland","Greater GrampiansShallow Freshwater Marsh","0",null,0,null,null,null,null,null,null,null,null,null,null,null,null,null,null,null,null,null,null,null,null,null,null,null,null,null,null,null,null,null,null,null,null,null,null,null,null,null,null,null,null,null,null,null,null,5,0,null,null,null,null,0]
["Greater Grampians","GGr","Shallow Sands Woodland","GGr_0882",1,"V","Vulnerable","Forest/Woodland","Woody","Greater GrampiansShallow Sands Woodland","70",15,15,15,0,5,1,5,null,null,5,20,6,15,3,5,3,5,19,20,4,5,2,5,null,null,13,20,4,5,null,null,null,null,null,null,null,null,null,null,null,null,0,10,"0","10","Continuous",0,13,12,26,40,20,150]
["Greater Grampians","GGr","Shrubby Foothill Forest","GGr_0045",1,"LC","Least Concern","Forest/Woodland","Woody","Greater GrampiansShrubby Foothill Forest","70",20,25,40,0,5,1,10,"1","1",13,40,5,10,3,5,1,1,5,10,null,null,2,5,1,10,6,15,2,5,null,null,null,null,2,5,null,null,null,null,2,5,0,10,null,null,"Episodic",30,15,19,6,60,40,200]
["Greater Grampians","GGr","Shrubby Woodland","GGr_0282",1,"LC","Least Concern","Forest/Woodland","Woody",{"$f":"CONCATENATE(A451,C451)","v":"Greater GrampiansShrubby Woodland"},"70",15,15,20,0,5,2,10,null,null,6,40,3,5,1,1,2,1,5,5,2,5,2,10,1,5,4,10,2,10,null,null,null,null,1,1,null,null,null,null,null,null,0,10,null,null,"Continuous",0,14,11,9,55,20,150]
["Greater Grampians","GGr","Stony Rises Woodland","GGr_0203",1,"V","Vulnerable","Forest/Woodland","Woody","Greater GrampiansStony Rises Woodland","0",0,0,null,null,null,null,null,null,null,null,null,null,null,null,null,null,null,null,null,null,null,null,null,null,null,null,null,null,null,null,null,null,null,null,null,null,null,null,null,null,null,null,null,null,null,null,0,0,null,null,null,0,0]
["Greater Grampians","GGr","Swamp Scrub","GGr_0053",1.25,"E","Endangered","scrubs/shrublands/mallee without logs","Woody","Greater GrampiansSwamp Scrub","0",0,0,50,null,null,null,null,null,null,2,10,1,1,null,null,5,5,9,15,3,10,2,15,2,5,4,15,3,15,null,null,null,null,2,5,null,null,null,null,1,5,0,20,null,null,"Continuous",0,12,3,17,11,40,0]
["Greater Grampians","GGr","Tall Marsh","GGr_0821",1.36,"TBC","TBC","wetlands","Non-woody wetland","Greater GrampiansTall Marsh","0",0,0,null,null,null,null,null,null,null,null,null,null,null,null,null,3,10,2,5,6,10,1,5,2,40,null,null,1,1,null,null,null,null,null,null,null,null,null,null,null,null,null,null,null,null,"Episodic",5,6,null,11,null,10,0]
["Greater Grampians","GGr","Valley Grassy Forest","GGr_0047",1,"V","Vulnerable","Forest/Woodland","Woody","Greater GrampiansValley Grassy Forest","70",20,25,20,0,5,3,10,null,null,10,20,5,5,2,5,3,5,16,20,5,5,3,5,1,1,8,15,2,10,null,null,null,null,2,5,null,null,"1","0",3,5,0,20,null,null,"Continuous",0,16,18,24,35,40,200]
["Greater Grampians","GGr","Wet Forest","GGr_0030",1,"LC","Least Concern","Forest/Woodland","Woody","Greater GrampiansWet Forest","90",20,30,40,0,5,2,20,null,null,4,15,1,1,null,null,2,5,3,5,null,null,2,5,1,5,2,5,2,5,null,null,null,null,6,20,"2","20","2","1",1,1,0,20,null,null,"Continuous",0,15,7,5,36,50,300]
["Greater Grampians","GGr","Wet Heathland","GGr_0008",1.36,"V","Vulnerable","heathlands","Woody","Greater GrampiansWet Heathland","0",0,0,null,null,null,null,null,null,null,8,35,5,10,1,1,2,5,5,10,2,1,3,15,1,5,5,10,5,15,"1","1",null,null,2,5,null,null,null,null,1,1,0,20,null,null,"Episodic",30,14,13,9,45,20,0]
["Highlands Far East","HFE","Cool Temperate Rainforest","HFE_0031",1,"R","Rare","Forest/Woodland","Woody","Highlands Far EastCool Temperate Rainforest","70",20,25,50,0,5,2,20,null,null,2,5,null,null,null,null,2,10,2,5,null,null,null,null,null,null,null,null,null,null,null,null,null,null,6,25,"2","25","2","5",2,1,0,20,null,null,"Continuous",0,10,4,4,25,50,200]
["Highlands Far East","HFE","Cool Temperate Rainforest/Warm Temperate Rainf","HFE_0033",1,"R","Rare","Forest/Woodland","Woody","Highlands Far EastCool Temperate Rainforest/Warm Temperate Rainf","70",20,20,50,0,5,5,25,null,null,6,15,null,null,null,null,2,1,3,5,1,1,2,1,2,1,2,5,null,null,null,null,null,null,8,25,"3","20","4","5",7,20,0,20,null,null,"Continuous",0,14,11,6,40,50,200]
["Highlands Far East","HFE","Damp Forest","HFE_0029",1,"LC","Least Concern","Forest/Woodland","Woody","Highlands Far EastDamp Forest","90",20,30,40,0,5,3,15,null,null,10,25,2,5,null,null,2,1,6,15,1,1,2,5,1,5,4,10,1,1,null,null,null,null,4,20,"1","5",null,null,4,10,0,20,null,null,"Continuous",0,15,15,9,45,50,300]
["Highlands Far East","HFE","Lowland Forest","HFE_0016",1,"LC","Least Concern","Forest/Woodland","Woody","Highlands Far EastLowland Forest","70",20,25,30,0,5,2,10,null,null,7,25,3,10,1,1,1,1,4,10,null,null,1,5,2,10,3,10,1,1,null,null,null,null,3,15,null,null,null,null,3,5,0,10,null,null,"Continuous",0,14,12,5,45,40,200]
["Highlands Far East","HFE","Montane Damp Forest","HFE_0038",1,"TBC","Least Concern","Forest/Woodland","Woody","Highlands Far EastMontane Damp Forest","90",20,30,40,0,5,2,15,null,null,7,25,3,10,1,1,3,5,8,15,2,5,1,1,null,null,6,15,1,1,null,null,null,null,2,10,"1","1",null,null,1,5,0,20,null,null,"Continuous",0,15,12,13,50,50,300]
["Highlands Far East","HFE","Montane Dry Woodland","HFE_0036",1,"LC","Least Concern","Forest/Woodland","Woody","Highlands Far EastMontane Dry Woodland","50",15,15,20,0,5,2,20,"1","1",6,20,2,5,null,null,2,5,9,20,2,5,2,5,null,null,6,15,1,5,null,null,null,null,1,5,null,null,null,null,null,null,0,10,"0","10","Continuous",0,14,10,13,45,20,150]
["Highlands Far East","HFE","Montane Grassy Woodland","HFE_0037",1,"TBC","TBC","Forest/Woodland","Woody","Highlands Far EastMontane Grassy Woodland","60",15,10,20,0,5,1,5,null,null,2,10,3,5,1,1,1,1,8,20,2,5,1,5,null,null,5,25,1,5,null,null,null,null,1,1,null,null,null,null,1,1,0,10,"0","10","Continuous",0,15,6,11,20,20,150]
["Highlands Far East","HFE","Montane Riparian Thicket","HFE_0041",1.25,"LC","Least Concern","scrubs/shrublands/mallee without logs","Woody","Highlands Far EastMontane Riparian Thicket","0",0,0,null,null,null,null,null,null,null,3,5,null,null,null,null,null,null,null,null,2,1,2,40,null,null,2,1,null,null,null,null,null,null,3,20,"1","5","2","1",null,null,0,20,null,null,"Continuous",0,8,3,2,5,40,50]
["Highlands Far East","HFE","Montane Riparian Woodland","HFE_0040",1,"V","Vulnerable","Forest/Woodland","Woody","Highlands Far EastMontane Riparian Woodland","60",15,10,15,0,5,1,10,null,null,3,10,3,5,null,null,4,10,12,20,4,10,3,5,1,1,6,30,3,5,null,null,null,null,2,5,null,null,null,null,null,null,0,20,null,null,"Continuous",0,13,7,20,25,40,150]
["Highlands Far East","HFE","Montane Wet Forest","HFE_0039",1,"TBC","Least Concern","Forest/Woodland","Woody","Highlands Far EastMontane Wet Forest","90",20,30,40,0,5,5,30,null,null,5,25,1,1,null,null,null,null,3,5,null,null,1,1,1,1,2,10,null,null,null,null,null,null,4,30,"2","10",null,null,1,1,0,20,null,null,"Continuous",0,12,11,3,56,50,300]
["Highlands Far East","HFE","Riparian Forest","HFE_0018",1,"LC","Least Concern","Forest/Woodland","Woody","Highlands Far EastRiparian Forest","80",20,30,40,0,5,4,20,null,null,11,30,null,null,null,null,3,5,9,10,2,5,3,5,1,5,6,10,2,5,null,null,null,null,4,15,"2","5",null,null,5,10,0,10,null,null,"Continuous",0,14,15,14,50,50,300]
["Highlands Far East","HFE","Rocky Outcrop Shrubland","HFE_0028",1.36,"R","Rare","heathlands","Woody","Highlands Far EastRocky Outcrop Shrubland","0",0,0,null,null,null,null,null,null,null,10,50,3,15,1,1,3,5,3,5,null,null,1,5,null,null,5,10,null,null,null,null,null,null,null,null,null,null,null,null,1,1,0,10,"0","10","Continuous",0,10,13,6,65,40,100]
["Highlands Far East","HFE","Shrubby Dry Forest","HFE_0021",1,"LC","Least Concern","Forest/Woodland","Woody","Highlands Far EastShrubby Dry Forest","70",20,25,30,0,5,1,10,null,null,6,30,2,5,null,null,null,null,5,5,null,null,1,1,2,5,3,10,1,1,null,null,null,null,2,5,null,null,null,null,3,5,0,10,"0","10","Episodic",20,13,9,5,45,30,200]
["Highlands Far East","HFE","Tableland Damp Forest","HFE_0035",1,"LC","Least Concern","Forest/Woodland","Woody","Highlands Far EastTableland Damp Forest","90",20,30,40,0,5,3,20,null,null,7,20,2,10,null,null,2,5,8,15,2,15,1,5,1,1,3,15,1,5,null,null,null,null,2,5,null,null,null,null,1,1,0,20,null,null,"Continuous",0,14,12,12,50,50,300]
["Highlands Far East","HFE","Valley Grassy Forest","HFE_0047",1,"D","Depleted","Forest/Woodland","Woody","Highlands Far EastValley Grassy Forest","70",20,25,20,0,5,3,15,null,null,7,25,1,1,2,1,3,5,10,20,3,5,3,15,null,null,5,20,2,5,null,null,null,null,2,5,null,null,null,null,5,5,0,20,null,null,"Continuous",0,14,11,16,41,20,200]
["Highlands Far East","HFE","Warm Temperate Rainforest","HFE_0032",1,"R","Rare","Forest/Woodland","Woody","Highlands Far EastWarm Temperate Rainforest","70",20,20,50,0,5,5,25,null,null,6,15,null,null,null,null,2,1,5,10,1,1,1,1,1,1,2,5,1,1,null,null,null,null,8,25,"2","20","4","5",9,20,0,20,null,null,"Continuous",0,15,11,8,40,50,200]
["Highlands Far East","HFE","Wet Forest","HFE_0030",1,"LC","Least Concern","Forest/Woodland","Woody","Highlands Far EastWet Forest","90",20,50,40,0,5,4,20,null,null,7,25,null,null,null,null,1,1,5,15,1,1,1,1,1,1,3,5,1,1,null,null,null,null,4,30,"2","15","1","1",4,10,0,20,null,null,"Continuous",0,15,11,7,45,50,300]
["Highlands Northern Fall","HNF","Blackthorn Scrub","HNF_0027",1.25,"R","Rare","scrubs/shrublands/mallee without logs","Woody","Highlands Northern FallBlackthorn Scrub","0",0,0,null,null,null,null,null,null,null,null,null,null,null,null,null,null,null,null,null,null,null,null,null,null,null,null,null,null,null,null,null,null,null,null,null,null,null,null,null,null,null,null,null,null,null,null,0,0,null,null,null,0,0]
["Highlands Northern Fall","HNF","Clay Heathland","HNF_0007",1.36,"V","Vulnerable","heathlands","Woody","Highlands Northern FallClay Heathland","0",0,0,null,null,null,null,null,null,null,9,30,6,10,3,5,2,1,8,10,null,null,4,10,1,5,7,10,2,5,null,null,null,null,null,null,null,null,null,null,null,null,0,10,"0","10","Episodic",30,11,15,10,40,20,0]
["Highlands Northern Fall","HNF","Clay Heathland - treed","HNF_0007_61",1,"V","Vulnerable","heathlands","Woody","Highlands Northern FallClay Heathland - treed","40",10,8,10,null,null,null,null,null,null,9,30,6,10,3,5,2,1,8,10,null,null,4,10,1,5,7,10,2,5,null,null,null,null,null,null,null,null,null,null,null,null,0,10,"0","10","Episodic",30,11,15,10,40,20,50]
["Highlands Northern Fall","HNF","Cool Temperate Rainforest","HNF_0031",1,"E","Endangered","Forest/Woodland","Woody","Highlands Northern FallCool Temperate Rainforest","70",20,25,50,0,5,2,10,null,null,4,10,null,null,null,null,null,null,3,5,null,null,1,1,1,5,1,1,null,null,null,null,null,null,6,25,"2","25","3","5",2,1,0,20,null,null,"Continuous",0,12,6,3,20,50,200]
["Highlands Northern Fall","HNF","Creekline Grassy Woodland","HNF_0068",1,"E","Endangered","Forest/Woodland","Woody","Highlands Northern FallCreekline Grassy Woodland","80",15,15,15,0,5,1,5,null,null,4,10,3,5,null,null,2,5,9,15,3,5,3,15,1,5,15,30,3,5,null,null,null,null,null,null,null,null,null,null,null,null,0,10,null,null,"Continuous",0,12,8,14,20,40,300]
["Highlands Northern Fall","HNF","Damp Forest","HNF_0029",1,"LC","Least Concern","Forest/Woodland","Woody","Highlands Northern FallDamp Forest","90",20,30,40,0,5,5,30,null,null,6,15,null,null,null,null,2,1,8,15,2,1,1,1,1,5,2,5,1,1,null,null,null,null,3,15,"1","5",null,null,2,5,0,20,null,null,"Continuous",0,14,11,12,45,50,300]
["Highlands Northern Fall","HNF","Damp Sands Herb-rich Woodland","HNF_0003",1,"V","Vulnerable","Forest/Woodland","Woody","Highlands Northern FallDamp Sands Herb-rich Woodland","70",15,15,15,0,5,1,10,null,null,3,10,3,5,null,null,null,null,12,20,7,15,1,10,null,null,10,15,2,10,null,null,null,null,1,10,null,null,null,null,null,null,0,10,null,null,"Continuous",0,11,7,19,25,40,150]
["Highlands Northern Fall","HNF","Dry Valley Forest","HNF_0169",1,"V","Vulnerable","Forest/Woodland","Woody","Highlands Northern FallDry Valley Forest","70",20,20,30,0,5,4,15,null,null,9,30,3,10,1,1,4,5,11,15,3,5,3,5,null,null,4,15,1,1,null,null,null,null,3,10,"1","5",null,null,2,5,0,10,null,null,"Continuous",0,15,16,18,55,40,200]
["Highlands Northern Fall","HNF","Floodplain Riparian Woodland","HNF_0056",1,"E","Endangered","Forest/Woodland","Woody","Highlands Northern FallFloodplain Riparian Woodland","80",15,20,15,0,5,2,10,null,null,6,15,1,1,null,null,4,10,4,10,1,1,3,10,2,10,3,10,3,10,null,null,null,null,1,5,null,null,null,null,1,5,0,10,null,null,"Episodic",10,14,9,9,26,40,300]
["Highlands Northern Fall","HNF","Granitic Hills Woodland","HNF_0072",1,"LC","Least Concern","Forest/Woodland","Woody","Highlands Northern FallGranitic Hills Woodland","60",15,10,15,0,5,1,5,null,null,4,20,3,20,null,null,2,5,11,20,null,null,null,null,null,null,4,5,3,5,null,null,null,null,1,1,null,null,null,null,null,null,0,10,null,null,"Continuous",0,10,8,13,45,20,150]
["Highlands Northern Fall","HNF","Grassy Dry Forest","HNF_0022",1,"LC","Least Concern","Forest/Woodland","Woody","Highlands Northern FallGrassy Dry Forest","60",20,20,30,0,5,1,5,null,null,4,10,3,5,2,1,4,5,12,25,3,5,2,5,null,null,8,20,2,1,null,null,null,null,2,5,null,null,null,null,2,1,0,10,"0","10","Continuous",0,15,8,19,20,20,200]
["Highlands Northern Fall","HNF","Grassy Woodland","HNF_0175",1,"D","Depleted","Forest/Woodland","Woody","Highlands Northern FallGrassy Woodland","40/70",15,15,20,0,5,1,5,null,null,3,20,1,1,null,null,5,10,4,10,null,null,2,1,null,null,8,30,1,1,null,null,null,null,2,1,null,null,null,null,1,5,0,10,"0","10","Continuous",0,13,5,9,26,20,150]
["Highlands Northern Fall","HNF","Heathy Dry Forest","HNF_0020",1,"LC","Least Concern","Forest/Woodland","Woody","Highlands Northern FallHeathy Dry Forest","60",20,20,30,0,5,1,5,null,null,8,20,4,10,2,5,2,1,5,5,null,null,1,5,null,null,6,10,null,null,null,null,null,null,1,1,null,null,null,null,1,5,0,10,"0","10","Episodic",20,13,13,7,35,20,200]
["Highlands Northern Fall","HNF","Heathy Woodland","HNF_0048",1,"D","Depleted","Forest/Woodland","Woody","Highlands Northern FallHeathy Woodland","60",15,10,15,0,5,null,null,null,null,7,40,6,20,1,1,null,null,4,5,null,null,2,10,1,5,4,10,null,null,null,null,null,null,1,1,null,null,null,null,null,null,0,10,"0","10","Episodic",20,11,13,4,60,40,150]
["Highlands Northern Fall","HNF","Herb-rich Foothill Forest","HNF_0023",1,"LC","Least Concern","Forest/Woodland","Woody","Highlands Northern FallHerb-rich Foothill Forest","70",20,25,40,0,5,2,10,null,null,7,15,3,5,2,5,3,5,11,20,3,5,2,5,1,1,6,10,2,5,null,null,null,null,2,10,null,null,null,null,2,5,0,20,null,null,"Continuous",0,15,12,17,30,40,200]
["Highlands Northern Fall","HNF","Lake Bed Herbland","HNF_0107",1.36,"E","Endangered","wetlands","Non-woody wetland","Highlands Northern FallLake Bed Herbland","0",null,0,null,null,null,null,null,null,null,null,null,null,null,null,null,null,null,null,null,null,null,null,null,null,null,null,null,null,null,null,null,null,null,null,null,null,null,null,null,null,null,null,null,null,null,null,0,0,null,null,null,null,0]
["Highlands Northern Fall","HNF","Limestone Montane Grassland","HNF_0702_61",1.36,"E","Endangered","grasslands","Other grassland","Highlands Northern FallLimestone Montane Grassland","0",0,0,null,null,null,null,null,null,null,2,5,1,1,1,1,3,5,11,20,3,10,null,null,null,null,6,20,2,5,null,null,null,null,2,5,null,null,null,null,null,null,0,20,"0","10","Continuous",0,11,3,17,6,10,0]
["Highlands Northern Fall","HNF","Lowland Forest","HNF_0016",1,"LC","Least Concern","Forest/Woodland","Woody","Highlands Northern FallLowland Forest","70",20,25,30,0,5,2,10,null,null,6,20,3,5,1,5,1,1,5,10,2,5,2,1,1,10,2,5,1,5,null,null,null,null,2,5,null,null,null,null,1,1,0,10,null,null,"Continuous",0,15,11,8,35,40,200]
["Highlands Northern Fall","HNF","Montane Damp Forest","HNF_0038",1,"LC","Least Concern","Forest/Woodland","Woody","Highlands Northern FallMontane Damp Forest","90",20,30,40,0,5,3,15,null,null,7,20,2,1,1,5,4,5,12,20,2,5,1,1,null,null,6,20,1,5,null,null,null,null,2,15,null,null,null,null,2,5,0,20,null,null,"Continuous",0,14,12,18,36,80,300]
["Highlands Northern Fall","HNF","Montane Dry Woodland","HNF_0036",1,"LC","Least Concern","Forest/Woodland","Woody","Highlands Northern FallMontane Dry Woodland","50",15,15,20,0,5,2,20,null,null,5,20,2,5,2,5,3,5,9,15,null,null,2,5,null,null,6,15,null,null,null,null,null,null,1,5,null,null,null,null,2,1,0,10,"0","10","Continuous",0,13,9,12,45,20,150]
["Highlands Northern Fall","HNF","Montane Grassland","HNF_0702_62",1.36,"E","Endangered","grasslands","Other grassland","Highlands Northern FallMontane Grassland","0",0,0,null,null,null,null,null,null,null,null,null,null,null,1,1,3,5,11,20,3,10,null,null,null,null,6,20,2,5,null,null,null,null,null,null,null,null,null,null,null,null,0,20,"0","10","Continuous",0,8,null,17,null,10,0]
["Highlands Northern Fall","HNF","Montane Grassy Shrubland","HNF_0207",1,"E","Endangered","Forest/Woodland","Woody","Highlands Northern FallMontane Grassy Shrubland","50",0,0,null,null,null,2,20,"1","1",6,20,2,5,null,null,2,5,9,20,2,5,2,5,null,null,6,15,1,5,null,null,null,null,1,5,null,null,null,null,null,null,0,10,"0","10","Continuous",0,13,10,13,45,20,150]
["Highlands Northern Fall","HNF","Montane Grassy Shrubland - treed","HNF_0207_61",1,"E","Endangered","Forest/Woodland","Non-woody wetland","Highlands Northern FallMontane Grassy Shrubland - treed","50",15,15,10,0,5,2,20,"1","1",6,20,2,5,null,null,2,5,9,20,2,5,2,5,null,null,6,15,1,5,null,null,null,null,1,5,null,null,null,null,null,null,0,10,"0","10","Continuous",0,14,10,13,45,20,150]
["Highlands Northern Fall","HNF","Montane Grassy Woodland","HNF_0037",1,"D","Depleted","Forest/Woodland","Woody","Highlands Northern FallMontane Grassy Woodland","50",15,10,20,0,5,1,5,null,null,6,20,3,10,2,5,4,10,15,20,3,10,2,5,null,null,7,20,1,1,null,null,null,null,1,1,null,null,null,null,null,null,0,10,"0","10","Continuous",0,14,10,22,35,20,150]
["Highlands Northern Fall","HNF","Montane Herb-rich Woodland","HNF_0319",1,"LC","Least Concern","Forest/Woodland","Woody","Highlands Northern FallMontane Herb-rich Woodland","70",15,25,40,0,5,2,10,null,null,6,15,2,5,1,1,5,10,12,20,3,5,1,5,null,null,8,25,1,1,null,null,null,null,3,10,null,null,null,null,2,5,0,20,null,null,"Continuous",0,14,10,20,30,20,150]
["Highlands Northern Fall","HNF","Montane Riparian Thicket","HNF_0041",1.25,"R","Rare","scrubs/shrublands/mallee without logs","Woody","Highlands Northern FallMontane Riparian Thicket","0",0,0,null,null,null,null,null,null,null,4,10,null,null,null,null,null,null,4,5,2,1,2,5,null,null,3,5,null,null,null,null,null,null,5,35,"1","1",null,null,null,null,0,20,null,null,"Continuous",0,8,4,6,10,40,50]
["Highlands Northern Fall","HNF","Montane Riparian Woodland","HNF_0040",1,"V","Vulnerable","Forest/Woodland","Woody","Highlands Northern FallMontane Riparian Woodland","60",15,10,15,0,5,1,10,null,null,3,10,3,5,null,null,4,10,12,20,4,10,3,5,1,1,6,30,3,5,null,null,null,null,2,5,null,null,null,null,null,null,0,20,null,null,"Continuous",0,13,7,20,25,40,150]
["Highlands Northern Fall","HNF","Montane Swamp","HNF_0318",1.36,"E","Endangered","wetlands","Woody","Highlands Northern FallMontane Swamp","0",0,0,null,null,null,null,null,null,null,5,20,2,5,null,null,1,1,3,10,2,5,1,5,null,null,4,10,4,15,null,null,null,null,1,1,null,null,null,null,null,null,0,40,null,null,"Episodic",30,10,7,6,25,10,0]
["Highlands Northern Fall","HNF","Montane Wet Forest","HNF_0039",1,"LC","Least Concern","Forest/Woodland","Woody","Highlands Northern FallMontane Wet Forest","90",20,30,40,0,5,5,30,null,null,5,15,null,null,null,null,2,1,6,10,1,1,null,null,1,15,2,5,null,null,null,null,null,null,3,20,"2","5",null,null,2,1,0,20,null,null,"Continuous",0,12,10,9,45,50,300]
["Highlands Northern Fall","HNF","Perched Boggy Shrubland","HNF_0185",1.36,"E","Endangered","heathlands","Woody","Highlands Northern FallPerched Boggy Shrubland","0",0,0,null,null,null,null,null,null,null,6,50,null,null,null,null,2,1,6,10,2,5,4,10,1,5,3,10,2,5,null,null,null,null,2,10,null,null,null,null,null,null,0,30,null,null,"Continuous",0,10,6,10,50,20,0]
["Highlands Northern Fall","HNF","Plains Grassy Woodland","HNF_0055",1,"E","Endangered","Forest/Woodland","Woody","Highlands Northern FallPlains Grassy Woodland","80",10,15,10,0,5,1,5,null,null,3,10,2,1,1,1,3,5,8,15,3,5,2,5,null,null,12,45,2,5,null,null,null,null,null,null,null,null,null,null,null,null,0,10,"0","10","Continuous",0,13,6,14,16,10,100]
["Highlands Northern Fall","HNF","Riparian Forest","HNF_0018",1,"LC","Least Concern","Forest/Woodland","Woody","Highlands Northern FallRiparian Forest","80",20,30,40,0,5,4,20,null,null,7,15,1,1,null,null,2,1,10,15,3,1,4,5,1,5,3,5,2,1,null,null,null,null,5,25,"2","10",null,null,2,5,0,20,null,null,"Continuous",0,15,12,15,36,40,300]
["Highlands Northern Fall","HNF","Riparian Scrub","HNF_0191",1.25,"TBC","TBC","scrubs/shrublands/mallee without logs","Woody","Highlands Northern FallRiparian Scrub","0",0,0,null,null,null,null,null,null,null,3,10,null,null,null,null,4,10,8,10,4,5,3,20,2,5,5,10,3,10,null,null,null,null,null,null,null,null,null,null,1,5,0,20,null,null,"Continuous",0,10,3,16,10,40,0]
["Highlands Northern Fall","HNF","Riparian Shrubland","HNF_0019",1.25,"V","Vulnerable","scrubs/shrublands/mallee without logs","Woody","Highlands Northern FallRiparian Shrubland","0",0,0,null,null,null,null,null,null,null,9,20,null,null,null,null,null,null,2,5,null,null,1,10,null,null,4,5,1,1,null,null,null,null,4,10,"2","1",null,null,2,5,0,20,null,null,"Continuous",0,9,9,2,20,40,100]
["Highlands Northern Fall","HNF","Riparian Thicket","HNF_0059",1.25,"V","Vulnerable","heathlands","Woody","Highlands Northern FallRiparian Thicket","0",0,6,50,null,null,null,null,null,null,8,30,3,5,1,1,2,5,5,10,1,5,3,10,2,5,2,5,3,15,null,null,null,null,3,10,"1","5",null,null,2,5,0,20,null,null,"Continuous",0,14,11,8,35,40,0]
["Highlands Northern Fall","HNF","Riverine Escarpment Scrub","HNF_0082",1.25,"V","Vulnerable","scrubs/shrublands/mallee without logs","Woody","Highlands Northern FallRiverine Escarpment Scrub","0",0,0,null,0,5,null,null,null,null,8,30,1,1,2,1,2,5,12,20,3,5,4,15,null,null,3,10,2,5,null,null,null,null,3,10,null,null,null,null,null,null,0,10,null,null,"Continuous",0,12,9,17,31,40,50]
["Highlands Northern Fall","HNF","Rocky Outcrop Shrubland","HNF_0028",1.36,"R","Rare","heathlands","Woody","Highlands Northern FallRocky Outcrop Shrubland","0",0,0,null,null,null,null,null,null,null,7,25,2,5,null,null,2,5,5,5,2,1,2,5,null,null,4,10,null,null,null,null,null,null,2,5,null,null,null,null,null,null,0,20,"0","10","Continuous",0,10,9,9,30,40,0]
["Highlands Northern Fall","HNF","Shrubby Dry Forest","HNF_0021",1,"LC","Least Concern","Forest/Woodland","Woody","Highlands Northern FallShrubby Dry Forest","70",20,25,30,0,5,2,10,null,null,8,15,3,5,2,5,2,1,7,5,2,1,1,1,1,1,6,10,null,null,null,null,null,null,2,5,null,null,null,null,2,1,0,10,"0","10","Episodic",20,15,13,11,30,20,200]
["Highlands Northern Fall","HNF","Shrubby Foothill Forest","HNF_0045",1,"D","Depleted","Forest/Woodland","Woody","Highlands Northern FallShrubby Foothill Forest","70",20,25,30,0,5,1,5,null,null,5,20,1,5,2,5,null,null,8,15,null,null,1,1,1,15,1,10,2,10,null,null,null,null,3,15,null,null,null,null,2,5,0,10,null,null,"Episodic",30,13,7,8,30,40,200]
["Highlands Northern Fall","HNF","Shrubby Wet Forest","HNF_0201",1,"LC","Least Concern","Forest/Woodland","Woody","Highlands Northern FallShrubby Wet Forest","90",20,30,40,0,5,2,20,null,null,7,25,3,10,null,null,2,1,8,15,2,1,1,1,null,null,6,15,1,1,null,null,null,null,2,5,null,null,null,null,null,null,0,20,null,null,"Continuous",0,12,12,12,55,50,300]
["Highlands Northern Fall","HNF","Sub-alpine Dry Shrubland","HNF_1003",1.25,"R","Rare","scrubs/shrublands/mallee without logs","Woody",{"$f":"CONCATENATE(A515,C515)","v":"Highlands Northern FallSub-alpine Dry Shrubland"},"0",0,0,null,null,null,null,null,null,null,null,null,null,null,null,null,null,null,null,null,null,null,null,null,null,null,null,null,null,null,null,null,null,null,null,null,null,null,null,null,null,null,null,null,null,null,null,0,0,null,null,null,0,0]
["Highlands Northern Fall","HNF","Sub-alpine Grassland","HNF_0206",1.36,"TBC","TBC","grasslands","Other grassland","Highlands Northern FallSub-alpine Grassland","0",0,0,null,null,null,null,null,null,null,1,5,3,5,1,1,3,5,11,20,3,10,1,1,null,null,5,20,2,10,null,null,null,null,null,null,null,null,null,null,null,null,0,20,"0","10","Continuous",0,11,4,17,10,10,0]
["Highlands Northern Fall","HNF","Sub-alpine Wet Heathland","HNF_0210",1.36,"E","Endangered","heathlands","Woody","Highlands Northern FallSub-alpine Wet Heathland","0",0,0,null,null,null,null,null,null,null,6,30,2,10,null,null,5,5,10,15,4,10,1,1,null,null,10,20,4,15,null,null,null,null,null,null,null,null,null,null,null,null,0,20,null,null,"Episodic",30,9,8,19,40,10,0]
["Highlands Northern Fall","HNF","Sub-alpine Woodland","HNF_0043",1,"LC","Least Concern","Forest/Woodland","Woody","Highlands Northern FallSub-alpine Woodland","40",15,10,15,0,5,1,5,null,null,4,20,null,null,1,1,2,5,10,20,1,5,2,1,null,null,4,20,null,null,null,null,null,null,1,5,null,null,null,null,1,1,0,20,null,null,"Continuous",0,12,5,13,25,20,100]
["Highlands Northern Fall","HNF","Swampy Riparian Woodland","HNF_0083",1,"V","Vulnerable","Forest/Woodland","Woody","Highlands Northern FallSwampy Riparian Woodland","70",10,15,20,0,5,2,15,null,null,5,10,1,1,null,null,3,5,8,15,4,5,5,30,2,5,3,5,3,5,null,null,null,null,4,10,null,null,null,null,1,1,0,20,null,null,"Continuous",0,14,8,15,26,20,200]
["Highlands Northern Fall","HNF","Swampy Woodland","HNF_0937",1,"E","Endangered","Forest/Woodland","Woody","Highlands Northern FallSwampy Woodland","60",15,0,15,0,5,1,5,null,null,4,20,2,5,null,null,2,10,5,10,2,5,2,10,1,10,3,10,2,5,null,null,null,null,2,10,null,null,null,null,null,null,0,20,null,null,"Continuous",0,13,7,9,30,20,150]
["Highlands Northern Fall","HNF","Tableland Damp Forest","HNF_0035",1,"LC","Least Concern","Forest/Woodland","Woody","Highlands Northern FallTableland Damp Forest","90",20,30,40,0,5,3,20,null,null,7,20,2,10,null,null,2,5,8,15,2,15,1,5,1,1,3,15,1,5,null,null,null,null,2,5,null,null,null,null,null,null,0,20,null,null,"Continuous",0,13,12,12,50,50,300]
["Highlands Northern Fall","HNF","Valley Grassy Forest","HNF_0047",1,"V","Vulnerable","Forest/Woodland","Woody","Highlands Northern FallValley Grassy Forest","70",20,25,20,0,5,2,10,null,null,6,10,5,5,3,5,3,1,16,20,4,5,3,5,null,null,12,25,3,10,null,null,null,null,1,5,null,null,null,null,2,5,0,20,null,null,"Continuous",0,14,13,23,25,40,200]
["Highlands Northern Fall","HNF","Valley Heathy Forest","HNF_0127",1,"E","Endangered","Forest/Woodland","Woody","Highlands Northern FallValley Heathy Forest","70",20,15,30,0,5,2,10,null,null,7,15,5,5,2,1,null,null,6,10,3,5,3,5,2,20,6,15,1,1,null,null,null,null,1,1,null,null,null,null,3,5,0,10,null,null,"Episodic",30,14,14,9,30,40,200]
["Highlands Northern Fall","HNF","Warm Temperate Rainforest","HNF_0032",1,"R","Rare","Forest/Woodland","Woody","Highlands Northern FallWarm Temperate Rainforest","0",0,0,null,null,null,null,null,null,null,null,null,null,null,null,null,null,null,null,null,null,null,null,null,null,null,null,null,null,null,null,null,null,null,null,null,null,null,null,null,null,null,null,null,null,null,null,0,0,null,null,null,0,0]
["Highlands Northern Fall","HNF","Wet Forest","HNF_0030",1,"LC","Least Concern","Forest/Woodland","Woody","Highlands Northern FallWet Forest","90",20,30,40,0,5,4,30,null,null,6,20,1,1,null,null,2,1,5,10,2,1,1,1,1,10,1,5,null,null,null,null,null,null,4,20,"2","10",null,null,2,5,0,20,null,null,"Continuous",0,14,11,9,51,50,300]
["Highlands Southern Fall","HSF","Aquatic Herbland","HSF_0653",1.36,"TBC","TBC","wetlands","Woody","Highlands Southern FallAquatic Herbland","0",0,0,null,null,null,null,null,null,null,null,null,null,null,null,null,2,10,3,20,3,15,null,null,2,20,2,10,1,5,null,null,null,null,null,null,null,null,null,null,null,null,null,null,null,null,"Episodic",5,6,null,8,null,10,0]
["Highlands Southern Fall","HSF","Blackthorn Scrub","HSF_0027",1.1499999999999999,"TBC","TBC","scrubs/shrublands/mallee without logs","Woody","Highlands Southern FallBlackthorn Scrub","0",0,0,null,0,5,null,null,null,null,5,20,null,null,null,null,null,null,2,1,null,null,null,null,null,null,3,5,1,1,null,null,null,null,2,5,null,null,null,null,2,1,0,10,"0","10","Continuous",0,9,5,2,20,40,100]
["Highlands Southern Fall","HSF","Box Ironbark Forest","HSF_0061",1,"V","Vulnerable","Forest/Woodland","Woody","Highlands Southern FallBox Ironbark Forest","70",15,20,30,0,5,null,null,null,null,4,20,3,10,2,1,2,5,10,15,2,1,1,1,null,null,5,10,null,null,null,null,null,null,1,1,null,null,null,null,null,null,0,10,"0","20","Continuous",0,12,7,14,30,20,200]
["Highlands Southern Fall","HSF","Clay Heathland","HSF_0007",1.36,"D","Depleted","heathlands","Woody","Highlands Southern FallClay Heathland","0",0,0,null,null,null,null,null,null,null,9,30,6,10,3,5,null,null,8,10,null,null,4,10,1,5,7,10,2,5,null,null,null,null,null,null,null,null,null,null,null,null,0,10,"0","10","Episodic",30,10,15,8,40,20,0]
["Highlands Southern Fall","HSF","Cool Temperate Rainforest","HSF_0031",1,"E","Endangered","Forest/Woodland","Woody","Highlands Southern FallCool Temperate Rainforest","70/90",20,25,50,0,5,3,15,null,null,3,10,null,null,null,null,1,1,3,10,null,null,null,null,1,1,null,null,null,null,null,null,null,null,6,35,"2","25","4","5",2,1,0,20,null,null,"Continuous",0,11,6,4,25,80,200]
["Highlands Southern Fall","HSF","Cool Temperate Rainforest/Warm Temperate Rainf","HSF_0033",1,"E","Endangered","Forest/Woodland","Woody","Highlands Southern FallCool Temperate Rainforest/Warm Temperate Rainf","70",20,20,50,0,5,5,25,null,null,6,15,null,null,null,null,2,1,3,5,1,1,2,1,2,1,2,5,null,null,null,null,null,null,8,25,"3","20","4","5",7,20,0,20,null,null,"Continuous",0,14,11,6,40,50,200]
["Highlands Southern Fall","HSF","Creekline Grassy Woodland","HSF_0068",1,"E","Endangered","Forest/Woodland","Woody","Highlands Southern FallCreekline Grassy Woodland","0",null,null,null,null,null,null,null,null,null,null,null,null,null,null,null,null,null,null,null,null,null,null,null,null,null,null,null,null,null,null,null,null,null,null,null,null,null,null,null,null,null,null,null,null,null,null,null,0,null,null,null,null,0]
["Highlands Southern Fall","HSF","Creekline Herb-rich Woodland","HSF_0164",1,"V","Vulnerable","Forest/Woodland","Woody","Highlands Southern FallCreekline Herb-rich Woodland","70",10,15,20,0,5,2,10,null,null,3,10,2,5,2,5,2,1,8,15,3,5,2,10,2,10,8,20,1,5,null,null,null,null,2,10,null,null,null,null,5,5,0,20,null,null,"Continuous",0,15,7,13,25,20,100]
["Highlands Southern Fall","HSF","Damp Forest","HSF_0029",1,"LC","Least Concern","Forest/Woodland","Woody","Highlands Southern FallDamp Forest","90",20,30,40,0,5,4,20,null,null,7,25,1,1,null,null,null,null,4,5,2,1,2,5,1,10,1,1,1,1,null,null,null,null,3,15,"2","10",null,null,3,5,0,20,null,null,"Continuous",0,14,12,6,46,50,300]
["Highlands Southern Fall","HSF","Damp Heathland","HSF_0710",1.36,"TBC","TBC","heathlands","Woody","Highlands Southern FallDamp Heathland","0",0,0,null,null,null,null,null,null,null,5,40,5,10,1,1,null,null,4,10,3,10,2,5,1,1,4,5,2,10,null,null,null,null,null,null,null,null,null,null,3,5,0,20,null,null,"Episodic",30,11,10,7,50,20,0]
["Highlands Southern Fall","HSF","Damp Heathy Woodland","HSF_0793",1,"D","Depleted","Forest/Woodland","Woody","Highlands Southern FallDamp Heathy Woodland","60",10,10,15,0,5,null,null,null,null,5,30,4,5,2,1,null,null,3,5,3,5,2,5,null,null,3,10,1,5,null,null,null,null,1,5,null,null,null,null,null,null,0,20,"0","10","Episodic",30,12,9,6,35,20,100]
["Highlands Southern Fall","HSF","Damp Sands Herb-rich Woodland","HSF_0003",1,"V","Vulnerable","Forest/Woodland","Woody","Highlands Southern FallDamp Sands Herb-rich Woodland","70",15,15,20,0,5,2,10,null,null,4,20,null,null,1,1,2,5,6,15,5,10,1,1,null,null,7,20,1,5,null,null,null,null,1,10,null,null,null,null,2,5,0,10,null,null,"Continuous",0,13,6,13,30,40,150]
["Highlands Southern Fall","HSF","Dry Rainforest","HSF_0034",1,"E","Endangered","Forest/Woodland","Woody","Highlands Southern FallDry Rainforest","60",10,15,50,0,5,3,20,null,null,9,20,null,null,null,null,5,5,12,15,5,5,2,5,null,null,3,5,3,5,null,null,null,null,5,10,null,null,"2","1",6,10,0,20,null,null,"Continuous",0,13,12,22,40,50,100]
["Highlands Southern Fall","HSF","Dry Valley Forest","HSF_0169",1,"V","Vulnerable","Forest/Woodland","Woody","Highlands Southern FallDry Valley Forest","70",20,20,30,0,5,4,15,null,null,9,30,3,10,1,1,4,5,11,15,3,5,3,5,null,null,4,15,1,1,null,null,null,null,3,10,"1","5",null,null,2,5,0,10,null,null,"Continuous",0,15,16,18,55,40,200]
["Highlands Southern Fall","HSF","Escarpment Shrubland","HSF_0895",1.1499999999999999,"E","Endangered","Forest/Woodland","Woody","Highlands Southern FallEscarpment Shrubland","0",0,0,null,null,null,null,null,null,null,3,10,2,5,null,null,3,5,4,10,5,5,1,5,1,5,9,25,3,5,null,null,null,null,1,5,null,null,null,null,1,5,0,20,"0","10","Continuous",0,13,5,12,15,20,50]
["Highlands Southern Fall","HSF","Escarpment Shrubland - treed","HSF_0895_61",1,"E","Endangered","Forest/Woodland","Woody","Highlands Southern FallEscarpment Shrubland - treed","70",15,0,0,0,5,3,10,null,null,3,10,2,5,null,null,3,5,4,10,5,5,1,5,1,5,9,25,3,5,null,null,null,null,1,5,null,null,null,null,1,5,0,20,"0","10","Continuous",0,15,8,12,25,20,150]
["Highlands Southern Fall","HSF","Floodplain Riparian Woodland","HSF_0056",1,"E","Endangered","Forest/Woodland","Woody","Highlands Southern FallFloodplain Riparian Woodland","80",15,15,20,0,5,4,15,null,null,3,10,null,null,null,null,4,10,3,10,2,5,3,15,3,20,5,15,1,5,null,null,null,null,null,null,null,null,null,null,3,10,0,10,null,null,"Episodic",10,12,7,9,25,40,300]
["Highlands Southern Fall","HSF","Grassy Dry Forest","HSF_0022",1,"LC","Least Concern","Forest/Woodland","Woody","Highlands Southern FallGrassy Dry Forest","60",20,20,30,0,5,1,5,null,null,7,10,4,10,2,1,2,1,11,20,3,5,1,5,null,null,7,25,2,5,null,null,null,null,1,5,null,null,null,null,3,5,0,10,"0","10","Continuous",0,15,12,16,25,20,200]
["Highlands Southern Fall","HSF","Grassy Forest","HSF_0128",1,"V","Vulnerable","Forest/Woodland","Woody","Highlands Southern FallGrassy Forest","70",20,20,30,0,5,1,5,null,null,5,30,1,1,1,1,2,1,5,10,2,5,2,5,2,10,5,15,1,5,null,null,null,null,1,5,null,null,null,null,3,5,0,10,null,null,"Episodic",30,15,7,9,36,40,200]
["Highlands Southern Fall","HSF","Grassy Woodland","HSF_0175",1,"D","Depleted","Forest/Woodland","Woody","Highlands Southern FallGrassy Woodland","70",15,15,20,0,5,1,10,null,null,4,15,2,5,null,null,2,5,7,20,2,5,1,1,null,null,7,35,1,5,null,null,null,null,1,5,null,null,null,null,1,1,0,10,null,null,"Continuous",0,13,7,11,30,20,150]
["Highlands Southern Fall","HSF","Gully Woodland","HSF_0902",1,"V","Vulnerable","Forest/Woodland","Woody","Highlands Southern FallGully Woodland","70",10,20,20,0,5,4,15,null,null,6,15,1,1,null,null,2,1,6,10,2,5,2,10,1,5,7,15,2,10,null,null,null,null,3,10,null,null,null,null,4,10,0,20,null,null,"Continuous",0,14,11,10,31,20,100]
["Highlands Southern Fall","HSF","Heathy Dry Forest","HSF_0020",1,"LC","Least Concern","Forest/Woodland","Woody","Highlands Southern FallHeathy Dry Forest","60",20,20,30,0,5,null,null,null,null,9,30,4,15,2,5,2,5,5,10,1,5,null,null,1,1,6,20,null,null,null,null,null,null,2,5,null,null,null,null,2,5,0,10,"0","10","Episodic",20,13,13,8,45,20,200]
["Highlands Southern Fall","HSF","Heathy Woodland","HSF_0048",1,"LC","Least Concern","Forest/Woodland","Woody","Highlands Southern FallHeathy Woodland","50",15,10,10,0,5,null,null,null,null,5,30,5,20,null,null,null,null,2,5,2,5,1,5,1,1,1,1,2,5,null,null,null,null,1,5,null,null,null,null,null,null,0,10,"0","10","Episodic",20,12,10,4,50,40,150]
["Highlands Southern Fall","HSF","Herb-rich Foothill Forest","HSF_0023",1,"LC","Least Concern","Forest/Woodland","Woody","Highlands Southern FallHerb-rich Foothill Forest","70",20,25,40,0,5,2,10,null,null,7,20,2,5,1,1,4,5,11,20,3,5,2,5,2,5,5,20,2,5,null,null,null,null,3,10,null,null,null,null,2,5,0,20,null,null,"Continuous",0,15,11,18,35,40,200]
["Highlands Southern Fall","HSF","Limestone Box Forest","HSF_0015",1,"TBC","TBC","Forest/Woodland","Woody","Highlands Southern FallLimestone Box Forest","70",20,20,30,0,5,3,15,null,null,5,15,1,1,null,null,2,1,8,10,3,5,2,5,2,5,4,5,3,5,null,null,null,null,3,15,null,null,null,null,6,10,0,10,null,null,"Continuous",0,14,9,13,31,20,150]
["Highlands Southern Fall","HSF","Lowland Forest","HSF_0016",1,"TBC","TBC","Forest/Woodland","Woody","Highlands Southern FallLowland Forest","70",20,25,30,0,5,2,10,null,null,9,30,3,5,2,1,2,1,5,10,2,1,2,5,2,10,4,10,1,1,null,null,null,null,2,10,null,null,null,null,2,1,0,10,null,null,"Continuous",0,15,14,9,45,40,200]
["Highlands Southern Fall","HSF","Lowland Herb-rich Forest","HSF_0877",1,"D","Depleted","Forest/Woodland","Woody","Highlands Southern FallLowland Herb-rich Forest","70",20,20,30,0,5,2,10,null,null,3,30,2,5,null,null,2,5,8,15,3,5,2,10,null,null,3,10,2,5,null,null,null,null,3,20,null,null,null,null,2,5,0,10,null,null,"Continuous",0,13,7,13,45,40,200]
["Highlands Southern Fall","HSF","Montane Damp Forest","HSF_0038",1,"LC","Least Concern","Forest/Woodland","Woody","Highlands Southern FallMontane Damp Forest","90",20,30,40,0,5,3,25,null,null,7,25,3,10,1,1,3,5,10,15,2,5,1,5,null,null,4,10,1,1,null,null,null,null,2,10,null,null,null,null,1,5,0,20,null,null,"Continuous",0,14,13,15,60,50,300]
["Highlands Southern Fall","HSF","Montane Dry Woodland","HSF_0036",1,"LC","Least Concern","Forest/Woodland","Woody","Highlands Southern FallMontane Dry Woodland","50",15,15,20,0,5,2,20,"1","1",6,20,2,5,null,null,2,5,9,20,2,5,2,5,null,null,6,15,1,5,null,null,null,null,1,5,null,null,null,null,null,null,0,10,"0","10","Continuous",0,14,10,13,45,20,150]
["Highlands Southern Fall","HSF","Montane Grassy Woodland","HSF_0037",1,"D","Depleted","Forest/Woodland","Woody","Highlands Southern FallMontane Grassy Woodland","50",15,10,20,0,5,1,5,null,null,6,20,3,10,2,5,2,5,15,20,3,10,2,5,null,null,7,20,1,1,null,null,null,null,1,1,null,null,null,null,null,null,0,10,"0","10","Continuous",0,14,10,20,35,20,150]
["Highlands Southern Fall","HSF","Montane Herb-rich Woodland","HSF_0319",1,"LC","Least Concern","Forest/Woodland","Woody","Highlands Southern FallMontane Herb-rich Woodland","70",15,25,40,0,5,2,10,null,null,6,15,2,5,1,1,5,10,12,20,3,5,1,5,null,null,8,20,1,1,null,null,null,null,3,10,null,null,null,null,2,5,0,20,null,null,"Continuous",0,14,10,20,30,20,150]
["Highlands Southern Fall","HSF","Montane Riparian Thicket","HSF_0041",1.25,"LC","Least Concern","scrubs/shrublands/mallee without logs","Woody","Highlands Southern FallMontane Riparian Thicket","0",0,0,null,null,null,null,null,null,null,1,5,null,null,null,null,null,null,null,null,1,1,2,40,null,null,2,1,null,null,null,null,null,null,3,20,"1","5","2","1",null,null,0,20,null,null,"Continuous",0,8,1,1,5,40,50]
["Highlands Southern Fall","HSF","Montane Riparian Woodland","HSF_0040",1,"E","Endangered","Forest/Woodland","Woody","Highlands Southern FallMontane Riparian Woodland","60",15,15,15,0,5,3,15,null,null,5,10,null,null,null,null,6,10,10,15,4,5,3,25,1,5,3,10,null,null,null,null,null,null,4,15,"1","1",null,null,2,5,0,20,null,null,"Continuous",0,13,8,20,25,40,150]
["Highlands Southern Fall","HSF","Montane Rocky Shrubland","HSF_0192",1.25,"R","Rare","scrubs/shrublands/mallee without logs","Woody","Highlands Southern FallMontane Rocky Shrubland","0",0,0,null,null,null,null,null,null,null,8,40,2,5,1,1,5,5,7,5,3,5,2,5,null,null,4,5,1,1,null,null,null,null,3,5,null,null,null,null,1,1,0,20,null,null,"Episodic",30,12,10,15,45,40,100]
["Highlands Southern Fall","HSF","Montane Wet Forest","HSF_0039",1,"LC","Least Concern","Forest/Woodland","Woody","Highlands Southern FallMontane Wet Forest","90",20,30,40,0,5,5,20,null,null,5,25,null,null,null,null,2,5,5,15,2,1,1,1,1,1,1,5,null,null,null,null,null,null,3,25,"2","5",null,null,2,1,0,20,null,null,"Continuous",0,13,10,9,45,50,300]
["Highlands Southern Fall","HSF","Plains Grassland","HSF_0132",1.36,"E","Endangered","grasslands","Other grassland","Highlands Southern FallPlains Grassland","0",0,0,null,null,null,null,null,null,null,null,null,1,1,null,null,3,5,10,15,3,5,1,5,null,null,13,40,4,10,null,null,null,null,null,null,null,null,null,null,null,null,0,10,"0","10","Episodic",5,9,1,16,1,10,0]
["Highlands Southern Fall","HSF","Plains Grassy Forest","HSF_0151",1,"E","Endangered","Forest/Woodland","Woody","Highlands Southern FallPlains Grassy Forest","70",20,20,30,0,5,3,15,null,null,6,20,3,5,2,5,3,5,6,10,2,5,2,10,1,5,4,15,2,1,null,null,null,null,2,10,null,null,null,null,null,null,0,10,null,null,"Continuous",0,14,12,11,40,20,200]
["Highlands Southern Fall","HSF","Plains Grassy Wetland","HSF_0125",1.36,"E","Endangered","wetlands","Non-woody wetland","Highlands Southern FallPlains Grassy Wetland","0",0,0,null,null,null,null,null,null,null,null,null,null,null,null,null,null,null,null,null,null,null,null,null,null,null,null,null,null,null,null,null,null,null,null,null,null,null,null,null,null,null,null,null,null,null,null,0,0,null,null,null,0,0]
["Highlands Southern Fall","HSF","Plains Grassy Woodland","HSF_0055",1,"E","Endangered","Forest/Woodland","Woody","Highlands Southern FallPlains Grassy Woodland","80",10,15,20,0,5,1,5,null,null,2,10,1,1,1,1,1,5,10,20,3,5,2,5,1,10,9,35,2,10,null,null,null,null,null,null,null,null,null,null,null,null,0,10,null,null,"Continuous",0,13,4,14,16,10,100]
["Highlands Southern Fall","HSF","Riparian Forest","HSF_0018",1,"LC","Least Concern","Forest/Woodland","Woody","Highlands Southern FallRiparian Forest","90",20,30,40,0,5,4,20,null,null,8,20,1,1,1,1,2,1,6,10,2,1,3,10,2,5,3,5,2,5,null,null,null,null,5,20,"1","10",null,null,3,5,0,20,null,null,"Continuous",0,16,13,10,41,50,300]
["Highlands Southern Fall","HSF","Riparian Scrub","HSF_0191",1.25,"V","Vulnerable","scrubs/shrublands/mallee without logs","Woody","Highlands Southern FallRiparian Scrub","0",0,0,null,null,null,null,null,null,null,1,5,1,1,null,null,null,null,1,1,1,1,1,10,1,5,1,1,2,20,null,null,null,null,1,5,null,null,null,null,1,10,0,20,null,null,"Continuous",0,11,2,2,6,40,0]
["Highlands Southern Fall","HSF","Riparian Shrubland","HSF_0019",1.25,"R","Rare","scrubs/shrublands/mallee without logs","Woody","Highlands Southern FallRiparian Shrubland","0",0,0,null,null,null,null,null,null,null,4,20,1,5,null,null,5,5,4,10,3,5,1,10,null,null,1,1,1,1,null,null,null,null,6,15,"1","1",null,null,2,5,0,20,null,null,"Continuous",0,12,5,12,25,40,100]
["Highlands Southern Fall","HSF","Riparian Thicket","HSF_0059",1.25,"V","Vulnerable","heathlands","Woody","Highlands Southern FallRiparian Thicket","0",0,6,50,null,null,null,null,null,null,8,30,3,5,1,1,2,5,5,10,1,5,3,10,2,5,2,5,3,15,null,null,null,null,3,10,"1","5",null,null,2,5,0,20,null,null,"Continuous",0,14,11,8,35,40,0]
["Highlands Southern Fall","HSF","Riparian Woodland","HSF_0641",1,"TBC","TBC","Forest/Woodland","Woody","Highlands Southern FallRiparian Woodland","80",15,20,20,0,5,2,10,null,null,4,10,1,5,null,null,4,15,5,10,1,5,3,15,1,5,4,20,2,5,null,null,null,null,null,null,null,null,null,null,1,5,0,10,null,null,"Continuous",0,13,7,10,25,30,200]
["Highlands Southern Fall","HSF","Riverine Escarpment Scrub","HSF_0082",1.25,"LC","Least Concern","scrubs/shrublands/mallee without logs","Woody","Highlands Southern FallRiverine Escarpment Scrub","0",0,0,null,0,5,null,null,null,null,10,25,null,null,null,null,4,5,13,20,6,10,2,5,null,null,6,10,2,5,null,null,null,null,5,15,null,null,null,null,3,5,0,10,null,null,"Continuous",0,11,10,23,25,40,50]
["Highlands Southern Fall","HSF","Rocky Outcrop Shrubland","HSF_0028",1.36,"R","Rare","heathlands","Woody","Highlands Southern FallRocky Outcrop Shrubland","0",0,0,null,null,null,null,null,null,null,7,25,2,5,1,5,2,5,2,1,null,null,1,5,null,null,4,10,null,null,null,null,null,null,1,1,null,null,null,null,null,null,0,20,"0","10","Continuous",0,10,9,4,30,40,100]
["Highlands Southern Fall","HSF","Shrubby Damp Forest","HSF_0316",1,"LC","Least Concern","Forest/Woodland","Woody","Highlands Southern FallShrubby Damp Forest","90",20,25,40,0,5,4,20,null,null,8,20,2,10,1,1,4,5,8,15,2,5,2,5,1,1,3,10,1,5,null,null,null,null,2,15,"1","1",null,null,2,5,0,20,null,null,"Continuous",0,16,14,14,50,50,300]
["Highlands Southern Fall","HSF","Shrubby Dry Forest","HSF_0021",1,"LC","Least Concern","Forest/Woodland","Woody","Highlands Southern FallShrubby Dry Forest","70",20,25,30,0,5,2,10,null,null,8,30,3,15,1,1,4,5,8,10,null,null,2,5,1,1,4,15,1,5,null,null,null,null,2,10,null,null,null,null,2,5,0,10,"0","10","Episodic",20,15,13,12,55,30,200]
["Highlands Southern Fall","HSF","Shrubby Foothill Forest","HSF_0045",1,"LC","Least Concern","Forest/Woodland","Woody","Highlands Southern FallShrubby Foothill Forest","70",20,25,40,0,5,1,5,null,null,8,35,3,10,1,5,null,null,3,5,1,1,2,5,1,10,2,5,null,null,null,null,null,null,2,10,null,null,null,null,1,1,0,10,"0","10","Episodic",30,14,12,4,50,40,200]
["Highlands Southern Fall","HSF","Shrubby Gully Forest","HSF_0938",1,"TBC","TBC","Forest/Woodland","Woody","Highlands Southern FallShrubby Gully Forest","70",20,20,30,0,5,2,10,null,null,5,20,null,null,null,null,null,null,5,10,3,5,3,15,2,10,3,10,1,5,null,null,null,null,4,20,null,null,null,null,2,1,0,20,null,null,"Continuous",0,12,7,8,30,20,150]
["Highlands Southern Fall","HSF","Shrubby Wet Forest","HSF_0201",1,"LC","Least Concern","Forest/Woodland","Woody","Highlands Southern FallShrubby Wet Forest","90",20,30,40,0,5,4,30,null,null,7,25,2,1,null,null,2,1,6,10,null,null,null,null,null,null,2,5,1,1,null,null,null,null,3,10,"2","5",null,null,1,1,0,20,null,null,"Continuous",0,12,13,8,56,50,300]
["Highlands Southern Fall","HSF","Stream Bank Shrubland","HSF_0851",1.36,"TBC","TBC","scrubs/shrublands/mallee without logs","Woody","Highlands Southern FallStream Bank Shrubland","0",0,15,null,null,null,2,10,null,null,4,20,null,null,null,null,3,5,12,20,4,10,3,10,3,10,10,15,5,10,null,null,null,null,null,null,null,null,null,null,2,5,null,null,null,null,"Continuous",0,10,6,19,30,40,0]
["Highlands Southern Fall","HSF","Stream Bank Shrubland - treed","HSF_0851_61",1,"TBC","TBC","scrubs/shrublands/mallee without logs","Woody","Highlands Southern FallStream Bank Shrubland - treed","70",10,15,10,0,5,2,10,null,null,4,20,null,null,null,null,3,5,12,20,4,10,3,10,3,10,10,15,5,10,null,null,null,null,null,null,null,null,null,null,2,5,null,null,null,null,"Continuous",0,11,6,19,30,40,100]
["Highlands Southern Fall","HSF","Sub-alpine Grassland","HSF_0206",1.36,"R","Rare","grasslands","Other grassland",{"$f":"CONCATENATE(A579,C579)","v":"Highlands Southern FallSub-alpine Grassland"},"0",0,0,null,null,null,null,null,null,null,1,5,3,5,1,1,3,5,11,20,3,10,1,1,null,null,5,20,2,10,null,null,null,null,null,null,null,null,null,null,null,null,0,20,"0","10","Continuous",0,11,4,17,10,10,0]
["Highlands Southern Fall","HSF","Sub-alpine Wet Heathland","HSF_0210",1.36,"E","Endangered","heathlands","Woody","Highlands Southern FallSub-alpine Wet Heathland","0",0,0,null,null,null,null,null,null,null,4,15,3,10,1,1,1,1,8,15,4,10,1,1,null,null,4,10,2,15,null,null,null,null,1,1,null,null,null,null,null,null,0,40,null,null,"Episodic",30,11,7,13,25,10,0]
["Highlands Southern Fall","HSF","Sub-alpine Woodland","HSF_0043",1,"LC","Least Concern","Forest/Woodland","Woody","Highlands Southern FallSub-alpine Woodland","40",15,10,15,0,5,1,5,null,null,5,20,2,10,null,null,3,10,8,20,2,5,null,null,null,null,4,20,1,5,null,null,null,null,1,1,null,null,null,null,null,null,0,20,"0","10","Continuous",0,12,8,13,35,20,100]
["Highlands Southern Fall","HSF","Swamp Scrub","HSF_0053",1.25,"E","Endangered","scrubs/shrublands/mallee without logs","Woody","Highlands Southern FallSwamp Scrub","0",0,8,50,null,null,null,null,null,null,2,10,2,1,null,null,2,5,3,15,2,5,2,10,3,10,2,5,2,15,null,null,null,null,1,5,null,null,null,null,1,1,0,20,null,null,"Continuous",0,12,4,7,11,40,0]
["Highlands Southern Fall","HSF","Swampy Riparian Woodland","HSF_0083",1,"V","Vulnerable","Forest/Woodland","Woody","Highlands Southern FallSwampy Riparian Woodland","60",10,15,20,0,5,4,25,null,null,4,20,1,1,1,1,3,5,6,10,2,5,3,15,2,10,6,15,2,5,null,null,null,null,2,5,null,null,null,null,2,5,0,10,null,null,"Continuous",0,15,9,11,46,20,200]
["Highlands Southern Fall","HSF","Swampy Woodland","HSF_0937",1,"E","Endangered","Forest/Woodland","Woody","Highlands Southern FallSwampy Woodland","60",15,15,15,0,5,1,5,null,null,4,20,2,5,1,1,2,10,5,15,2,5,2,10,1,10,3,10,2,5,null,null,null,null,2,10,null,null,null,null,null,null,0,20,null,null,"Continuous",0,14,7,9,30,20,150]
["Highlands Southern Fall","HSF","Tableland Damp Forest","HSF_0035",1,"LC","Least Concern","Forest/Woodland","Woody","Highlands Southern FallTableland Damp Forest","90",20,30,40,0,5,3,20,null,null,7,20,2,10,null,null,2,5,8,15,2,15,1,5,1,1,3,15,1,5,null,null,null,null,2,5,null,null,null,null,null,null,0,20,null,null,"Continuous",0,13,12,12,50,50,300]
["Highlands Southern Fall","HSF","Valley Grassy Forest","HSF_0047",1,"V","Vulnerable","Forest/Woodland","Woody","Highlands Southern FallValley Grassy Forest","70",20,20,20,0,5,2,15,null,null,6,20,3,5,2,1,3,5,12,20,3,10,2,5,2,10,7,20,2,5,null,null,null,null,1,5,null,null,null,null,null,null,0,20,null,null,"Continuous",0,14,11,18,40,20,200]
["Highlands Southern Fall","HSF","Valley Heathy Forest","HSF_0127",1,"V","Vulnerable","Forest/Woodland","Woody","Highlands Southern FallValley Heathy Forest","70",20,15,30,0,5,3,10,null,null,7,15,5,10,2,1,null,null,6,10,3,5,2,5,2,20,7,15,1,1,null,null,null,null,1,1,null,null,null,null,3,5,0,10,null,null,"Episodic",30,14,15,9,35,40,200]
["Highlands Southern Fall","HSF","Valley Slopes Dry Forest","HSF_0177",1,"LC","Least Concern","Forest/Woodland","Woody","Highlands Southern FallValley Slopes Dry Forest","70",20,20,30,0,5,4,15,null,null,6,20,1,5,null,null,5,10,8,15,3,5,2,5,null,null,6,15,2,5,null,null,null,null,3,5,null,null,null,null,2,5,0,10,"0","10","Continuous",0,14,11,16,40,40,200]
["Highlands Southern Fall","HSF","Warm Temperate Rainforest","HSF_0032",1,"R","Rare","Forest/Woodland","Woody","Highlands Southern FallWarm Temperate Rainforest","70",20,25,50,0,5,3,30,null,null,2,10,null,null,null,null,2,5,3,5,1,5,1,1,null,null,1,1,2,5,null,null,null,null,4,25,null,null,"1","5",7,20,0,20,null,null,"Continuous",0,13,5,6,40,50,200]
["Highlands Southern Fall","HSF","Wet Forest","HSF_0030",1,"LC","Least Concern","Forest/Woodland","Woody","Highlands Southern FallWet Forest","90",20,30,40,0,5,7,30,null,null,5,20,null,null,null,null,1,1,3,5,1,1,1,1,1,10,1,1,null,null,null,null,null,null,4,20,"2","20","1","1",2,5,0,20,null,null,"Continuous",0,14,12,5,50,50,300]
["Highlands Southern Fall","HSF","Wet Heathland","HSF_0008",1.36,"TBC","TBC","heathlands","Woody","Highlands Southern FallWet Heathland","0",0,0,null,null,null,null,null,null,null,7,30,3,5,null,null,2,5,4,5,null,null,2,10,3,10,4,10,3,10,null,null,null,null,1,1,null,null,null,null,2,10,0,20,null,null,"Episodic",30,11,10,6,35,20,0]
["Highlands Southern Fall","HSF","Wetland Formation","HSF_0074",1.36,"E","Endangered","wetlands","Non-woody wetland","Highlands Southern FallWetland Formation","0",null,0,null,null,null,null,null,null,null,null,null,null,null,null,null,null,null,null,null,null,null,null,null,null,null,null,null,null,null,null,null,null,null,null,null,null,null,null,null,null,null,null,null,null,null,null,5,0,null,null,null,null,0]
["Lowan Mallee","LoM","Cane Grass Wetland","LoM_0291",1.36,"E","Endangered","wetlands","Non-woody wetland","Lowan MalleeCane Grass Wetland","0",0,0,null,null,null,null,null,null,null,null,null,null,null,null,null,null,null,null,null,2,10,null,null,null,null,null,null,2,40,null,null,null,null,null,null,null,null,null,null,null,null,null,null,null,null,"Episodic",5,2,null,2,null,10,0]
["Lowan Mallee","LoM","Chenopod Grassland","LoM_0829",1.36,"D","Depleted","grasslands","Other grassland","Lowan MalleeChenopod Grassland","0",0,0,null,null,null,null,null,null,null,1,10,6,30,null,null,1,1,5,15,4,5,null,null,null,null,3,20,null,null,null,null,null,null,null,null,null,null,null,null,null,null,0,10,"0","20","Continuous",0,8,7,10,40,5,0]
["Lowan Mallee","LoM","Chenopod Mallee","LoM_0158",1,"LC","Least Concern","Forest/Woodland","Woody","Lowan MalleeChenopod Mallee","20",20,12,20,null,null,null,null,null,null,1,5,9,45,null,null,null,null,3,5,2,10,null,null,null,null,null,null,null,null,null,null,null,null,null,null,null,null,null,null,null,null,0,10,"0","15","Continuous",0,6,10,5,50,10,100]
["Lowan Mallee","LoM","Damp Heathland","LoM_0710",1.36,"LC","Least Concern","heathlands","Woody","Lowan MalleeDamp Heathland","0",0,0,null,null,null,null,null,null,null,6,30,5,20,2,5,null,null,6,10,2,1,1,5,1,1,4,10,3,15,null,null,null,null,null,null,null,null,null,null,2,5,0,10,"0","10","Episodic",30,12,11,8,50,20,0]
["Lowan Mallee","LoM","Dunefield Heathland","LoM_0089",1.36,"LC","Least Concern","heathlands","Woody","Lowan MalleeDunefield Heathland","0",0,0,null,null,null,null,null,null,null,6,50,6,20,null,null,null,null,4,5,null,null,1,1,null,null,3,5,2,5,null,null,"1","1",null,null,null,null,null,null,null,null,null,null,"0","10","Episodic",20,8,12,4,70,5,0]
["Lowan Mallee","LoM","Heathy Mallee","LoM_0088",1.1499999999999999,"LC","Least Concern","scrubs/shrublands/mallee with logs","Woody","Lowan MalleeHeathy Mallee","0",0,4,25,null,null,null,null,null,null,6,30,7,20,null,null,2,1,3,5,null,null,1,1,null,null,3,5,2,5,null,null,"1","5",null,null,null,null,null,null,null,null,null,null,"0","10","Episodic",20,9,13,5,50,10,50]
["Lowan Mallee","LoM","Heathy Woodland","LoM_0048",1,"LC","Least Concern","Forest/Woodland","Woody","Lowan MalleeHeathy Woodland","50/30",15,10,20,0,5,null,null,null,null,13,40,14,30,null,null,null,null,2,1,null,null,1,1,null,null,4,10,2,5,null,null,"1","5",null,null,null,null,null,null,1,1,0,10,"0","10","Episodic",20,11,27,2,70,40,150]
["Lowan Mallee","LoM","Intermittent Swampy Woodland","LoM_0813",1,"V","Vulnerable","Forest/Woodland","Woody","Lowan MalleeIntermittent Swampy Woodland","70/50",15,15,20,0,5,1,5,null,null,1,5,1,5,null,null,2,5,5,10,1,5,null,null,null,null,3,30,2,10,null,null,null,null,null,null,null,null,null,null,null,null,null,null,null,null,"Continuous",0,9,3,8,15,20,200]
["Lowan Mallee","LoM","Lake Bed Herbland","LoM_0107",1.36,"D","Depleted","wetlands","Non-woody wetland","Lowan MalleeLake Bed Herbland","0",0,0,null,null,null,null,null,null,null,2,5,2,5,null,null,null,null,3,25,3,20,null,null,null,null,null,null,null,null,null,null,null,null,null,null,null,null,null,null,null,null,null,null,null,null,"Episodic",10,4,4,6,10,5,0]
["Lowan Mallee","LoM","Lignum Swampy Woodland","LoM_0823",1,"D","Depleted","Forest/Woodland","Woody","Lowan MalleeLignum Swampy Woodland","70/50",15,15,20,0,5,null,null,null,null,2,30,1,5,null,null,2,1,8,10,4,10,null,null,1,5,2,5,3,15,null,null,null,null,null,null,null,null,null,null,null,null,null,null,"0","10","Continuous",0,10,3,14,35,10,100]
["Lowan Mallee","LoM","Loamy Sands Mallee","LoM_0091",1.1499999999999999,"LC","Least Concern","scrubs/shrublands/mallee with logs","Woody","Lowan MalleeLoamy Sands Mallee","0",0,5,25,null,null,null,null,null,null,5,20,5,10,null,null,2,1,6,10,2,1,1,1,null,null,3,5,null,null,null,null,"1","5",null,null,null,null,null,null,null,null,0,10,"0","10","Episodic",20,10,10,10,30,15,50]
["Lowan Mallee","LoM","Low Rises Woodland","LoM_0066",1,"E","Endangered","Forest/Woodland","Woody","Lowan MalleeLow Rises Woodland","60/40",20,15,20,0,5,2,5,null,null,5,15,3,5,null,null,1,1,3,5,2,1,null,null,null,null,7,25,1,1,null,null,null,null,null,null,null,null,null,null,null,null,0,10,"0","10","Continuous",0,11,10,6,25,15,200]
["Lowan Mallee","LoM","Lowan Sands Mallee","LoM_0087",1.1499999999999999,"LC","Least Concern","scrubs/shrublands/mallee with logs","Woody","Lowan MalleeLowan Sands Mallee","0",0,7,25,null,null,null,null,null,null,5,35,7,30,1,1,null,null,4,10,null,null,1,1,null,null,5,5,2,10,null,null,null,null,null,null,null,null,null,null,null,null,null,null,null,null,"Episodic",20,7,12,4,65,5,50]
["Lowan Mallee","LoM","Parilla Mallee","LoM_0981",1,"E","Endangered","Forest/Woodland","Woody","Lowan MalleeParilla Mallee","35/20",25,10,25,0,5,null,null,null,null,4,10,3,10,null,null,1,1,3,5,5,5,null,null,null,null,6,15,1,5,null,null,null,null,null,null,null,null,null,null,null,null,0,10,"0","10","Continuous",0,10,7,9,20,20,150]
["Lowan Mallee","LoM","Plains Grassland","LoM_0132",1.36,"E","Endangered","grasslands","Other grassland","Lowan MalleePlains Grassland","0",0,0,null,null,null,null,null,null,null,null,null,5,10,null,null,null,null,12,15,4,10,null,null,null,null,4,25,2,1,null,null,null,null,null,null,null,null,null,null,null,null,0,10,"0","20","Continuous",0,7,5,16,10,5,0]
["Lowan Mallee","LoM","Plains Savannah","LoM_0826",1,"E","Endangered","Forest/Woodland","Woody","Lowan MalleePlains Savannah","0",0,0,null,null,null,null,null,null,null,null,null,2,5,null,null,3,5,6,20,3,10,1,5,1,5,5,35,2,5,null,null,null,null,null,null,null,null,null,null,null,null,0,10,"0","25","Continuous",0,10,2,12,5,5,0]
["Lowan Mallee","LoM","Plains Savannah - treed","LoM_0826_61",1,"E","Endangered","Forest/Woodland","Woody","Lowan MalleePlains Savannah - treed","40",5,10,10,0,5,null,null,null,null,null,null,2,5,null,null,3,5,6,20,3,10,1,5,1,5,5,35,2,5,null,null,null,null,null,null,null,null,null,null,null,null,0,10,"0","25","Continuous",0,11,2,12,5,5,50]
["Lowan Mallee","LoM","Plains Woodland","LoM_0803",1,"E","Endangered","Forest/Woodland","Woody","Lowan MalleePlains Woodland","70/40",15,15,15,0,5,null,null,null,null,2,5,2,5,1,1,1,1,20,25,4,10,1,5,1,1,16,30,3,5,null,null,null,null,null,null,null,null,null,null,null,null,0,10,"0","10","Continuous",0,13,4,25,10,10,100]
["Lowan Mallee","LoM","Red Gum Swamp","LoM_0292",1,"E","Endangered","Forest/Woodland","Woody","Lowan MalleeRed Gum Swamp","80",10,15,10,0,5,1,10,null,null,1,1,null,null,null,null,3,10,10,25,3,5,2,5,null,null,8,20,2,15,null,null,null,null,null,null,null,null,null,null,null,null,0,10,null,null,"Episodic",5,10,2,16,11,20,150]
["Lowan Mallee","LoM","Red Swale Mallee","LoM_0095",1.1499999999999999,"LC","Least Concern","scrubs/shrublands/mallee with logs","Woody","Lowan MalleeRed Swale Mallee","0",0,6,30,null,null,null,null,null,null,4,10,3,5,null,null,1,1,7,10,2,1,1,1,null,null,3,5,null,null,null,null,null,null,null,null,null,null,null,null,null,null,0,10,"0","20","Episodic",30,9,7,10,15,15,50]
["Lowan Mallee","LoM","Ridged Plains Mallee","LoM_0096",1,"E","Endangered","Forest/Woodland","Woody","Lowan MalleeRidged Plains Mallee","40/30",15,10,10,0,5,null,null,null,null,3,5,3,10,1,1,2,5,5,10,5,15,1,5,1,1,3,20,1,1,null,null,null,null,null,null,null,null,null,null,null,null,0,10,"0","20","Continuous",0,13,6,12,15,5,50]
["Lowan Mallee","LoM","Riparian Woodland","LoM_0641",1,"V","Vulnerable","Forest/Woodland","Woody","Lowan MalleeRiparian Woodland","80",15,15,10,0,5,2,10,null,null,2,10,1,1,null,null,4,10,5,10,1,5,3,10,null,null,4,30,2,5,null,null,null,null,null,null,null,null,null,null,1,5,0,10,null,null,"Continuous",0,12,5,10,21,30,200]
["Lowan Mallee","LoM","Riverine Chenopod Woodland","LoM_0103",1,"D","Depleted","Forest/Woodland","Woody","Lowan MalleeRiverine Chenopod Woodland","40",5,15,10,0,5,null,null,null,null,3,30,5,25,1,1,null,null,5,5,5,10,null,null,null,null,2,5,null,null,null,null,null,null,null,null,null,null,null,null,null,null,null,null,null,null,"Continuous",0,7,8,10,55,5,50]
["Lowan Mallee","LoM","Riverine Grassy Woodland","LoM_0295",1,"D","Depleted","Forest/Woodland","Woody","Lowan MalleeRiverine Grassy Woodland","80",15,20,20,0,5,null,null,null,null,null,null,4,10,null,null,4,10,2,10,5,10,1,1,null,null,5,20,2,5,null,null,null,null,null,null,null,null,null,null,null,null,0,10,null,null,"Continuous",0,9,4,11,10,10,200]
["Lowan Mallee","LoM","Salt Paperbark Woodland","LoM_0676",1.1499999999999999,"TBC","TBC","Forest/Woodland","Woody","Lowan MalleeSalt Paperbark Woodland","0",0,8,20,null,null,null,null,null,null,null,null,null,null,1,10,null,null,3,15,3,10,null,null,null,null,1,1,null,null,null,null,null,null,null,null,null,null,null,null,null,null,null,null,"0","10","Continuous",0,5,null,6,null,0,100]
["Lowan Mallee","LoM","Samphire Shrubland","LoM_0101",1.36,"LC","Least Concern","grasslands","Woody","Lowan MalleeSamphire Shrubland","0",0,0,null,null,null,null,null,null,null,null,null,4,20,null,null,null,null,7,5,3,5,null,null,null,null,2,1,2,1,null,null,null,null,null,null,null,null,null,null,null,null,null,null,"0","10","Continuous",0,6,4,10,20,0,0]
["Lowan Mallee","LoM","Sandstone Ridge Shrubland","LoM_0093",1.1499999999999999,"LC","Least Concern","scrubs/shrublands/mallee with logs","Woody","Lowan MalleeSandstone Ridge Shrubland","0",0,0,null,null,null,null,null,null,null,4,40,4,5,null,null,null,null,2,5,null,null,1,1,null,null,3,5,null,null,"1","1",null,null,null,null,null,null,null,null,null,null,0,10,"0","15","Episodic",20,8,8,2,45,10,0]
["Lowan Mallee","LoM","Sandstone Ridge Shrubland - treed","LoM_0093_61",1,"LC","Least Concern","scrubs/shrublands/mallee with logs","Woody","Lowan MalleeSandstone Ridge Shrubland - treed","0",0,3,15,null,null,null,null,null,null,4,40,4,5,null,null,null,null,2,5,null,null,1,1,null,null,3,5,null,null,"1","1",null,null,null,null,null,null,null,null,null,null,0,10,"0","15","Episodic",20,8,8,2,45,10,50]
["Lowan Mallee","LoM","Seasonally Inundated Shrubby Woodland","LoM_0195",1,"LC","Least Concern","Forest/Woodland","Woody","Lowan MalleeSeasonally Inundated Shrubby Woodland","70",15,15,15,0,5,null,null,null,null,7,35,4,5,1,1,3,5,4,10,3,5,null,null,null,null,6,20,4,5,"3","1",null,null,null,null,null,null,"1","1",null,null,0,10,null,null,"Continuous",0,12,11,10,40,20,150]
["Lowan Mallee","LoM","Semi-arid Chenopod Woodland","LoM_0098",1,"V","Vulnerable","Forest/Woodland","Woody","Lowan MalleeSemi-arid Chenopod Woodland","40/35",15,12,15,0,5,3,10,null,null,2,40,4,15,1,1,2,5,6,15,8,15,null,null,1,5,2,5,1,1,null,null,null,null,null,null,null,null,null,null,null,null,0,10,"0","30","Continuous",0,13,9,16,65,15,50]
["Lowan Mallee","LoM","Semi-arid Chenopod Woodland - non-treed","LoM_0098_61",1.36,"V","Vulnerable","Forest/Woodland","Woody","Lowan MalleeSemi-arid Chenopod Woodland - non-treed","0",0,0,null,null,null,null,null,null,null,2,40,4,15,1,1,2,5,6,15,8,15,null,null,1,5,2,5,1,1,null,null,null,null,null,null,null,null,null,null,null,null,0,10,"0","30","Continuous",0,11,6,16,55,5,0]
["Lowan Mallee","LoM","Semi-arid Woodland","LoM_0097",1,"D","Depleted","Forest/Woodland","Woody","Lowan MalleeSemi-arid Woodland","40/35",20,12,20,0,5,null,null,null,null,5,15,5,20,null,null,2,5,7,5,2,5,null,null,null,null,2,10,1,1,null,null,null,null,null,null,null,null,null,null,null,null,0,10,"0","20","Continuous",0,10,10,11,35,20,200]
["Lowan Mallee","LoM","Shallow Sands Woodland","LoM_0882",1,"D","Depleted","Forest/Woodland","Woody","Lowan MalleeShallow Sands Woodland","60/40",15,15,20,0,5,1,5,null,null,3,10,4,20,2,5,1,1,7,15,3,5,null,null,null,null,8,25,3,1,"2","1",null,null,null,null,null,null,null,null,null,null,0,10,"0","10","Continuous",0,13,8,11,35,20,200]
["Lowan Mallee","LoM","Tea-tree Scrub","LoM_0090",1.36,"LC","Least Concern","heathlands","Woody","Lowan MalleeTea-tree Scrub","0",0,0,null,null,null,null,null,null,null,5,55,5,15,null,null,null,null,4,5,null,null,2,5,null,null,5,10,1,1,null,null,null,null,null,null,null,null,null,null,1,1,0,10,"0","10","Continuous",0,9,10,4,70,20,0]
["Lowan Mallee","LoM","Woorinen Mallee","LoM_0824",1,"LC","Least Concern","Forest/Woodland","Woody","Lowan MalleeWoorinen Mallee","15",30,12,25,null,null,null,null,null,null,6,10,6,20,null,null,null,null,6,10,7,10,null,null,null,null,1,1,null,null,null,null,null,null,null,null,null,null,null,null,null,null,0,10,"0","15","Continuous",0,7,12,13,30,20,200]
["Lowan Mallee","LoM","Woorinen Sands Mallee","LoM_0086",1,"LC","Least Concern","Forest/Woodland","Woody","Lowan MalleeWoorinen Sands Mallee","15",30,7,25,null,null,null,null,null,null,4,5,2,10,1,5,null,null,6,5,6,5,null,null,null,null,3,5,1,1,null,null,"1","15",null,null,null,null,null,null,null,null,0,10,"0","10","Continuous",0,10,6,12,15,15,100]
["Monaro Tablelands","MonT","Blackthorn Scrub","MonT0027",1.25,"R","Rare","scrubs/shrublands/mallee without logs","Woody","Monaro TablelandsBlackthorn Scrub","0",0,0,null,null,null,null,null,null,null,8,40,1,1,null,null,2,1,3,5,null,null,1,1,null,null,3,5,1,1,null,null,null,null,1,1,null,null,null,null,3,5,0,10,null,null,"Continuous",0,10,9,5,41,40,100]
["Monaro Tablelands","MonT","Cool Temperate Rainforest","MonT0031",1,"R","Rare","Forest/Woodland","Woody","Monaro TablelandsCool Temperate Rainforest","70",20,25,50,0,5,2,20,null,null,2,5,null,null,null,null,2,10,2,5,null,null,null,null,null,null,null,null,null,null,null,null,null,null,6,25,"2","25","2","5",2,1,0,20,null,null,"Continuous",0,10,4,4,25,50,200]
["Monaro Tablelands","MonT","Cool Temperate Rainforest/Warm Temperate Rainf","MonT0033",1,"TBC","TBC","Forest/Woodland","Woody","Monaro TablelandsCool Temperate Rainforest/Warm Temperate Rainf","70",20,20,50,4,5,5,25,null,null,6,15,null,null,null,null,2,1,3,5,1,1,2,1,2,1,2,5,null,null,null,null,null,null,8,25,"3","20","4","5",7,20,0,20,null,null,"Continuous",0,14,11,6,40,50,200]
["Monaro Tablelands","MonT","Damp Forest","MonT0029",1,"LC","Least Concern","Forest/Woodland","Woody","Monaro TablelandsDamp Forest","90",20,30,40,0,5,3,15,null,null,10,25,3,5,null,null,2,1,6,15,1,1,2,5,1,5,4,10,1,1,null,null,null,null,4,20,"1","5",null,null,3,10,0,20,null,null,"Continuous",0,15,16,9,45,50,300]
["Monaro Tablelands","MonT","Grassy Dry Forest","MonT0022",1,"LC","Least Concern","Forest/Woodland","Woody","Monaro TablelandsGrassy Dry Forest","60",20,20,30,0,5,1,10,null,null,7,20,3,5,1,5,3,1,11,20,2,1,2,5,1,5,6,25,1,1,null,null,null,null,2,5,null,null,null,null,3,5,0,10,"0","10","Continuous",0,16,11,16,35,20,200]
["Monaro Tablelands","MonT","Montane Damp Forest","MonT0038",1,"LC","Least Concern","Forest/Woodland","Woody","Monaro TablelandsMontane Damp Forest","90",20,30,40,0,5,3,20,null,null,7,25,2,5,null,null,3,5,8,15,2,5,1,1,null,null,6,15,1,1,null,null,null,null,2,10,"1","1",null,null,1,5,0,20,null,null,"Continuous",0,14,12,13,50,50,300]
["Monaro Tablelands","MonT","Montane Dry Woodland","MonT0036",1,"LC","Least Concern","Forest/Woodland","Woody","Monaro TablelandsMontane Dry Woodland","60",15,15,20,0,5,2,10,null,null,7,30,4,10,null,null,2,5,10,15,3,5,2,5,null,null,6,15,2,5,null,null,null,null,2,5,null,null,null,null,1,1,0,10,"0","10","Continuous",0,14,13,15,50,20,150]
["Monaro Tablelands","MonT","Montane Grassy Woodland","MonT0037",1,"V","Vulnerable","Forest/Woodland","Woody","Monaro TablelandsMontane Grassy Woodland","60",15,10,20,0,5,1,5,null,null,2,10,3,5,1,1,1,1,8,20,2,5,1,5,null,null,5,25,1,5,null,null,null,null,1,1,null,null,null,null,1,1,0,10,"0","10","Continuous",0,15,6,11,20,20,150]
["Monaro Tablelands","MonT","Montane Riparian Woodland","MonT0040",1,"V","Vulnerable","Forest/Woodland","Woody","Monaro TablelandsMontane Riparian Woodland","60",15,10,10,0,5,1,10,null,null,3,15,3,5,null,null,4,10,12,20,4,10,3,5,1,1,6,30,3,5,null,null,null,null,1,1,null,null,null,null,1,1,0,20,null,null,"Continuous",0,14,7,20,30,40,150]
["Monaro Tablelands","MonT","Montane Wet Forest","MonT0039",1,"LC","Least Concern","Forest/Woodland","Woody","Monaro TablelandsMontane Wet Forest","90",20,30,40,0,5,5,30,null,null,5,25,1,1,null,null,null,null,3,5,null,null,1,1,1,1,2,10,null,null,null,null,null,null,4,30,"2","10",null,null,1,1,0,20,null,null,"Continuous",0,12,11,3,56,50,300]
["Monaro Tablelands","MonT","Riparian Forest","MonT0018",1,"LC","Least Concern","Forest/Woodland","Woody","Monaro TablelandsRiparian Forest","80",20,30,40,0,5,2,20,null,null,3,5,3,5,1,1,2,5,21,15,9,10,3,5,null,null,5,10,3,10,null,null,null,null,3,10,null,null,null,null,3,1,0,20,null,null,"Continuous",0,14,8,32,30,50,300]
["Monaro Tablelands","MonT","Rocky Outcrop Shrubland","MonT0028",1.36,"R","Rare","heathlands","Woody","Monaro TablelandsRocky Outcrop Shrubland","0",20,0,null,null,null,null,null,null,null,7,25,2,5,1,1,3,5,3,5,null,null,1,5,null,null,5,10,null,null,null,null,null,null,null,null,null,null,null,null,null,null,0,10,"0","10","Continuous",0,9,9,6,30,40,100]
["Monaro Tablelands","MonT","Shrubby Dry Forest","MonT0021",1,"LC","Least Concern","Forest/Woodland","Woody","Monaro TablelandsShrubby Dry Forest","60",20,25,30,0,5,1,10,null,null,6,30,4,10,1,1,1,5,2,5,1,1,1,5,null,null,3,10,1,1,null,null,null,null,null,null,null,null,null,null,null,null,0,10,null,null,"Episodic",20,12,11,4,50,20,200]
["Monaro Tablelands","MonT","Sub-alpine Woodland","MonT0043",1,"LC","Least Concern","Forest/Woodland","Woody","Monaro TablelandsSub-alpine Woodland","50",15,10,15,0,5,1,5,null,null,5,20,2,10,null,null,3,10,8,20,2,5,null,null,null,null,4,20,1,5,null,null,null,null,1,1,null,null,null,null,null,null,0,20,"0","10","Continuous",0,12,8,13,35,20,100]
["Monaro Tablelands","MonT","Tableland Damp Forest","MonT0035",1,"LC","Least Concern","Forest/Woodland","Woody",{"$f":"CONCATENATE(A643,C643)","v":"Monaro TablelandsTableland Damp Forest"},"90",20,30,40,0,5,3,20,null,null,7,20,2,10,null,null,2,5,8,15,2,15,1,5,1,1,3,15,1,5,null,null,null,null,null,null,null,null,null,null,null,null,0,20,null,null,"Continuous",0,12,12,12,50,50,300]
["Monaro Tablelands","MonT","Valley Grassy Forest","MonT0047",1,"D","Depleted","Forest/Woodland","Woody","Monaro TablelandsValley Grassy Forest","70",20,25,20,0,5,3,15,null,null,7,25,1,1,2,1,3,5,10,20,3,5,3,15,null,null,5,20,2,5,null,null,null,null,2,5,null,null,null,null,5,5,0,20,null,null,"Continuous",0,14,11,16,41,20,200]
["Monaro Tablelands","MonT","Wet Forest","MonT0030",1,"LC","Least Concern","Forest/Woodland","Woody","Monaro TablelandsWet Forest","90",20,0,40,0,5,4,20,null,null,7,25,3,5,null,null,1,1,5,15,1,1,1,1,1,1,3,5,1,1,null,null,null,null,4,30,"2","15",null,null,4,10,0,20,null,null,"Continuous",0,15,14,7,50,50,300]
["Murray Fans","MuF","Aquatic Herbland","MuF_0653",1.36,"D","Depleted","wetlands","Non-woody wetland","Murray FansAquatic Herbland","0",0,0,null,null,null,null,null,null,null,null,null,null,null,null,null,null,null,null,null,null,null,null,null,null,null,null,null,null,null,null,null,null,null,null,null,null,null,null,null,null,null,null,null,null,null,null,0,0,null,null,null,0,0]
["Murray Fans","MuF","Chenopod Grassland","MuF_0829",1.36,"E","Endangered","grasslands","Other grassland","Murray FansChenopod Grassland","0",0,0,null,null,null,null,null,null,null,1,10,6,30,null,null,1,1,5,15,4,5,null,null,null,null,3,20,null,null,null,null,null,null,null,null,null,null,null,null,null,null,0,10,"0","20","Continuous",0,8,7,10,40,5,0]
["Murray Fans","MuF","Chenopod Mallee","MuF_0158",1,"V","Vulnerable","Forest/Woodland","Woody","Murray FansChenopod Mallee","20",20,12,20,null,null,null,null,null,null,1,5,9,45,null,null,null,null,3,5,2,10,null,null,null,null,null,null,null,null,null,null,null,null,null,null,null,null,null,null,null,null,0,10,"0","15","Continuous",0,6,10,5,50,10,100]
["Murray Fans","MuF","Creekline Grassy Woodland","MuF_0068",1,"E","Endangered","Forest/Woodland","Woody","Murray FansCreekline Grassy Woodland","80",15,15,15,0,5,null,null,null,null,2,5,2,1,null,null,null,null,5,10,1,1,2,15,null,null,7,25,null,null,null,null,null,null,null,null,null,null,null,null,null,null,0,10,null,null,"Continuous",0,8,4,6,6,40,200]
["Murray Fans","MuF","Dunefield Heathland","MuF_0089",1.36,"TBC","TBC","heathlands","Woody","Murray FansDunefield Heathland","0",0,0,null,null,null,null,null,null,null,null,null,null,null,null,null,null,null,null,null,null,null,null,null,null,null,null,null,null,null,null,null,null,null,null,null,null,null,null,null,null,null,null,null,"0","10",null,0,1,null,null,null,0,0]
["Murray Fans","MuF","Floodplain Grassy Wetland","MuF_0809",1.36,"E","Endangered","wetlands","Non-woody wetland","Murray FansFloodplain Grassy Wetland","0",0,0,null,null,null,null,null,null,null,null,null,null,null,null,null,null,null,5,10,3,5,1,5,null,null,3,5,4,60,null,null,null,null,null,null,null,null,null,null,null,null,null,null,null,null,"Episodic",5,5,null,8,null,10,50]
["Murray Fans","MuF","Floodplain Riparian Woodland","MuF_0056",1,"D","Depleted","Forest/Woodland","Woody","Murray FansFloodplain Riparian Woodland","80",15,20,20,0,5,1,5,null,null,2,5,1,1,null,null,null,null,4,10,2,1,2,10,1,5,6,35,2,10,null,null,null,null,null,null,null,null,null,null,null,null,0,10,null,null,"Episodic",10,11,4,6,11,40,300]
["Murray Fans","MuF","Floodway Pond Herbland","MuF_0810",1.36,"D","Depleted","wetlands","Non-woody wetland","Murray FansFloodway Pond Herbland","0",0,0,null,null,null,null,null,null,null,null,null,null,null,null,null,1,1,5,20,4,15,null,null,null,null,2,10,3,20,null,null,null,null,null,null,null,null,null,null,null,null,null,null,null,null,"Episodic",5,5,null,10,null,5,50]
["Murray Fans","MuF","Grassy Riverine Forest","MuF_0106",1,"D","Depleted","Forest/Woodland","Woody","Murray FansGrassy Riverine Forest","90",20,25,30,0,5,1,10,null,null,null,null,null,null,null,null,2,10,3,10,null,null,null,null,null,null,3,25,3,10,null,null,null,null,null,null,null,null,null,null,null,null,0,10,null,null,"Continuous",0,7,1,5,10,40,300]
["Murray Fans","MuF","Grassy Woodland","MuF_0175",1,"E","Endangered","Forest/Woodland","Woody","Murray FansGrassy Woodland","70",15,15,15,0,5,1,5,null,null,3,10,4,5,null,null,3,5,12,20,null,null,1,5,1,5,19,40,4,5,null,null,null,null,null,null,null,null,null,null,null,null,0,10,"0","10","Continuous",0,12,8,15,20,20,150]
["Murray Fans","MuF","Intermittent Swampy Woodland","MuF_0813",1,"D","Depleted","Forest/Woodland","Woody","Murray FansIntermittent Swampy Woodland","50/70",15,15,20,0,5,1,5,null,null,1,5,1,5,null,null,2,5,5,10,1,5,null,null,null,null,3,30,2,10,null,null,null,null,null,null,null,null,null,null,null,null,null,null,null,null,"Continuous",0,9,3,8,15,20,200]
["Murray Fans","MuF","Lake Bed Herbland","MuF_0107",1.36,"V","Vulnerable","wetlands","Non-woody wetland","Murray FansLake Bed Herbland","0",0,0,null,null,null,null,null,null,null,2,5,2,5,null,null,null,null,3,25,3,20,null,null,null,null,2,5,null,null,null,null,null,null,null,null,null,null,null,null,null,null,null,null,null,null,"Episodic",10,5,4,6,10,5,0]
["Murray Fans","MuF","Lignum Shrubland","MuF_0808",1.36,"V","Vulnerable","wetlands","Woody","Murray FansLignum Shrubland","0",0,0,null,null,null,null,null,null,null,2,30,3,10,null,null,1,1,6,10,5,5,null,null,1,10,2,20,null,null,null,null,null,null,null,null,null,null,null,null,null,null,null,null,"0","10","Continuous",0,8,5,12,40,10,0]
["Murray Fans","MuF","Lignum Swamp","MuF_0104",1.36,"V","Vulnerable","wetlands","Woody","Murray FansLignum Swamp","0",0,0,null,null,null,null,null,null,null,1,20,null,null,null,null,4,5,8,25,2,10,null,null,1,5,2,5,2,5,null,null,null,null,null,null,null,null,null,null,1,1,null,null,"0","10","Continuous",0,9,1,14,20,5,0]
["Murray Fans","MuF","Lignum Swampy Woodland","MuF_0823",1,"V","Vulnerable","Forest/Woodland","Woody","Murray FansLignum Swampy Woodland","50/70",15,15,20,0,5,null,null,null,null,2,30,1,5,null,null,2,1,8,10,5,10,null,null,1,5,4,10,3,15,null,null,null,null,null,null,null,null,null,null,1,0,null,null,"0","10","Continuous",0,10,3,10,35,10,100]
["Murray Fans","MuF","Loamy Sands Mallee","MuF_0091",1.1499999999999999,"LC","Least Concern","scrubs/shrublands/mallee with logs","Woody","Murray FansLoamy Sands Mallee","0",0,5,25,null,null,null,null,null,null,5,20,5,10,null,null,2,1,6,10,2,1,1,1,null,null,3,5,null,null,null,null,"1","5",null,null,null,null,null,null,1,0,0,10,"0","10","Episodic",20,11,10,10,30,15,50]
["Murray Fans","MuF","Low Chenopod Shrubland","MuF_0102",1.36,"D","Depleted","grasslands","Woody","Murray FansLow Chenopod Shrubland","0",0,0,null,null,null,null,null,null,null,null,null,null,null,null,null,null,null,null,null,null,null,null,null,null,null,null,null,null,null,null,null,null,null,null,null,null,null,null,null,null,null,null,null,null,null,null,0,0,null,null,null,0,0]
["Murray Fans","MuF","Low Rises Woodland","MuF_0066",1,"E","Endangered","Forest/Woodland","Woody","Murray FansLow Rises Woodland","40/60",20,15,20,0,5,2,5,null,null,5,15,3,5,null,null,1,1,3,5,2,1,null,null,null,null,7,25,1,1,null,null,null,null,null,null,null,null,null,null,null,null,0,10,"0","10","Continuous",0,11,10,6,25,15,200]
["Murray Fans","MuF","Lunette Woodland","MuF_0652",1,"TBC","TBC","Forest/Woodland","Woody","Murray FansLunette Woodland","80",8,15,10,2,5,1,5,null,null,3,10,1,1,null,null,3,5,8,15,2,5,2,5,null,null,12,45,2,5,null,null,null,null,null,null,null,null,null,null,null,null,0,10,"0","10","Continuous",0,12,5,13,16,10,100]
["Murray Fans","MuF","Plains Grassland","MuF_0132",1.36,"E","Endangered","grasslands","Other grassland","Murray FansPlains Grassland","0",0,0,null,null,null,null,null,null,null,null,null,2,5,null,null,3,5,10,20,3,5,1,5,1,5,10,30,2,5,null,null,null,null,null,null,null,null,null,null,null,null,0,10,"0","20","Episodic",5,10,2,16,5,10,0]
["Murray Fans","MuF","Plains Grassy Wetland","MuF_0125",1.36,"E","Endangered","wetlands","Non-woody wetland","Murray FansPlains Grassy Wetland","0",0,0,null,null,null,null,null,null,null,null,null,null,null,null,null,5,5,11,20,6,10,2,5,null,null,7,20,3,30,null,null,null,null,null,null,null,null,null,null,null,null,0,10,null,null,"Episodic",5,7,null,22,null,10,50]
["Murray Fans","MuF","Plains Savannah","MuF_0826",1,"E","Endangered","Forest/Woodland","Woody","Murray FansPlains Savannah","0",0,0,null,null,null,null,null,null,null,null,null,2,5,null,null,3,5,6,20,3,10,1,5,1,5,5,35,2,5,null,null,null,null,null,null,null,null,null,null,null,null,0,10,"0","25","Continuous",0,10,2,12,5,5,0]
["Murray Fans","MuF","Plains Savannah - treed","MuF_0826_61",1,"E","Endangered","Forest/Woodland","Woody","Murray FansPlains Savannah - treed","40",5,10,10,0,5,null,null,null,null,null,null,2,5,null,null,3,5,6,20,3,10,1,5,1,5,5,35,2,5,null,null,null,null,null,null,null,null,null,null,null,null,0,10,"0","25","Continuous",0,11,2,12,5,5,50]
["Murray Fans","MuF","Plains Woodland","MuF_0803",1,"E","Endangered","Forest/Woodland","Woody","Murray FansPlains Woodland","40/60",15,15,15,null,5,null,null,null,null,3,10,1,5,2,10,2,1,9,10,5,10,1,1,null,null,6,20,2,1,null,null,null,null,null,null,null,null,null,null,1,1,0,10,"0","10","Continuous",0,12,4,16,15,10,100]
["Murray Fans","MuF","Red Gum Swamp","MuF_0292",1,"V","Vulnerable","Forest/Woodland","Woody","Murray FansRed Gum Swamp","80",10,15,10,0,5,null,null,null,null,null,null,null,null,null,null,null,null,8,25,null,null,2,5,null,null,2,5,2,40,null,null,null,null,null,null,null,null,null,null,null,null,0,10,"0","10","Episodic",5,7,null,8,null,20,150]
["Murray Fans","MuF","Ridged Plains Mallee","MuF_0096",1,"E","Endangered","Forest/Woodland","Woody","Murray FansRidged Plains Mallee","30/40",15,10,10,0,5,null,null,null,null,3,5,3,10,1,1,2,5,5,10,5,15,1,5,1,1,3,20,1,1,null,null,null,null,null,null,null,null,null,null,null,null,0,10,"0","20","Continuous",0,13,6,12,15,5,50]
["Murray Fans","MuF","Riparian Woodland","MuF_0641",1,"TBC","TBC","Forest/Woodland","Woody","Murray FansRiparian Woodland","80",15,15,10,1,5,2,10,null,null,2,10,null,null,null,null,4,10,5,10,1,1,3,10,null,null,4,30,2,5,null,null,null,null,null,null,null,null,null,null,1,5,0,10,null,null,"Continuous",0,11,4,10,20,30,200]
["Murray Fans","MuF","Riverine Chenopod Woodland","MuF_0103",1,"E","Endangered","Forest/Woodland","Woody","Murray FansRiverine Chenopod Woodland","40",5,15,10,0,5,null,null,null,null,3,30,5,25,1,1,null,null,5,5,5,10,null,null,null,null,2,5,null,null,null,null,null,null,null,null,null,null,null,null,null,null,null,null,null,null,"Continuous",0,7,8,10,55,5,50]
["Murray Fans","MuF","Riverine Ephemeral Wetland","MuF_0975",1.36,"V","Vulnerable","wetlands","Non-woody wetland","Murray FansRiverine Ephemeral Wetland","0",0,0,null,null,null,null,null,null,null,null,null,null,null,null,null,null,null,null,null,null,null,null,null,null,null,null,null,null,null,null,null,null,null,null,null,null,null,null,null,null,null,null,null,null,null,null,0,0,null,null,null,0,0]
["Murray Fans","MuF","Riverine Grassland","MuF_1088",1.36,"E","Endangered","grasslands","Other grassland","Murray FansRiverine Grassland","0",0,0,null,null,null,null,null,null,null,null,null,null,null,null,null,null,null,null,null,null,null,null,null,null,null,null,null,null,null,null,null,null,null,null,null,null,null,null,null,null,null,null,null,null,null,null,0,0,null,null,null,0,0]
["Murray Fans","MuF","Riverine Grassy Woodland","MuF_0295",1,"V","Vulnerable","Forest/Woodland","Woody","Murray FansRiverine Grassy Woodland","80",15,20,20,0,5,null,null,null,null,null,null,4,10,null,null,4,10,2,10,5,10,1,1,null,null,5,20,2,5,null,null,null,null,null,null,null,null,null,null,null,null,0,10,null,null,"Continuous",0,9,4,11,10,10,200]
["Murray Fans","MuF","Riverine Swamp Forest","MuF_0814",1,"D","Depleted","Forest/Woodland","Woody","Murray FansRiverine Swamp Forest","90",20,25,30,0,5,null,null,null,null,null,null,null,null,null,null,2,5,6,15,null,null,null,null,1,5,1,5,2,30,null,null,null,null,null,null,null,null,null,null,null,null,null,null,null,null,"Continuous",0,6,null,8,null,20,200]
["Murray Fans","MuF","Riverine Swampy Woodland","MuF_0815",1,"V","Vulnerable","Forest/Woodland","Woody","Murray FansRiverine Swampy Woodland","50/70",15,15,20,0,5,null,null,null,null,null,null,null,null,null,null,2,5,3,10,1,5,3,10,null,null,2,10,3,20,null,null,null,null,null,null,null,null,null,null,null,null,null,null,null,null,"Episodic",5,7,null,6,null,10,100]
["Murray Fans","MuF","Rushy Riverine Swamp","MuF_0804",1.36,"D","Depleted","wetlands","Non-woody wetland","Murray FansRushy Riverine Swamp","0",0,0,null,null,null,null,null,null,null,null,null,null,null,null,null,null,null,null,null,null,null,null,null,null,null,null,null,null,null,null,null,null,null,null,null,null,null,null,null,null,null,null,null,null,null,null,0,0,null,null,null,0,0]
["Murray Fans","MuF","Samphire Shrubland","MuF_0101",1.36,"LC","Least Concern","grasslands","Woody","Murray FansSamphire Shrubland","0",0,0,null,null,null,null,null,null,null,null,null,4,20,null,null,null,null,7,5,3,5,null,null,null,null,2,1,2,1,null,null,null,null,null,null,null,null,null,null,null,null,null,null,"0","10","Continuous",0,6,4,10,20,0,0]
["Murray Fans","MuF","Sand Ridge Woodland","MuF_0264",1,"E","Endangered","Forest/Woodland","Woody","Murray FansSand Ridge Woodland","40/70",15,15,15,0,5,null,null,null,null,4,20,3,10,2,5,2,5,10,15,5,5,3,10,null,null,8,15,null,null,null,null,null,null,1,5,null,null,null,null,1,5,0,10,"0","10","Continuous",0,13,7,17,30,10,150]
["Murray Fans","MuF","Sedgy Riverine Forest","MuF_0816",1,"D","Depleted","Forest/Woodland","Woody","Murray FansSedgy Riverine Forest","80",20,25,30,0,5,null,null,null,null,1,10,null,null,null,null,null,null,2,5,2,5,1,50,null,null,2,10,2,10,null,null,null,null,null,null,null,null,null,null,null,null,null,null,null,null,"Episodic",10,7,1,4,10,10,200]
["Murray Fans","MuF","Semi-arid Chenopod Woodland","MuF_0098",1,"E","Endangered","Forest/Woodland","Woody","Murray FansSemi-arid Chenopod Woodland","35/40",15,12,15,0,5,3,10,null,null,2,40,4,15,1,1,2,5,6,15,8,15,null,null,1,5,2,5,1,1,null,null,null,null,null,null,null,null,null,null,null,null,0,10,"0","30","Continuous",0,13,9,16,65,5,50]
["Murray Fans","MuF","Semi-arid Woodland","MuF_0097",1,"V","Vulnerable","Forest/Woodland","Woody","Murray FansSemi-arid Woodland","35/40",20,12,20,0,5,null,null,null,null,5,15,5,20,null,null,2,5,7,5,2,5,null,null,null,null,2,10,1,1,null,null,null,null,null,null,null,null,null,null,null,null,0,10,"0","20","Continuous",0,10,10,11,35,20,200]
["Murray Fans","MuF","Shallow Freshwater Marsh","MuF_0200",1.36,"V","Vulnerable","wetlands","Non-woody wetland","Murray FansShallow Freshwater Marsh","0",null,0,null,null,null,null,null,null,null,null,null,null,null,null,null,null,null,null,null,null,null,null,null,null,null,null,null,null,null,null,null,null,null,null,null,null,null,null,null,null,null,null,null,null,null,null,5,0,null,null,null,null,0]
["Murray Fans","MuF","Shallow Sands Woodland","MuF_0882",1,"V","Vulnerable","Forest/Woodland","Woody","Murray FansShallow Sands Woodland","70",15,15,15,0,5,1,5,null,null,4,15,3,10,1,5,null,null,10,20,2,5,1,1,null,null,13,30,3,5,null,null,null,null,null,null,null,null,null,null,null,null,0,10,"0","10","Continuous",0,12,8,12,30,20,150]
["Murray Fans","MuF","Shrubby Riverine Woodland","MuF_0818",1,"LC","Least Concern","Forest/Woodland","Woody","Murray FansShrubby Riverine Woodland","50/80",5,15,10,0,5,1,5,null,null,2,10,2,5,null,null,4,10,5,10,2,1,null,null,null,null,2,10,null,null,null,null,null,null,null,null,null,null,null,null,null,null,null,null,null,null,"Continuous",0,8,5,11,20,10,100]
["Murray Fans","MuF","Spike-sedge Wetland","MuF_0819",1.36,"V","Vulnerable","wetlands","Non-woody wetland","Murray FansSpike-sedge Wetland","0",0,0,null,null,null,null,null,null,null,null,null,null,null,null,null,1,5,6,15,4,5,null,null,null,null,2,10,2,50,null,null,null,null,null,null,null,null,null,null,null,null,null,null,null,null,"Episodic",5,5,null,11,null,20,50]
["Murray Fans","MuF","Tall Marsh","MuF_0821",1.36,"LC","Least Concern","wetlands","Non-woody wetland","Murray FansTall Marsh","0",0,0,null,null,null,null,null,null,null,null,null,null,null,null,null,null,null,6,20,3,10,1,10,3,40,null,null,2,10,null,null,null,null,null,null,null,null,null,null,null,null,null,null,null,null,"Episodic",1,5,null,9,null,10,50]
["Murray Fans","MuF","Wetland Formation","MuF_0074",1.36,"E","Endangered","wetlands","Non-woody wetland","Murray FansWetland Formation","0",null,0,null,null,null,null,null,null,null,null,null,null,null,null,null,null,null,null,null,null,null,null,null,null,null,null,null,null,null,null,null,null,null,null,null,null,null,null,null,null,null,null,null,null,null,null,5,0,null,null,null,null,0]
["Murray Fans","MuF","Woorinen Mallee","MuF_0824",1,"V","Vulnerable","Forest/Woodland","Woody","Murray FansWoorinen Mallee","15",30,12,25,null,null,null,null,null,null,6,10,6,20,null,null,null,null,6,10,7,10,null,null,null,null,1,1,null,null,null,null,null,null,null,null,null,null,null,null,null,null,0,10,"0","15","Continuous",0,7,12,13,30,20,200]
["Murray Fans","MuF","Woorinen Sands Mallee","MuF_0086",1,"D","Depleted","Forest/Woodland","Woody","Murray FansWoorinen Sands Mallee","15",30,7,25,null,null,null,null,null,null,4,5,2,10,1,5,null,null,6,5,6,5,null,null,null,null,3,5,1,1,null,null,"1","15",null,null,null,null,null,null,null,null,0,10,"0","10","Continuous",0,10,6,12,15,15,100]
["Murray Mallee","MuM","Chenopod Grassland","MuM_0829",1.36,"E","Endangered","grasslands","Other grassland","Murray MalleeChenopod Grassland","0",0,0,null,null,null,null,null,null,null,1,10,6,30,null,null,1,1,5,15,4,5,null,null,null,null,3,20,null,null,null,null,null,null,null,null,null,null,null,null,null,null,0,10,"0","20","Continuous",0,8,7,10,40,5,0]
["Murray Mallee","MuM","Chenopod Mallee","MuM_0158",1,"V","Vulnerable","Forest/Woodland","Woody","Murray MalleeChenopod Mallee","20",20,12,20,null,null,null,null,null,null,1,5,9,45,null,null,null,null,3,5,2,10,null,null,null,null,null,null,null,null,null,null,null,null,null,null,null,null,null,null,null,null,0,10,"0","15","Continuous",0,6,10,5,50,10,200]
["Murray Mallee","MuM","Dunefield Heathland","MuM_0089",1.36,"LC","Least Concern","heathlands","Woody","Murray MalleeDunefield Heathland","0",0,0,null,null,null,null,null,null,null,6,50,6,20,null,null,null,null,4,5,null,null,1,1,null,null,3,5,2,5,null,null,"1","1",null,null,null,null,null,null,null,null,null,null,"0","10","Episodic",20,8,12,4,70,5,0]
["Murray Mallee","MuM","Floodplain Grassy Wetland","MuM_0809",1.36,"E","Endangered","wetlands","Non-woody wetland","Murray MalleeFloodplain Grassy Wetland","0",0,0,null,null,null,null,null,null,null,null,null,null,null,null,null,null,null,5,10,3,5,1,5,null,null,3,5,4,60,null,null,null,null,null,null,null,null,null,null,null,null,null,null,null,null,"Episodic",5,5,null,8,null,10,50]
["Murray Mallee","MuM","Floodway Pond Herbland","MuM_0810",1.36,"V","Vulnerable","wetlands","Non-woody wetland","Murray MalleeFloodway Pond Herbland","0",0,0,null,null,null,null,null,null,null,null,null,null,null,null,null,1,1,5,20,4,15,null,null,null,null,2,10,3,20,null,null,null,null,null,null,null,null,null,null,null,null,null,null,"0","10","Episodic",5,6,null,10,null,5,50]
["Murray Mallee","MuM","Grassy Riverine Forest","MuM_0106",1,"D","Depleted","Forest/Woodland","Woody","Murray MalleeGrassy Riverine Forest","90",20,25,30,0,5,1,10,null,null,null,null,null,null,null,null,2,10,3,10,null,null,null,null,null,null,3,25,3,10,null,null,null,null,null,null,null,null,null,null,null,null,0,10,null,null,"Continuous",0,7,1,5,10,40,300]
["Murray Mallee","MuM","Heathy Mallee","MuM_0088",1.1499999999999999,"LC","Least Concern","scrubs/shrublands/mallee with logs","Woody","Murray MalleeHeathy Mallee","0",0,4,25,null,null,null,null,null,null,6,30,7,20,null,null,2,1,3,5,null,null,1,1,null,null,3,5,2,5,null,null,"1","5",null,null,null,null,null,null,null,null,null,null,"0","10","Episodic",20,9,13,5,50,10,50]
["Murray Mallee","MuM","Intermittent Swampy Woodland","MuM_0813",1,"V","Vulnerable","Forest/Woodland","Woody","Murray MalleeIntermittent Swampy Woodland","50/70",15,15,20,0,5,1,5,null,null,1,5,1,5,null,null,2,5,5,10,1,5,null,null,null,null,3,30,2,10,null,null,null,null,null,null,null,null,null,null,null,null,null,null,null,null,"Continuous",0,9,3,8,15,20,200]
["Murray Mallee","MuM","Lake Bed Herbland","MuM_0107",1.36,"D","Depleted","wetlands","Non-woody wetland","Murray MalleeLake Bed Herbland","0",0,0,null,null,null,null,null,null,null,2,5,2,5,null,null,null,null,3,25,3,20,null,null,null,null,null,null,null,null,null,null,null,null,null,null,null,null,null,null,null,null,null,null,null,null,"Episodic",10,4,4,6,10,5,0]
["Murray Mallee","MuM","Lignum Shrubland","MuM_0808",1.36,"LC","Least Concern","wetlands","Woody","Murray MalleeLignum Shrubland","0",0,0,null,null,null,null,null,null,null,2,30,3,10,null,null,1,1,6,10,5,5,null,null,1,10,2,20,null,null,null,null,null,null,null,null,null,null,null,null,null,null,null,null,"0","10","Continuous",0,8,5,12,40,10,0]
["Murray Mallee","MuM","Lignum Swamp","MuM_0104",1.36,"V","Vulnerable","wetlands","Woody","Murray MalleeLignum Swamp","0",0,0,null,null,null,null,null,null,null,1,20,null,null,null,null,4,5,8,25,2,10,null,null,1,5,2,5,2,5,null,null,null,null,null,null,null,null,null,null,1,1,null,null,"0","10","Continuous",0,9,1,14,20,5,0]
["Murray Mallee","MuM","Lignum Swampy Woodland","MuM_0823",1,"V","Vulnerable","Forest/Woodland","Woody","Murray MalleeLignum Swampy Woodland","50/70",15,15,30,0,5,null,null,null,null,2,30,1,5,null,null,2,1,8,10,5,10,null,null,1,5,3,10,3,15,null,null,null,null,null,null,null,null,null,null,null,null,null,null,"0","10","Continuous",0,10,3,15,35,5,100]
["Murray Mallee","MuM","Loamy Sands Mallee","MuM_0091",1.1499999999999999,"LC","Least Concern","scrubs/shrublands/mallee with logs","Woody","Murray MalleeLoamy Sands Mallee","0",0,5,25,null,null,null,null,null,null,5,20,5,10,null,null,2,1,6,10,2,1,1,1,null,null,3,5,null,null,null,null,"1","5",null,null,null,null,null,null,null,null,0,10,"0","10","Episodic",20,10,10,10,30,15,50]
["Murray Mallee","MuM","Low Chenopod Shrubland","MuM_0102",1.36,"D","Depleted","grasslands","Woody","Murray MalleeLow Chenopod Shrubland","0",0,0,null,null,null,null,null,null,null,1,5,4,25,2,5,2,1,6,25,4,20,null,null,null,null,3,5,2,1,null,null,null,null,null,null,null,null,null,null,null,null,0,10,"0","20","Continuous",0,10,5,12,30,5,0]
["Murray Mallee","MuM","Low Rises Woodland","MuM_0066",1,"E","Endangered","Forest/Woodland","Woody",{"$f":"CONCATENATE(A707,C707)","v":"Murray MalleeLow Rises Woodland"},"40/60",20,15,20,0,5,2,5,null,null,5,15,3,5,null,null,1,1,3,5,2,1,null,null,null,null,7,25,1,1,null,null,null,null,null,null,null,null,null,null,null,null,0,10,"0","10","Continuous",0,11,10,6,25,15,200]
["Murray Mallee","MuM","Lowan Sands Mallee","MuM_0087",1.1499999999999999,"LC","Least Concern","scrubs/shrublands/mallee with logs","Woody","Murray MalleeLowan Sands Mallee","0",0,7,25,null,null,null,null,null,null,5,35,7,30,1,1,null,null,4,10,null,null,1,1,null,null,5,5,2,10,null,null,null,null,null,null,null,null,null,null,null,null,null,null,null,null,"Episodic",20,7,12,4,65,5,50]
["Murray Mallee","MuM","Parilla Mallee","MuM_0981",1,"E","Endangered","Forest/Woodland","Woody","Murray MalleeParilla Mallee","20/35",25,10,25,0,5,null,null,null,null,4,10,3,10,null,null,1,1,3,5,5,5,null,null,null,null,6,15,1,5,null,null,null,null,null,null,null,null,null,null,null,null,0,10,"0","10","Continuous",0,10,7,9,20,20,150]
["Murray Mallee","MuM","Plains Grassland","MuM_0132",1.36,"E","Endangered","grasslands","Other grassland","Murray MalleePlains Grassland","0",0,0,null,null,null,null,null,null,null,null,null,2,5,null,null,3,5,6,20,3,10,1,5,1,5,5,35,2,5,null,null,null,null,null,null,null,null,null,null,null,null,0,10,"0","25","Episodic",5,10,2,12,5,10,0]
["Murray Mallee","MuM","Plains Savannah","MuM_0826",1,"E","Endangered","Forest/Woodland","Woody","Murray MalleePlains Savannah","0",0,0,null,null,null,null,null,null,null,null,null,2,5,null,null,3,5,6,20,3,10,1,5,1,5,5,35,2,5,null,null,null,null,null,null,null,null,null,null,null,null,0,10,"0","25","Continuous",0,10,2,12,5,5,0]
["Murray Mallee","MuM","Plains Savannah - treed","MuM_0826_61",1,"E","Endangered","Forest/Woodland","Woody","Murray MalleePlains Savannah - treed","40",5,10,10,0,5,1,5,null,null,null,null,2,5,null,null,3,5,6,20,3,10,1,5,1,5,5,35,2,5,null,null,null,null,null,null,null,null,null,null,null,null,0,10,"0","25","Continuous",0,12,3,12,10,5,50]
["Murray Mallee","MuM","Plains Woodland","MuM_0803",1,"E","Endangered","Forest/Woodland","Woody","Murray MalleePlains Woodland","40/60",15,15,15,null,null,null,null,null,null,3,10,1,5,2,10,3,1,9,10,5,10,1,1,null,null,4,20,2,1,null,null,null,null,null,null,null,null,null,null,1,1,0,10,"0","10","Continuous",0,12,4,17,15,10,100]
["Murray Mallee","MuM","Red Swale Mallee","MuM_0095",1.1499999999999999,"LC","Least Concern","scrubs/shrublands/mallee with logs","Woody","Murray MalleeRed Swale Mallee","0",0,6,30,null,null,null,null,null,null,4,10,3,5,null,null,1,1,7,10,2,1,1,1,null,null,3,5,null,null,null,null,null,null,null,null,null,null,null,null,null,null,0,10,"0","20","Episodic",30,9,7,10,15,15,50]
["Murray Mallee","MuM","Ridged Plains Mallee","MuM_0096",1,"E","Endangered","Forest/Woodland","Woody","Murray MalleeRidged Plains Mallee","30/40",15,10,10,0,5,null,null,null,null,3,5,3,10,1,1,2,5,5,10,5,15,1,5,1,1,3,20,1,1,null,null,null,null,null,null,null,null,null,null,null,null,0,10,"0","20","Continuous",0,13,6,12,15,5,50]
["Murray Mallee","MuM","Riparian Woodland","MuM_0641",1,"V","Vulnerable","Forest/Woodland","Woody","Murray MalleeRiparian Woodland","80",15,15,10,0,5,null,null,null,null,2,10,1,1,null,null,4,10,5,10,1,5,3,10,null,null,4,30,2,5,null,null,null,null,null,null,null,null,null,null,1,5,0,10,null,null,"Continuous",0,11,3,10,11,30,200]
["Murray Mallee","MuM","Riverine Chenopod Woodland","MuM_0103",1,"D","Depleted","Forest/Woodland","Woody","Murray MalleeRiverine Chenopod Woodland","40",5,15,10,0,5,null,null,null,null,3,30,5,25,1,1,null,null,5,5,5,10,null,null,null,null,null,null,null,null,null,null,null,null,null,null,null,null,null,null,null,null,null,null,null,null,"Continuous",0,6,8,10,55,5,50]
["Murray Mallee","MuM","Riverine Grassy Woodland","MuM_0295",1,"D","Depleted","Forest/Woodland","Woody","Murray MalleeRiverine Grassy Woodland","80",15,20,20,0,5,null,null,null,null,null,null,4,10,null,null,4,10,2,10,5,10,1,1,null,null,5,20,2,5,null,null,null,null,null,null,null,null,null,null,null,null,0,10,null,null,"Continuous",0,9,4,11,10,10,200]
["Murray Mallee","MuM","Salt Paperbark Woodland","MuM_0676",1.1499999999999999,"V","Vulnerable","scrubs/shrublands/mallee with logs","Woody","Murray MalleeSalt Paperbark Woodland","0",0,8,20,null,null,null,null,null,null,null,null,null,null,1,10,null,null,3,15,3,10,null,null,null,null,1,1,null,null,null,null,null,null,null,null,null,null,null,null,null,null,null,null,"0","10","Continuous",0,5,null,6,null,0,0]
["Murray Mallee","MuM","Samphire Shrubland","MuM_0101",1.36,"LC","Least Concern","grasslands","Woody","Murray MalleeSamphire Shrubland","0",0,0,null,null,null,null,null,null,null,null,null,4,20,null,null,null,null,7,5,3,5,null,null,null,null,2,1,2,1,null,null,null,null,null,null,null,null,null,null,null,null,null,null,"0","10","Continuous",0,6,4,10,20,0,0]
["Murray Mallee","MuM","Sandstone Ridge Shrubland","MuM_0093",1.1499999999999999,"LC","Least Concern","scrubs/shrublands/mallee with logs","Woody","Murray MalleeSandstone Ridge Shrubland","0",0,0,null,null,null,null,null,null,null,4,40,4,5,null,null,null,null,2,5,null,null,1,1,null,null,3,5,null,null,"1","1",null,null,null,null,null,null,null,null,null,null,0,10,"0","15","Episodic",20,8,8,2,45,10,0]
["Murray Mallee","MuM","Sandstone Ridge Shrubland - treed","MuM_0093_61",1,"LC","Least Concern","scrubs/shrublands/mallee with logs","Woody","Murray MalleeSandstone Ridge Shrubland - treed","0",0,3,15,null,null,null,null,null,null,4,40,4,5,null,null,null,null,2,5,null,null,1,1,null,null,3,5,null,null,"1","1",null,null,null,null,null,null,null,null,null,null,0,10,"0","15","Episodic",20,8,8,2,45,10,50]
["Murray Mallee","MuM","Sedgy Riverine Forest","MuM_0816",1,"V","Vulnerable","Forest/Woodland","Woody","Murray MalleeSedgy Riverine Forest","80",20,25,30,0,5,null,null,null,null,1,0,null,null,null,null,null,null,2,5,2,5,1,50,null,null,2,10,2,10,null,null,null,null,null,null,null,null,null,null,null,null,null,null,null,null,"Episodic",10,7,1,4,0,10,200]
["Murray Mallee","MuM","Semi-arid Chenopod Woodland","MuM_0098",1,"V","Vulnerable","Forest/Woodland","Woody","Murray MalleeSemi-arid Chenopod Woodland","35/40",15,12,15,0,5,3,10,null,null,2,40,4,15,1,1,2,5,6,15,8,15,null,null,1,5,2,5,1,1,null,null,null,null,null,null,null,null,null,null,null,null,0,10,"0","30","Continuous",0,13,9,16,65,15,50]
["Murray Mallee","MuM","Semi-arid Chenopod Woodland - non-treed","MuM_0098_61",1.36,"V","Vulnerable","Forest/Woodland","Woody","Murray MalleeSemi-arid Chenopod Woodland - non-treed","0",0,0,null,null,null,null,null,null,null,2,40,4,15,1,1,2,5,6,15,8,15,null,null,1,5,2,5,1,1,null,null,null,null,null,null,null,null,null,null,null,null,0,10,"0","30","Continuous",0,11,6,16,55,5,0]
["Murray Mallee","MuM","Semi-arid Parilla Woodland","MuM_0828",1,"V","Vulnerable","Forest/Woodland","Woody","Murray MalleeSemi-arid Parilla Woodland","40",20,15,20,0,5,null,null,null,null,4,10,4,10,null,null,2,5,10,10,null,null,null,null,1,1,2,15,1,5,null,null,null,null,null,null,null,null,"1","1",null,null,0,5,"0","30","Continuous",0,11,8,12,20,10,120]
["Murray Mallee","MuM","Semi-arid Woodland","MuM_0097",1,"V","Vulnerable","Forest/Woodland","Woody","Murray MalleeSemi-arid Woodland","35/40",20,12,20,0,5,null,null,null,null,5,15,5,20,null,null,2,5,7,5,2,5,null,null,null,null,2,10,1,1,null,null,null,null,null,null,null,null,null,null,null,null,0,10,"0","20","Continuous",0,10,10,11,35,20,200]
["Murray Mallee","MuM","Shallow Freshwater Marsh","MuM_0200",1.36,"V","Vulnerable","wetlands","Non-woody wetland","Murray MalleeShallow Freshwater Marsh","0",null,0,null,null,null,null,null,null,null,null,null,null,null,null,null,null,null,null,null,null,null,null,null,null,null,null,null,null,null,null,null,null,null,null,null,null,null,null,null,null,null,null,null,null,null,null,5,0,null,null,null,null,0]
["Murray Mallee","MuM","Shallow Sands Woodland","MuM_0882",1,"E","Endangered","Forest/Woodland","Woody","Murray MalleeShallow Sands Woodland","40/60",15,15,20,0,5,1,5,null,null,3,10,4,20,2,5,1,1,7,15,3,5,null,null,null,null,8,25,3,1,"2","1",null,null,null,null,null,null,null,null,null,null,0,10,"0","10","Continuous",0,13,8,11,35,20,200]
["Murray Mallee","MuM","Shrubby Riverine Woodland","MuM_0818",1,"LC","Least Concern","Forest/Woodland","Woody","Murray MalleeShrubby Riverine Woodland","50/80",5,15,10,0,5,1,5,null,null,2,10,2,5,null,null,4,10,5,10,2,1,null,null,null,null,2,10,null,null,null,null,null,null,null,null,null,null,null,null,null,null,null,null,null,null,"Continuous",0,8,5,11,20,10,100]
["Murray Mallee","MuM","Tall Marsh","MuM_0821",1.36,"LC","Least Concern","wetlands","Non-woody wetland","Murray MalleeTall Marsh","0",0,0,null,null,null,null,null,null,null,null,null,null,null,null,null,null,null,6,20,3,10,1,10,3,40,null,null,2,10,null,null,null,null,null,null,null,null,null,null,null,null,null,null,null,null,"Episodic",1,5,null,9,null,10,50]
["Murray Mallee","MuM","Woorinen Mallee","MuM_0824",1,"V","Vulnerable","Forest/Woodland","Woody","Murray MalleeWoorinen Mallee","15",30,12,25,null,null,null,null,null,null,6,10,6,20,null,null,null,null,6,10,7,10,null,null,null,null,1,1,null,null,null,null,null,null,null,null,null,null,null,null,null,null,0,10,"0","15","Continuous",0,7,12,13,30,20,200]
["Murray Mallee","MuM","Woorinen Sands Mallee","MuM_0086",1,"D","Depleted","Forest/Woodland","Woody","Murray MalleeWoorinen Sands Mallee","15",30,7,25,null,null,null,null,null,null,4,5,2,10,1,5,null,null,6,5,6,5,null,null,null,null,3,5,1,1,null,null,"1","15",null,null,null,null,null,null,null,null,0,10,"0","10","Continuous",0,10,6,12,15,15,100]
["Murray Scroll Belt","MSB","Alluvial Plains Semi-arid Grassland","MSB_0806",1.36,"V","Vulnerable","grasslands","Other grassland","Murray Scroll BeltAlluvial Plains Semi-arid Grassland","0",0,0,null,null,null,null,null,null,null,1,5,3,5,null,null,3,5,6,10,3,5,null,null,null,null,3,50,null,null,null,null,null,null,null,null,null,null,null,null,null,null,null,null,"0","10","Episodic",5,7,4,12,10,5,0]
["Murray Scroll Belt","MSB","Chenopod Mallee","MSB_0158",1,"V","Vulnerable","Forest/Woodland","Woody","Murray Scroll BeltChenopod Mallee","20",20,12,20,null,null,null,null,null,null,1,5,9,45,null,null,null,null,3,5,2,10,null,null,null,null,null,null,null,null,null,null,null,null,null,null,null,null,null,null,null,null,0,10,"0","15","Continuous",0,6,10,5,50,10,100]
["Murray Scroll Belt","MSB","Disused Floodway Shrubby Herbland","MSB_0807",1.36,"E","Endangered","wetlands","Non-woody wetland","Murray Scroll BeltDisused Floodway Shrubby Herbland","0",0,0,null,null,null,null,null,null,null,null,null,4,25,1,5,1,5,3,10,2,10,null,null,null,null,null,null,null,null,null,null,null,null,null,null,null,null,null,null,null,null,null,null,null,null,"Continuous",0,5,4,6,25,10,0]
["Murray Scroll Belt","MSB","Floodplain Grassy Wetland","MSB_0809",1.36,"E","Endangered","wetlands","Non-woody wetland","Murray Scroll BeltFloodplain Grassy Wetland","0",0,0,null,null,null,null,null,null,null,null,null,null,null,null,null,null,null,5,10,3,5,1,5,null,null,3,5,4,60,null,null,null,null,null,null,null,null,null,null,null,null,null,null,null,null,"Episodic",5,5,null,8,null,10,50]
["Murray Scroll Belt","MSB","Floodway Pond Herbland","MSB_0810",1.36,"D","Depleted","wetlands","Non-woody wetland","Murray Scroll BeltFloodway Pond Herbland","0",0,0,null,null,null,null,null,null,null,null,null,null,null,null,null,1,1,5,20,4,15,null,null,null,null,2,10,3,20,null,null,null,null,null,null,null,null,null,null,null,null,null,null,null,null,"Episodic",5,5,null,10,null,5,50]
["Murray Scroll Belt","MSB","Grassy Riverine Forest","MSB_0106",1,"D","Depleted","Forest/Woodland","Woody","Murray Scroll BeltGrassy Riverine Forest","90",20,25,30,0,5,null,null,null,null,null,null,2,1,null,null,7,10,10,15,2,1,1,0,null,null,3,20,1,1,null,null,null,null,null,null,null,null,null,null,null,null,0,10,null,null,"Continuous",0,9,2,19,1,40,300]
["Murray Scroll Belt","MSB","Intermittent Swampy Woodland","MSB_0813",1,"D","Depleted","Forest/Woodland","Woody","Murray Scroll BeltIntermittent Swampy Woodland","50/70",15,15,20,0,5,1,5,null,null,1,5,1,5,null,null,2,5,5,10,1,5,null,null,null,null,3,30,2,10,null,null,null,null,null,null,null,null,null,null,null,null,null,null,null,null,"Continuous",0,9,3,8,15,20,200]
["Murray Scroll Belt","MSB","Lake Bed Herbland","MSB_0107",1.36,"V","Vulnerable","wetlands","Non-woody wetland","Murray Scroll BeltLake Bed Herbland","0",0,0,null,null,null,null,null,null,null,2,5,2,5,null,null,null,null,3,25,3,20,null,null,null,null,null,null,null,null,null,null,null,null,null,null,null,null,null,null,null,null,null,null,null,null,"Episodic",10,4,4,6,10,5,0]
["Murray Scroll Belt","MSB","Lignum Shrubland","MSB_0808",1.36,"LC","Least Concern","wetlands","Woody","Murray Scroll BeltLignum Shrubland","0",0,0,null,null,null,null,null,null,null,2,30,3,10,null,null,1,1,6,10,5,5,null,null,1,10,2,20,null,null,null,null,null,null,null,null,null,null,null,null,null,null,null,null,"0","10","Continuous",0,8,5,12,40,10,0]
["Murray Scroll Belt","MSB","Lignum Swamp","MSB_0104",1.36,"V","Vulnerable","wetlands","Woody","Murray Scroll BeltLignum Swamp","0",0,0,null,null,null,null,null,null,null,1,20,null,null,null,null,4,5,8,25,2,10,null,null,1,5,2,5,2,5,null,null,null,null,null,null,null,null,null,null,1,1,null,null,"0","10","Continuous",0,9,1,14,20,5,0]
["Murray Scroll Belt","MSB","Lignum Swampy Woodland","MSB_0823",1,"D","Depleted","Forest/Woodland","Woody","Murray Scroll BeltLignum Swampy Woodland","50/70",15,15,20,0,5,null,null,null,null,2,30,1,5,null,null,2,1,8,10,5,10,null,null,1,5,2,5,3,15,null,null,null,null,null,null,null,null,null,null,null,null,null,null,"0","10","Continuous",0,10,3,15,35,5,100]
["Murray Scroll Belt","MSB","Low Chenopod Shrubland","MSB_0102",1.36,"D","Depleted","grasslands","Woody","Murray Scroll BeltLow Chenopod Shrubland","0",0,0,null,null,null,null,null,null,null,1,5,4,25,2,5,2,1,6,25,4,20,null,null,null,null,3,5,2,1,null,null,null,null,null,null,null,null,null,null,null,null,0,10,"0","20","Continuous",0,10,5,12,30,5,0]
["Murray Scroll Belt","MSB","Riverine Chenopod Woodland","MSB_0103",1,"D","Depleted","Forest/Woodland","Woody","Murray Scroll BeltRiverine Chenopod Woodland","40",5,15,10,0,5,null,null,null,null,3,30,5,25,1,1,null,null,5,5,5,10,null,null,null,null,2,5,null,null,null,null,null,null,null,null,null,null,null,null,null,null,null,null,"0","10","Continuous",0,8,8,10,55,10,50]
["Murray Scroll Belt","MSB","Semi-arid Chenopod Woodland","MSB_0098",1,"D","Depleted","Forest/Woodland","Woody","Murray Scroll BeltSemi-arid Chenopod Woodland","35/40",15,3,15,0,5,3,10,null,null,2,40,4,15,1,1,2,5,6,15,8,15,null,null,1,5,2,5,1,1,null,null,null,null,null,null,null,null,null,null,null,null,0,10,"0","30","Continuous",0,13,9,16,65,15,50]
["Murray Scroll Belt","MSB","Semi-arid Chenopod Woodland - non-treed","MSB_0098_61",1.36,"D","Depleted","Forest/Woodland","Woody","Murray Scroll BeltSemi-arid Chenopod Woodland - non-treed","0",0,0,null,null,null,null,null,null,null,2,40,4,15,1,1,2,5,6,15,8,15,null,null,1,5,2,5,1,1,null,null,null,null,null,null,null,null,null,null,null,null,0,10,"0","30","Continuous",0,11,6,16,55,5,0]
["Murray Scroll Belt","MSB","Semi-arid Woodland","MSB_0097",1,"V","Vulnerable","Forest/Woodland","Woody","Murray Scroll BeltSemi-arid Woodland","35/40",20,12,20,0,5,null,null,null,null,5,15,5,20,null,null,2,5,7,5,2,5,null,null,null,null,2,10,1,1,null,null,null,null,null,null,null,null,null,null,null,null,0,10,"0","20","Continuous",0,10,10,11,35,20,100]
["Murray Scroll Belt","MSB","Shallow Freshwater Marsh","MSB_0200",1.36,"V","Vulnerable","wetlands","Non-woody wetland","Murray Scroll BeltShallow Freshwater Marsh","0",null,0,null,null,null,null,null,null,null,null,null,null,null,null,null,null,null,null,null,null,null,null,null,null,null,null,null,null,null,null,null,null,null,null,null,null,null,null,null,null,null,null,null,null,null,null,5,0,null,null,null,null,0]
["Murray Scroll Belt","MSB","Shrubby Riverine Woodland","MSB_0818",1,"LC","Least Concern","Forest/Woodland","Woody","Murray Scroll BeltShrubby Riverine Woodland","50/80",5,15,10,0,5,1,5,null,null,2,10,2,5,null,null,4,10,5,10,2,1,null,null,null,null,2,10,null,null,null,null,null,null,null,null,null,null,null,null,null,null,null,null,null,null,"Continuous",0,8,5,11,20,10,100]
["Murray Scroll Belt","MSB","Spike-sedge Wetland","MSB_0819",1.36,"V","Vulnerable","wetlands","Non-woody wetland","Murray Scroll BeltSpike-sedge Wetland","0",0,0,null,null,null,null,null,null,null,null,null,null,null,null,null,1,5,6,15,4,5,null,null,null,null,2,10,2,50,null,null,null,null,null,null,null,null,null,null,null,null,null,null,null,null,"Episodic",5,5,null,11,null,20,50]
["Murray Scroll Belt","MSB","Sub-saline Depression Shrubland","MSB_0820",1.36,"V","Vulnerable","wetlands","Non-woody wetland","Murray Scroll BeltSub-saline Depression Shrubland","0",0,0,null,null,null,null,null,null,null,null,null,4,25,2,5,null,null,6,25,4,20,null,null,null,null,null,null,null,null,null,null,null,null,null,null,null,null,null,null,null,null,0,10,"0","20","Continuous",0,6,4,10,25,5,0]
["Murray Scroll Belt","MSB","Woorinen Mallee","MSB_0824",1,"TBC","TBC","Forest/Woodland","Woody","Murray Scroll BeltWoorinen Mallee","15",30,12,25,null,null,null,null,null,null,6,10,6,20,null,null,null,null,6,10,7,10,null,null,null,null,1,1,null,null,null,null,null,null,null,null,null,null,null,null,null,null,0,10,"0","15","Continuous",0,7,12,13,30,20,200]
["Murray Scroll Belt","MSB","Woorinen Sands Mallee","MSB_0086",1,"D","Depleted","Forest/Woodland","Woody","Murray Scroll BeltWoorinen Sands Mallee","15",30,7,25,null,null,null,null,null,null,4,5,2,10,1,5,2,0,6,5,6,5,null,null,null,null,3,5,1,1,null,null,"1","15",null,null,null,null,null,null,null,null,0,10,"0","10","Continuous",0,11,6,14,15,15,100]
["Northern Inland Slopes","NIS","Alluvial Terraces Herb-rich Woodland","NIS_0067",1,"E","Endangered","Forest/Woodland","Woody","Northern Inland SlopesAlluvial Terraces Herb-rich Woodland","70",15,15,15,0,5,1,5,null,null,3,5,2,5,1,1,3,5,7,25,1,1,1,1,null,null,9,20,null,null,null,null,null,null,null,null,null,null,null,null,null,null,0,10,"0","10","Continuous",0,12,6,11,15,10,150]
["Northern Inland Slopes","NIS","Box Ironbark Forest","NIS_0061",1,"V","Vulnerable","Forest/Woodland","Woody","Northern Inland SlopesBox Ironbark Forest","70",15,20,30,0,5,null,null,null,null,5,10,5,15,1,1,2,5,6,15,1,1,1,5,null,null,8,20,null,null,null,null,null,null,null,null,null,null,null,null,1,1,0,10,"0","10","Continuous",0,12,10,9,25,20,200]
["Northern Inland Slopes","NIS","Cane Grass Wetland","NIS_0291",1.36,"V","Vulnerable","wetlands","Non-woody wetland","Northern Inland SlopesCane Grass Wetland","0",0,0,null,null,null,null,null,null,null,null,null,null,null,null,null,null,null,null,null,2,10,null,null,null,null,null,null,2,40,null,null,null,null,null,null,null,null,null,null,null,null,null,null,null,null,"Episodic",5,2,null,2,null,10,0]
["Northern Inland Slopes","NIS","Clay Heathland","NIS_0007",1.36,"V","Vulnerable","heathlands","Woody","Northern Inland SlopesClay Heathland","0",0,0,null,null,null,null,null,null,null,9,30,6,10,3,5,null,null,8,10,null,null,4,10,1,5,7,10,2,5,null,null,null,null,null,null,null,null,null,null,null,null,0,10,"0","10","Episodic",30,10,15,8,40,20,0]
["Northern Inland Slopes","NIS","Clay Heathland - treed","NIS_0007_61",1,"V","Vulnerable","heathlands","Woody","Northern Inland SlopesClay Heathland - treed","40",10,8,10,null,null,null,null,null,null,9,30,6,10,3,5,null,null,8,10,null,null,4,10,1,5,7,10,2,5,null,null,null,null,null,null,null,null,null,null,null,null,0,10,"0","10","Episodic",30,10,15,8,40,20,50]
["Northern Inland Slopes","NIS","Creekline Grassy Woodland","NIS_0068",1,"E","Endangered","Forest/Woodland","Woody","Northern Inland SlopesCreekline Grassy Woodland","80",15,15,15,0,5,1,5,null,null,4,10,3,5,null,null,2,5,9,15,3,5,2,5,1,5,16,35,3,5,null,null,null,null,null,null,null,null,null,null,null,null,0,10,null,null,"Continuous",0,12,8,14,20,40,300]
["Northern Inland Slopes","NIS","Damp Forest","NIS_0029",1,"TBC","TBC","Forest/Woodland","Woody","Northern Inland SlopesDamp Forest","90",20,30,25,0,5,4,10,null,null,3,5,1,1,null,null,2,5,8,15,2,5,3,1,null,null,2,1,1,1,null,null,null,null,7,20,"2","50",null,null,3,5,0,20,null,null,"Continuous",0,14,8,12,16,50,300]
["Northern Inland Slopes","NIS","Floodplain Riparian Woodland","NIS_0056",1,"E","Endangered","Forest/Woodland","Woody","Northern Inland SlopesFloodplain Riparian Woodland","80",15,20,15,0,5,2,10,null,null,6,15,1,1,null,null,4,10,4,10,1,1,2,5,2,10,4,15,3,10,null,null,null,null,1,5,null,null,null,null,null,null,0,10,null,null,"Episodic",10,13,9,9,26,40,300]
["Northern Inland Slopes","NIS","Granitic Hills Woodland","NIS_0072",1,"LC","Least Concern","Forest/Woodland","Woody","Northern Inland SlopesGranitic Hills Woodland","30/50",15,10,15,0,5,1,5,null,null,7,20,3,5,null,null,4,5,11,15,2,1,null,null,null,null,6,5,2,1,null,null,null,null,2,1,null,null,null,null,null,null,0,10,"0","10","Continuous",0,12,11,17,30,20,150]
["Northern Inland Slopes","NIS","Grassy Dry Forest","NIS_0022",1,"D","Depleted","Forest/Woodland","Woody","Northern Inland SlopesGrassy Dry Forest","40/60",20,20,30,0,5,2,5,null,null,5,10,4,5,1,1,3,1,5,15,2,1,1,1,null,null,8,25,1,1,null,null,null,null,2,1,null,null,null,null,1,1,0,10,"0","10","Continuous",0,15,11,10,20,20,200]
["Northern Inland Slopes","NIS","Heathy Dry Forest","NIS_0020",1,"LC","Least Concern","Forest/Woodland","Woody","Northern Inland SlopesHeathy Dry Forest","60",20,20,30,0,5,1,5,null,null,6,20,6,20,1,1,3,5,7,15,2,1,1,1,null,null,7,25,1,1,null,null,null,null,null,null,null,null,null,null,null,null,0,10,"0","10","Episodic",20,13,13,12,45,20,200]
["Northern Inland Slopes","NIS","Herb-rich Foothill Forest","NIS_0023",1,"LC","Least Concern","Forest/Woodland","Woody","Northern Inland SlopesHerb-rich Foothill Forest","70",20,30,40,0,5,2,10,null,null,3,10,3,5,2,5,3,5,13,25,4,5,2,5,null,null,6,20,1,1,null,null,null,null,1,5,null,null,null,null,2,1,0,20,null,null,"Continuous",0,14,8,20,25,40,200]
["Northern Inland Slopes","NIS","Lignum Swampy Woodland","NIS_0823",1,"V","Vulnerable","Forest/Woodland","Woody","Northern Inland SlopesLignum Swampy Woodland","50/70",15,15,20,0,5,null,null,null,null,2,30,1,5,null,null,2,1,8,10,4,10,null,null,1,5,2,5,3,15,null,null,null,null,null,null,null,null,null,null,null,null,null,null,"0","10","Continuous",0,10,3,14,35,10,100]
["Northern Inland Slopes","NIS","Low Rises Grassy Woodland","NIS_0175_61",1,"E","Endangered","Forest/Woodland","Woody","Northern Inland SlopesLow Rises Grassy Woodland","40/70",15,15,15,0,5,1,5,null,null,3,10,4,5,1,1,3,5,12,20,null,null,1,5,1,5,19,40,4,5,null,null,null,null,1,1,null,null,null,null,null,null,0,10,"0","10","Continuous",0,14,8,15,20,20,150]
["Northern Inland Slopes","NIS","Montane Damp Forest","NIS_0038",1,"LC","Least Concern","Forest/Woodland","Woody","Northern Inland SlopesMontane Damp Forest","90",20,30,40,0,5,3,15,null,null,7,20,2,1,1,5,4,5,12,20,2,5,1,1,null,null,6,20,1,5,null,null,null,null,2,15,null,null,null,null,2,5,0,20,null,null,"Continuous",0,14,12,18,36,50,300]
["Northern Inland Slopes","NIS","Montane Dry Woodland","NIS_0036",1,"LC","Least Concern","Forest/Woodland","Woody",{"$f":"CONCATENATE(A771,C771)","v":"Northern Inland SlopesMontane Dry Woodland"},"50",15,15,20,0,5,2,20,null,null,5,20,2,5,2,5,3,5,9,15,null,null,2,5,null,null,6,15,null,null,null,null,null,null,1,5,null,null,null,null,2,1,0,10,"0","10","Continuous",0,13,9,12,45,20,150]
["Northern Inland Slopes","NIS","Mountain Valley Riparian Woodland","NIS_1085",1,"V","Vulnerable","Forest/Woodland","Woody","Northern Inland SlopesMountain Valley Riparian Woodland","0",0,0,null,null,null,null,null,null,null,null,null,null,null,null,null,null,null,null,null,null,null,null,null,null,null,null,null,null,null,null,null,null,null,null,null,null,null,null,null,null,null,null,null,null,null,null,0,0,null,null,null,0,0]
["Northern Inland Slopes","NIS","Plains Grassland","NIS_0132",1.36,"E","Endangered","grasslands","Other grassland","Northern Inland SlopesPlains Grassland","0",0,0,null,null,null,null,null,null,null,null,null,2,5,null,null,3,5,10,20,3,5,1,5,1,5,10,30,2,5,null,null,null,null,null,null,null,null,null,null,null,null,0,10,"0","20","Episodic",5,10,2,16,5,10,0]
["Northern Inland Slopes","NIS","Plains Grassy Wetland","NIS_0125",1.36,"E","Endangered","wetlands","Non-woody wetland","Northern Inland SlopesPlains Grassy Wetland","0",null,null,null,null,null,null,null,null,null,null,null,null,null,null,null,null,null,null,null,null,null,null,null,null,null,null,null,null,null,null,null,null,null,null,null,null,null,null,null,null,null,null,null,null,null,null,null,0,null,null,null,null,0]
["Northern Inland Slopes","NIS","Plains Grassy Woodland","NIS_0055",1,"E","Endangered","Forest/Woodland","Woody","Northern Inland SlopesPlains Grassy Woodland","50/80",15,15,15,0,5,1,5,null,null,2,10,1,1,null,null,2,5,15,40,5,10,null,null,null,null,8,30,2,5,null,null,null,null,1,1,null,null,null,null,null,null,0,10,"0","10","Continuous",0,12,4,22,16,10,150]
["Northern Inland Slopes","NIS","Plains Savannah","NIS_0826",1,"E","Endangered","Forest/Woodland","Woody","Northern Inland SlopesPlains Savannah","0",0,0,null,null,null,null,null,null,null,null,null,2,5,null,null,3,5,6,20,3,10,1,5,1,5,5,35,2,5,null,null,null,null,null,null,null,null,null,null,null,null,0,10,"0","25","Continuous",0,10,2,12,5,5,0]
["Northern Inland Slopes","NIS","Plains Savannah - treed","NIS_0826_61",1,"E","Endangered","Forest/Woodland","Woody","Northern Inland SlopesPlains Savannah - treed","40",5,10,10,0,5,null,null,null,null,null,null,2,5,null,null,3,5,6,20,3,10,1,5,1,5,5,35,2,5,null,null,null,null,null,null,null,null,null,null,null,null,0,10,"0","25","Continuous",0,11,2,12,5,5,50]
["Northern Inland Slopes","NIS","Plains Woodland","NIS_0803",1,"E","Endangered","Forest/Woodland","Woody","Northern Inland SlopesPlains Woodland","40/70",15,15,15,0,5,null,null,null,null,2,1,1,1,null,null,1,5,11,25,2,5,1,5,null,null,15,45,2,5,null,null,null,null,null,null,null,null,null,null,null,null,0,10,null,null,"Continuous",0,10,3,14,2,10,100]
["Northern Inland Slopes","NIS","Rainshadow Grassy Woodland","NIS_0175_62",1,"E","Endangered","Forest/Woodland","Woody","Northern Inland SlopesRainshadow Grassy Woodland","50/70",15,15,15,0,5,2,10,null,null,1,5,1,1,2,5,2,5,13,20,3,5,1,1,null,null,15,40,3,5,null,null,null,null,null,null,null,null,null,null,null,null,0,10,null,null,"Continuous",0,12,4,18,16,20,100]
["Northern Inland Slopes","NIS","Red Gum Swamp","NIS_0292",1,"E","Endangered","Forest/Woodland","Woody","Northern Inland SlopesRed Gum Swamp","80",10,15,10,0,5,null,null,null,null,null,null,null,null,null,null,2,30,1,1,null,null,2,10,null,null,3,15,2,5,null,null,null,null,null,null,null,null,null,null,null,null,0,10,"0","10","Episodic",5,8,null,3,null,10,150]
["Northern Inland Slopes","NIS","Riparian Forest","NIS_0018",1,"D","Depleted","Forest/Woodland","Woody","Northern Inland SlopesRiparian Forest","80",20,30,40,0,5,3,15,null,null,5,20,1,1,1,1,2,5,11,20,2,5,4,15,2,5,4,10,2,5,null,null,null,null,4,15,"1","5",null,null,2,5,0,20,null,null,"Continuous",0,16,9,15,36,50,300]
["Northern Inland Slopes","NIS","Riparian Shrubland","NIS_0019",1.25,"D","Depleted","scrubs/shrublands/mallee without logs","Woody","Northern Inland SlopesRiparian Shrubland","0",0,0,null,null,null,null,null,null,null,4,5,1,1,null,null,5,5,8,10,3,5,3,5,2,1,8,10,4,5,null,null,null,null,1,1,null,null,null,null,null,null,0,20,null,null,"Continuous",0,11,5,16,6,10,100]
["Northern Inland Slopes","NIS","Riverine Chenopod Woodland","NIS_0103",1,"V","Vulnerable","Forest/Woodland","Woody","Northern Inland SlopesRiverine Chenopod Woodland","0",0,0,null,null,null,null,null,null,null,null,null,null,null,null,null,null,null,null,null,null,null,null,null,null,null,null,null,null,null,null,null,null,null,null,null,null,null,null,null,null,null,null,null,null,null,null,0,0,null,null,null,0,0]
["Northern Inland Slopes","NIS","Riverine Escarpment Scrub","NIS_0082",1.25,"E","Endangered","scrubs/shrublands/mallee without logs","Woody","Northern Inland SlopesRiverine Escarpment Scrub","0",0,0,null,0,5,null,null,null,null,8,30,1,1,2,1,2,5,12,20,3,5,3,10,null,null,4,15,2,5,null,null,null,null,3,10,null,null,null,null,1,5,0,10,null,null,"Continuous",0,13,9,17,31,40,50]
["Northern Inland Slopes","NIS","Riverine Grassy Woodland","NIS_0295",1,"E","Endangered","Forest/Woodland","Woody","Northern Inland SlopesRiverine Grassy Woodland","0",0,0,null,null,null,null,null,null,null,null,null,null,null,null,null,null,null,null,null,null,null,null,null,null,null,null,null,null,null,null,null,null,null,null,null,null,null,null,null,null,null,null,null,null,null,null,0,0,null,null,null,0,0]
["Northern Inland Slopes","NIS","Riverine Swampy Woodland","NIS_0815",1,"E","Endangered","Forest/Woodland","Woody","Northern Inland SlopesRiverine Swampy Woodland","0",0,0,null,null,null,null,null,null,null,null,null,null,null,null,null,null,null,null,null,null,null,null,null,null,null,null,null,null,null,null,null,null,null,null,null,null,null,null,null,null,null,null,null,null,null,null,0,0,null,null,null,0,0]
["Northern Inland Slopes","NIS","Rocky Outcrop Shrubland","NIS_0028",1.36,"V","Vulnerable","heathlands","Woody","Northern Inland SlopesRocky Outcrop Shrubland","0",0,0,null,null,null,null,null,null,null,7,25,2,5,null,null,2,5,5,5,2,1,2,5,null,null,4,10,null,null,null,null,null,null,2,5,null,null,null,null,null,null,0,20,"0","10","Continuous",0,10,9,9,30,40,0]
["Northern Inland Slopes","NIS","Samphire Shrubland","NIS_0101",1.36,"LC","Least Concern","grasslands","Woody","Northern Inland SlopesSamphire Shrubland","0",0,0,null,null,null,null,null,null,null,null,null,4,20,null,null,null,null,7,5,3,5,null,null,null,null,2,1,2,1,null,null,null,null,null,null,null,null,null,null,null,null,null,null,null,null,"Continuous",0,5,4,10,20,0,0]
["Northern Inland Slopes","NIS","Sandstone Ridge Shrubland","NIS_0093",1.1499999999999999,"V","Vulnerable","scrubs/shrublands/mallee with logs","Woody","Northern Inland SlopesSandstone Ridge Shrubland","0",0,0,null,null,null,null,null,null,null,9,30,5,10,1,1,1,1,6,15,null,null,null,null,null,null,3,5,null,null,null,null,null,null,null,null,null,null,null,null,null,null,0,20,"0","20","Episodic",30,8,14,7,40,20,0]
["Northern Inland Slopes","NIS","Sandstone Ridge Shrubland - treed","NIS_0093_61",1,"V","Vulnerable","scrubs/shrublands/mallee with logs","Woody","Northern Inland SlopesSandstone Ridge Shrubland - treed","0",0,3,30,null,null,null,null,null,null,9,30,5,10,1,1,1,1,6,15,null,null,null,null,null,null,3,5,null,null,null,null,null,null,null,null,null,null,null,null,null,null,0,20,"0","20","Episodic",30,8,14,7,40,20,50]
["Northern Inland Slopes","NIS","Shallow Sands Woodland","NIS_0882",1,"E","Endangered","Forest/Woodland","Woody","Northern Inland SlopesShallow Sands Woodland","0",null,0,null,null,null,null,null,null,null,null,null,null,null,null,null,null,null,null,null,null,null,null,null,null,null,null,null,null,null,null,null,null,null,null,null,null,null,null,null,null,null,null,null,null,null,null,0,0,null,null,null,null,0]
["Northern Inland Slopes","NIS","Shrubby Dry Forest","NIS_0021",1,"LC","Least Concern","Forest/Woodland","Woody","Northern Inland SlopesShrubby Dry Forest","70",20,25,30,0,5,2,10,null,null,8,15,3,5,2,5,2,1,7,5,2,1,1,1,1,1,6,10,null,null,null,null,null,null,2,5,null,null,null,null,2,1,0,10,"0","10","Episodic",20,15,13,11,30,20,200]
["Northern Inland Slopes","NIS","Shrubby Granitic-outwash Grassy Woodland","NIS_0175_63",1,"E","Endangered","Forest/Woodland","Woody","Northern Inland SlopesShrubby Granitic-outwash Grassy Woodland","50/70",15,15,15,0,5,2,10,null,null,2,5,7,15,1,1,null,null,8,10,null,null,1,5,null,null,10,20,5,10,null,null,null,null,1,1,null,null,null,null,1,1,0,10,"0","10","Continuous",0,13,11,8,30,20,150]
["Northern Inland Slopes","NIS","Spring Soak Woodland","NIS_0080",1,"E","Endangered","Forest/Woodland","Woody","Northern Inland SlopesSpring Soak Woodland","50",5,10,10,0,5,2,1,null,null,2,5,null,null,null,null,2,1,6,10,3,10,2,10,3,5,9,35,1,5,null,null,null,null,null,null,null,null,null,null,null,null,0,20,null,null,"Continuous",0,11,4,11,6,20,50]
["Northern Inland Slopes","NIS","Swampy Riparian Woodland","NIS_0083",1,"E","Endangered","Forest/Woodland","Woody","Northern Inland SlopesSwampy Riparian Woodland","70",10,15,15,0,5,2,15,null,null,4,10,1,1,null,null,3,5,8,15,4,5,4,20,2,5,4,15,3,5,null,null,null,null,4,10,null,null,null,null,1,1,0,20,null,null,"Continuous",0,14,7,15,26,20,200]
["Northern Inland Slopes","NIS","Swampy Woodland","NIS_0937",1,"E","Endangered","Forest/Woodland","Woody","Northern Inland SlopesSwampy Woodland","0",null,0,null,null,null,null,null,null,null,null,null,null,null,null,null,null,null,null,null,null,null,null,null,null,null,null,null,null,null,null,null,null,null,null,null,null,null,null,null,null,null,null,null,null,null,null,0,0,null,null,null,null,0]
["Northern Inland Slopes","NIS","Valley Grassy Forest","NIS_0047",1,"E","Endangered","Forest/Woodland","Woody","Northern Inland SlopesValley Grassy Forest","70",20,20,20,0,5,3,10,null,null,3,10,3,5,null,null,1,1,8,20,3,1,1,1,null,null,12,25,1,5,null,null,null,null,null,null,null,null,null,null,null,null,0,20,null,null,"Continuous",0,11,9,12,25,20,200]
["Northern Inland Slopes","NIS","Wet Forest","NIS_0030",1,"LC","Least Concern","Forest/Woodland","Woody","Northern Inland SlopesWet Forest","90",20,30,40,0,5,4,30,null,null,6,20,1,1,null,null,2,1,5,10,2,1,1,1,1,10,1,5,null,null,null,null,null,null,4,20,"2","10",null,null,2,5,0,20,null,null,"Continuous",0,14,11,9,51,50,300]
["Northern Inland Slopes","NIS","Wetland Formation","NIS_0074",1.36,"E","Endangered","wetlands","Non-woody wetland","Northern Inland SlopesWetland Formation","0",null,0,null,null,null,null,null,null,null,null,null,null,null,null,null,null,null,null,null,null,null,null,null,null,null,null,null,null,null,null,null,null,null,null,null,null,null,null,null,null,null,null,null,null,null,null,5,0,null,null,null,null,0]
["Otway Plain","OtP","Berm Grassy Shrubland","OtP_0311",1.36,"E","Endangered","grasslands","Woody","Otway PlainBerm Grassy Shrubland","0",0,0,null,null,null,null,null,null,null,2,20,2,5,null,null,2,5,2,10,2,5,1,1,null,null,2,25,2,10,null,null,null,null,null,null,null,null,null,null,null,null,null,null,null,null,"Continuous",0,8,4,6,25,10,0]
["Otway Plain","OtP","Bird Colony Shrubland","OtP_0154",1.36,"R","Rare","grasslands","Woody","Otway PlainBird Colony Shrubland","0",0,0,null,null,null,null,null,null,null,3,10,null,null,null,null,1,10,null,null,null,null,null,null,null,null,null,null,1,5,null,null,null,null,null,null,null,null,null,null,null,null,null,null,null,null,"Continuous",0,3,3,1,10,10,0]
["Otway Plain","OtP","Cane Grass-Lignum Halophytic Herbland","OtP_0898",1.36,"V","Vulnerable","wetlands","Non-woody wetland","Otway PlainCane Grass-Lignum Halophytic Herbland","0",0,0,null,null,null,null,null,null,null,1,10,null,null,null,null,null,null,4,5,5,20,null,null,1,10,null,null,3,20,null,null,null,null,null,null,null,null,null,null,null,null,null,null,"0","10","Continuous",0,6,1,9,10,10,0]
["Otway Plain","OtP","Clay Heathland","OtP_0007",1.36,"V","Vulnerable","heathlands","Woody","Otway PlainClay Heathland","0",0,0,null,null,null,null,null,null,null,8,40,5,10,3,5,null,null,7,10,null,null,null,null,1,5,6,15,1,10,null,null,null,null,null,null,null,null,null,null,null,null,0,10,"0","10","Episodic",30,9,13,7,50,20,0]
["Otway Plain","OtP","Coastal Alkaline Scrub","OtP_0858",1.1499999999999999,"E","Endangered","scrubs/shrublands/mallee with logs","Woody","Otway PlainCoastal Alkaline Scrub","0",0,8,30,null,null,null,null,null,null,3,20,1,1,1,5,2,1,5,10,2,5,1,5,null,null,4,10,1,5,null,null,null,null,null,null,null,null,null,null,2,1,0,20,null,null,"Continuous",0,11,4,9,21,40,50]
["Otway Plain","OtP","Coastal Dune Grassland","OtP_0879",1.36,"TBC","TBC","grasslands","Other grassland","Otway PlainCoastal Dune Grassland","0",0,0,null,null,null,null,null,null,null,1,5,1,5,null,null,2,5,4,5,3,10,null,null,null,null,3,10,2,25,null,null,null,null,null,null,null,null,null,null,1,1,null,null,null,null,"Continuous",0,8,2,9,10,10,0]
["Otway Plain","OtP","Coastal Dune Scrub","OtP_0160",1.36,"TBC","TBC","scrubs/shrublands/mallee without logs","Woody","Otway PlainCoastal Dune Scrub","0",0,0,null,null,null,null,null,null,null,7,50,1,1,null,null,3,5,7,15,3,10,null,null,null,null,2,15,2,5,null,null,null,null,null,null,null,null,null,null,3,5,0,10,null,null,"Episodic",30,9,8,13,51,40,0]
["Otway Plain","OtP","Coastal Headland Scrub","OtP_0161",1.36,"V","Vulnerable","heathlands","Woody","Otway PlainCoastal Headland Scrub","0",0,0,null,null,null,null,null,null,null,8,60,1,1,2,5,null,null,2,5,null,null,null,null,null,null,1,5,null,null,null,null,null,null,null,null,null,null,null,null,null,null,0,10,"0","10","Episodic",30,7,9,2,61,40,0]
["Otway Plain","OtP","Coastal Saltmarsh","OtP_0009",1.36,"E","Endangered","grasslands","Non-woody wetland","Otway PlainCoastal Saltmarsh","0",0,0,null,null,null,null,null,null,null,1,10,1,5,1,5,null,null,3,15,1,5,1,5,1,5,1,1,2,5,null,null,null,null,null,null,null,null,null,null,null,null,null,null,"0","10","Continuous",0,10,2,4,15,10,0]
["Otway Plain","OtP","Coastal Tussock Grassland","OtP_0163",1.36,"V","Vulnerable","grasslands","Other grassland","Otway PlainCoastal Tussock Grassland","0",0,0,null,null,null,null,null,null,null,3,10,1,5,null,null,1,10,3,10,2,5,3,10,1,5,4,20,2,10,null,null,null,null,null,null,null,null,null,null,null,null,0,10,null,null,"Continuous",0,10,4,6,15,20,0]
["Otway Plain","OtP","Creekline Grassy Woodland","OtP_0068",1,"E","Endangered","Forest/Woodland","Woody","Otway PlainCreekline Grassy Woodland","80",15,15,15,0,5,2,15,null,null,5,10,1,1,null,null,2,5,6,10,3,5,2,10,1,5,10,30,3,10,null,null,null,null,null,null,null,null,null,null,3,10,0,10,null,null,"Continuous",0,13,8,11,26,40,200]
["Otway Plain","OtP","Damp Heath Scrub","OtP_0165",1.36,"E","Endangered","heathlands","Woody","Otway PlainDamp Heath Scrub","0",0,0,null,null,null,null,null,null,null,7,50,2,5,2,5,1,1,2,5,1,1,1,5,null,null,2,10,2,10,null,null,null,null,1,1,null,null,null,null,null,null,0,20,"0","10","Episodic",20,12,9,4,55,40,0]
["Otway Plain","OtP","Damp Sands Herb-rich Woodland","OtP_0003",1,"V","Vulnerable","Forest/Woodland","Woody","Otway PlainDamp Sands Herb-rich Woodland","70",15,15,15,0,5,2,10,null,null,8,20,1,1,2,5,2,5,9,20,2,5,2,10,1,1,4,10,2,5,null,null,null,null,2,10,null,null,null,null,2,5,0,10,null,null,"Continuous",0,15,11,13,31,40,150]
["Otway Plain","OtP","Estuarine Swamp Scrub","OtP_0053_62",1.25,"V","Vulnerable","scrubs/shrublands/mallee without logs","Woody","Otway PlainEstuarine Swamp Scrub","0",0,0,null,null,null,null,null,null,null,2,10,null,null,null,null,null,null,3,20,2,5,null,null,null,null,2,10,2,15,null,null,null,null,null,null,null,null,null,null,null,null,null,null,null,null,"Continuous",0,5,2,5,10,20,0]
["Otway Plain","OtP","Estuarine Wetland","OtP_0010",1.36,"E","Endangered","wetlands","Non-woody wetland","Otway PlainEstuarine Wetland","0",0,0,null,null,null,null,null,null,null,1,10,null,null,null,null,3,10,4,10,4,15,1,10,1,25,2,10,1,1,null,null,null,null,null,null,null,null,null,null,1,5,null,null,null,null,"Episodic",5,9,1,11,10,10,0]
["Otway Plain","OtP","Floodplain Reedbed","OtP_0863",1.36,"E","Endangered","wetlands","Non-woody wetland","Otway PlainFloodplain Reedbed","0",null,0,null,null,null,null,null,null,null,null,null,null,null,null,null,null,null,null,null,null,null,null,null,null,null,null,null,null,null,null,null,null,null,null,null,null,null,null,null,null,null,null,null,null,null,null,0,0,null,null,null,null,0]
["Otway Plain","OtP","Floodplain Riparian Woodland","OtP_0056",1,"E","Endangered","Forest/Woodland","Woody","Otway PlainFloodplain Riparian Woodland","80",15,15,20,0,5,1,5,null,null,3,10,null,null,null,null,3,5,4,10,3,10,2,15,1,5,5,15,3,10,null,null,null,null,null,null,null,null,null,null,1,5,0,10,null,null,"Episodic",10,12,4,10,15,40,300]
["Otway Plain","OtP","Grassy Forest","OtP_0128",1,"E","Endangered","Forest/Woodland","Woody","Otway PlainGrassy Forest","70",20,20,30,0,5,2,10,null,null,3,10,4,5,2,1,3,5,10,15,null,null,1,5,null,null,9,30,null,null,null,null,null,null,null,null,null,null,null,null,2,1,0,10,null,null,"Continuous",0,11,9,13,25,20,200]
["Otway Plain","OtP","Grassy Woodland","OtP_0175",1,"E","Endangered","Forest/Woodland","Woody","Otway PlainGrassy Woodland","40/70",15,15,15,0,5,2,10,null,null,6,20,2,5,2,1,3,5,8,15,3,5,3,10,1,5,10,20,2,10,null,null,null,null,1,5,null,null,null,null,2,5,0,10,null,null,"Continuous",0,15,10,14,35,20,150]
["Otway Plain","OtP","Heathy Woodland","OtP_0048",1,"LC","Least Concern","Forest/Woodland","Woody","Otway PlainHeathy Woodland","60",15,10,15,0,5,null,null,null,null,7,30,7,20,2,5,null,null,5,5,2,5,2,5,1,5,4,15,2,10,null,null,null,null,1,5,null,null,null,null,null,null,0,10,"0","10","Episodic",20,13,14,7,50,40,150]
["Otway Plain","OtP","Herb-rich Foothill Forest","OtP_0023",1,"V","Vulnerable","Forest/Woodland","Woody","Otway PlainHerb-rich Foothill Forest","70",20,25,40,0,5,2,10,null,null,4,20,null,null,null,null,3,5,12,20,4,10,2,20,1,5,3,10,2,5,null,null,null,null,1,5,null,null,null,null,1,1,0,20,null,null,"Continuous",0,13,6,19,30,40,200]
["Otway Plain","OtP","Lignum Swamp","OtP_0104",1.36,"E","Endangered","wetlands","Woody","Otway PlainLignum Swamp","80",0,0,10,null,null,null,null,null,null,1,20,null,null,null,null,2,5,4,20,3,10,1,5,null,null,5,20,3,10,null,null,null,null,null,null,null,null,null,null,null,null,0,10,"0","10","Episodic",10,9,1,9,20,10,50]
["Otway Plain","OtP","Lowland Forest","OtP_0016",1,"D","Depleted","Forest/Woodland","Woody","Otway PlainLowland Forest","70",20,25,30,0,5,null,null,null,null,6,35,4,10,2,1,null,null,4,5,2,5,1,5,2,10,3,10,2,5,null,null,null,null,2,10,null,null,null,null,null,null,0,10,null,null,"Continuous",0,12,10,6,45,40,200]
["Otway Plain","OtP","Mangrove Shrubland","OtP_0140",1.36,"V","Vulnerable","heathlands","Woody","Otway PlainMangrove Shrubland","0",0,0,null,null,null,null,null,null,null,1,40,null,null,null,null,null,null,null,null,null,null,null,null,null,null,null,null,1,5,null,null,null,null,null,null,null,null,null,null,null,null,null,null,null,null,"Continuous",0,2,1,null,40,0,0]
["Otway Plain","OtP","Plains Brackish Sedge Wetland","OtP_0891",1.36,"V","Vulnerable","wetlands","Non-woody wetland","Otway PlainPlains Brackish Sedge Wetland","0",0,0,null,null,null,null,null,null,null,null,null,null,null,null,null,1,5,3,15,3,10,1,10,2,10,2,5,3,15,null,null,null,null,null,null,null,null,null,null,1,1,null,null,"0","10","Episodic",5,9,null,7,null,10,0]
["Otway Plain","OtP","Plains Freshwater Sedge Wetland","OtP_0899",1.36,"V","Vulnerable","wetlands","Non-woody wetland","Otway PlainPlains Freshwater Sedge Wetland","0",0,0,null,null,null,null,null,null,null,null,null,null,null,null,null,2,5,5,40,5,10,2,5,1,5,4,25,2,5,null,null,null,null,null,null,null,null,null,null,null,null,null,null,null,null,"Episodic",5,7,null,12,null,10,50]
["Otway Plain","OtP","Plains Grassland","OtP_0132",1.36,"E","Endangered","grasslands","Other grassland","Otway PlainPlains Grassland","0",0,0,null,null,null,null,null,null,null,null,null,null,null,null,null,3,10,10,20,3,5,1,1,null,null,13,40,4,10,null,null,null,null,null,null,null,null,null,null,null,null,0,10,"0","10","Episodic",5,8,null,16,null,10,0]
["Otway Plain","OtP","Plains Grassy Wetland","OtP_0125",1.36,"E","Endangered","wetlands","Non-woody wetland","Otway PlainPlains Grassy Wetland","0",null,null,null,null,null,null,null,null,null,null,null,null,null,null,null,null,null,null,null,null,null,null,null,null,null,null,null,null,null,null,null,null,null,null,null,null,null,null,null,null,null,null,null,null,null,null,null,0,null,null,null,null,0]
["Otway Plain","OtP","Plains Grassy Woodland","OtP_0055",1,"E","Endangered","Forest/Woodland","Woody","Otway PlainPlains Grassy Woodland","80",10,15,20,0,5,2,10,null,null,null,null,1,1,2,5,1,5,10,20,3,5,1,5,1,5,9,35,2,10,null,null,null,null,null,null,null,null,null,null,null,null,0,10,null,null,"Continuous",0,12,3,14,11,10,100]
["Otway Plain","OtP","Plains Sedgy Wetland","OtP_0647",1.36,"E","Endangered","wetlands","Non-woody wetland","Otway PlainPlains Sedgy Wetland","0",0,0,null,null,null,null,null,null,null,null,null,null,null,null,null,2,5,5,40,5,10,2,5,1,5,4,25,2,5,null,null,null,null,null,null,null,null,null,null,null,null,null,null,null,null,"Episodic",5,7,null,12,null,10,50]
["Otway Plain","OtP","Riparian Forest","OtP_0018",1,"V","Vulnerable","Forest/Woodland","Woody","Otway PlainRiparian Forest","80",20,30,40,0,5,4,20,null,null,6,20,null,null,null,null,2,5,7,15,2,1,2,5,1,5,2,1,1,5,null,null,null,null,5,20,"2","15",null,null,2,5,0,20,null,null,"Continuous",0,14,10,11,40,50,300]
["Otway Plain","OtP","Sand Heathland","OtP_0006",1.36,"R","Rare","heathlands","Woody","Otway PlainSand Heathland","0",0,0,null,null,null,null,null,null,null,6,30,8,20,3,5,null,null,3,5,2,5,2,10,1,5,6,15,1,1,null,null,null,null,1,1,null,null,null,null,3,5,0,10,"0","10","Episodic",30,13,14,5,50,20,0]
["Otway Plain","OtP","Seasonally Inundated Sub-saline Herbland","OtP_0196",1.36,"R","Rare","wetlands","Non-woody wetland","Otway PlainSeasonally Inundated Sub-saline Herbland","0",0,0,null,null,null,null,null,null,null,null,null,null,null,2,20,null,null,2,30,null,null,null,null,null,null,null,null,1,5,null,null,null,null,null,null,null,null,null,null,null,null,null,null,"0","10","Episodic",5,4,null,2,null,10,150]
["Otway Plain","OtP","Sedgy Riparian Woodland","OtP_0198",1,"D","Depleted","Forest/Woodland","Woody","Otway PlainSedgy Riparian Woodland","70",15,15,20,0,5,1,10,null,null,5,20,null,null,null,null,null,null,6,10,3,5,3,25,2,15,3,10,2,10,null,null,null,null,2,10,null,null,null,null,null,null,0,10,null,null,"Continuous",0,11,6,9,30,30,200]
["Otway Plain","OtP","Shallow Freshwater Marsh","OtP_0200",1.36,"E","Endangered","wetlands","Non-woody wetland","Otway PlainShallow Freshwater Marsh","0",null,0,null,null,null,null,null,null,null,null,null,null,null,null,null,null,null,null,null,null,null,null,null,null,null,null,null,null,null,null,null,null,null,null,null,null,null,null,null,null,null,null,null,null,null,null,5,0,null,null,null,null,0]
["Otway Plain","OtP","Shrubby Dry Forest","OtP_0021",1,"LC","Least Concern","Forest/Woodland","Woody",{"$f":"CONCATENATE(A835,C835)","v":"Otway PlainShrubby Dry Forest"},"60",20,20,30,0,5,1,5,null,null,5,25,2,1,1,1,null,null,3,5,2,1,2,10,null,null,4,10,null,null,null,null,null,null,1,1,null,null,null,null,3,5,0,10,"0","10","Episodic",20,13,8,5,31,20,200]
["Otway Plain","OtP","Shrubby Foothill Forest","OtP_0045",1,"LC","Least Concern","Forest/Woodland","Woody","Otway PlainShrubby Foothill Forest","70",20,25,40,0,5,1,10,null,null,8,40,1,1,null,null,1,1,5,10,1,1,2,10,1,15,2,5,null,null,null,null,null,null,3,15,"1","1",null,null,2,1,0,10,null,null,"Episodic",30,14,10,7,51,40,200]
["Otway Plain","OtP","Shrubby Wet Forest","OtP_0201",1,"LC","Least Concern","Forest/Woodland","Woody","Otway PlainShrubby Wet Forest","90",20,30,40,0,5,2,10,null,null,9,20,null,null,1,1,2,1,5,10,2,5,2,10,1,10,2,5,1,1,null,null,null,null,3,20,"1","15",null,null,1,1,0,20,null,null,"Continuous",0,15,11,9,30,50,300]
["Otway Plain","OtP","Stony Rises Woodland","OtP_0203",1,"V","Vulnerable","Forest/Woodland","Woody","Otway PlainStony Rises Woodland","70",15,15,15,0,5,1,10,null,null,1,5,1,5,null,null,3,5,8,15,4,10,1,5,null,null,4,20,1,5,null,null,null,null,2,20,null,null,null,null,1,1,0,10,null,null,"Continuous",0,13,3,15,20,20,150]
["Otway Plain","OtP","Stream Bank Shrubland","OtP_0851",1,"E","Endangered","Forest/Woodland","Woody","Otway PlainStream Bank Shrubland","70",10,15,10,0,5,2,10,null,null,4,20,null,null,null,null,3,5,12,25,4,10,3,10,3,10,12,20,5,10,null,null,null,null,null,null,null,null,null,null,2,5,0,10,null,null,"Continuous",0,12,6,19,30,40,100]
["Otway Plain","OtP","Swamp Scrub","OtP_0053_61",1.25,"V","Vulnerable","scrubs/shrublands/mallee without logs","Woody","Otway PlainSwamp Scrub","0",0,0,null,null,null,null,null,null,null,2,10,null,null,null,null,3,10,7,20,1,5,2,5,3,15,3,10,1,5,null,null,null,null,null,null,null,null,null,null,1,1,0,20,null,null,"Continuous",0,10,2,11,10,40,0]
["Otway Plain","OtP","Swampy Riparian Woodland","OtP_0083",1,"E","Endangered","Forest/Woodland","Woody","Otway PlainSwampy Riparian Woodland","70",10,15,10,0,5,2,10,null,null,3,10,null,null,null,null,3,5,9,15,4,5,5,25,1,5,8,20,2,5,null,null,null,null,1,1,null,null,null,null,2,5,0,20,null,null,"Continuous",0,13,5,16,20,20,200]
["Otway Plain","OtP","Tall Marsh","OtP_0821",1.36,"TBC","TBC","wetlands","Non-woody wetland","Otway PlainTall Marsh","0",0,0,null,null,null,null,null,null,null,null,null,null,null,null,null,3,10,3,5,5,20,1,5,2,40,null,null,2,1,null,null,null,null,null,null,null,null,null,null,null,null,null,null,null,null,"Episodic",5,6,null,11,null,10,0]
["Otway Plain","OtP","Wet Forest","OtP_0030",1,"LC","Least Concern","Forest/Woodland","Woody","Otway PlainWet Forest","90",20,30,40,0,5,4,30,null,null,5,20,null,null,null,null,null,null,2,5,null,null,2,5,1,5,2,1,2,5,null,null,null,null,3,35,"1","5",null,null,2,5,0,20,null,null,"Continuous",0,12,9,2,50,50,300]
["Otway Plain","OtP","Wet Heathland","OtP_0008",1.36,"LC","Least Concern","heathlands","Woody","Otway PlainWet Heathland","0",0,0,null,null,null,null,null,null,null,5,40,3,5,null,null,1,1,2,5,null,null,2,10,null,null,1,10,2,20,null,null,null,null,2,1,null,null,null,null,1,1,0,20,null,null,"Episodic",30,10,8,3,45,20,0]
["Otway Plain","OtP","Wet Sands Thicket","OtP_0233",1.36,"R","Rare","heathlands","Woody","Otway PlainWet Sands Thicket","0",0,0,null,null,null,null,null,null,null,5,50,4,10,null,null,null,null,2,1,1,1,1,5,null,null,1,1,1,1,null,null,null,null,1,1,null,null,null,null,1,1,0,10,null,null,"Episodic",30,10,9,3,60,40,0]
["Otway Plain","OtP","Wetland Formation","OtP_0074",1.36,"E","Endangered","wetlands","Non-woody wetland","Otway PlainWetland Formation","0",0,0,null,null,null,null,null,null,null,null,null,null,null,null,null,2,10,3,20,2,15,1,5,null,null,2,10,2,10,null,null,null,null,null,null,null,null,null,null,null,null,null,null,null,null,"Episodic",5,6,null,7,null,20,0]
["Otway Ranges","OtR","Coastal Headland Scrub","OtR_0161",1.36,"D","Depleted","heathlands","Woody","Otway RangesCoastal Headland Scrub","0",0,0,null,null,null,null,null,null,null,9,50,null,null,null,null,6,10,8,20,3,5,2,1,2,5,6,10,3,5,null,null,null,null,null,null,null,null,null,null,2,5,0,10,null,null,"Episodic",30,10,9,17,50,40,50]
["Otway Ranges","OtR","Coastal Tussock Grassland","OtR_0163",1.36,"V","Vulnerable","grasslands","Other grassland","Otway RangesCoastal Tussock Grassland","0",0,0,null,null,null,null,null,null,null,3,10,1,5,null,null,1,10,3,10,2,5,3,10,1,5,4,20,2,10,null,null,null,null,null,null,null,null,null,null,null,null,0,10,null,null,"Continuous",0,10,4,6,15,20,0]
["Otway Ranges","OtR","Cool Temperate Rainforest","OtR_0031",1,"E","Endangered","Forest/Woodland","Woody","Otway RangesCool Temperate Rainforest","70",20,25,50,0,5,2,20,null,null,3,10,null,null,null,null,null,null,2,1,null,null,null,null,null,null,null,null,null,null,null,null,null,null,7,40,"2","30","6","5",1,1,0,20,null,null,"Continuous",0,9,5,2,30,50,200]
["Otway Ranges","OtR","Damp Heath Scrub","OtR_0165",1.36,"E","Endangered","heathlands","Woody","Otway RangesDamp Heath Scrub","0",0,0,null,null,null,null,null,null,null,9,50,5,15,2,5,null,null,2,5,null,null,3,10,1,5,null,null,2,5,null,null,null,null,3,10,null,null,null,null,null,null,0,20,"0","10","Episodic",20,10,14,2,65,40,0]
["Otway Ranges","OtR","Damp Sands Herb-rich Woodland","OtR_0003",1,"V","Vulnerable","Forest/Woodland","Woody","Otway RangesDamp Sands Herb-rich Woodland","70",15,15,20,0,5,1,5,null,null,9,30,null,null,1,1,3,5,6,15,2,5,2,5,1,5,4,15,1,1,null,null,null,null,2,5,null,null,null,null,1,5,0,10,null,null,"Continuous",0,14,10,11,35,40,150]
["Otway Ranges","OtR","Estuarine Wetland","OtR_0010",1.36,"E","Endangered","wetlands","Non-woody wetland","Otway RangesEstuarine Wetland","0",0,0,null,null,null,null,null,null,null,1,10,null,null,null,null,3,10,4,10,4,15,1,10,1,25,2,10,1,1,null,null,null,null,null,null,null,null,null,null,1,5,null,null,null,null,"Episodic",5,9,1,11,10,10,0]
["Otway Ranges","OtR","Floodplain Reedbed","OtR_0863",1.36,"E","Endangered","wetlands","Non-woody wetland","Otway RangesFloodplain Reedbed","0",0,0,null,null,null,null,null,null,null,1,5,null,null,null,null,2,10,2,5,2,5,null,null,2,30,1,5,null,null,null,null,null,null,null,null,null,null,null,null,1,1,null,null,null,null,null,0,7,1,6,5,10,0]
["Otway Ranges","OtR","Grassy Dry Forest","OtR_0022",1,"D","Depleted","Forest/Woodland","Woody","Otway RangesGrassy Dry Forest","60",20,20,30,1,5,1,5,null,null,5,5,null,null,2,5,2,5,4,5,null,null,2,10,null,null,9,30,1,5,null,null,null,null,null,null,null,null,null,null,1,1,0,10,"0","10","Continuous",0,12,6,6,10,20,200]
["Otway Ranges","OtR","Grassy Forest","OtR_0128",1,"E","Endangered","Forest/Woodland","Woody","Otway RangesGrassy Forest","70",20,20,30,0,5,2,10,null,null,3,10,4,5,2,1,3,5,10,15,null,null,1,5,null,null,9,30,null,null,null,null,null,null,null,null,null,null,null,null,2,1,0,10,null,null,"Continuous",0,11,9,13,25,20,200]
["Otway Ranges","OtR","Grassy Woodland","OtR_0175",1,"E","Endangered","Forest/Woodland","Woody","Otway RangesGrassy Woodland","70",15,15,15,0,5,2,10,null,null,6,20,2,5,2,1,3,5,8,15,3,5,3,10,1,5,10,20,2,10,null,null,null,null,1,5,null,null,null,null,2,5,0,10,null,null,"Continuous",0,15,10,14,35,20,150]
["Otway Ranges","OtR","Heathy Woodland","OtR_0048",1,"LC","Least Concern","Forest/Woodland","Woody","Otway RangesHeathy Woodland","60",15,10,15,0,5,null,null,null,null,10,40,6,15,2,5,null,null,4,5,2,5,2,5,1,5,3,10,2,5,null,null,null,null,1,1,null,null,null,null,2,1,0,10,"0","10","Episodic",20,14,16,6,55,40,150]
["Otway Ranges","OtR","Herb-rich Foothill Forest","OtR_0023",1,"D","Depleted","Forest/Woodland","Woody","Otway RangesHerb-rich Foothill Forest","70",20,25,40,0,5,1,5,null,null,7,30,null,null,null,null,3,5,7,20,2,5,1,10,1,5,2,10,2,5,null,null,null,null,2,10,null,null,null,null,1,1,0,20,null,null,"Continuous",0,13,8,12,35,40,200]
["Otway Ranges","OtR","Lowland Forest","OtR_0016",1,"D","Depleted","Forest/Woodland","Woody","Otway RangesLowland Forest","70",20,25,20,0,5,1,10,null,null,8,45,3,5,1,1,null,null,3,5,null,null,2,5,1,15,1,1,1,5,null,null,null,null,2,10,null,null,null,null,1,1,0,10,null,null,"Continuous",0,13,12,3,60,40,200]
["Otway Ranges","OtR","Riparian Forest","OtR_0018",1,"LC","Least Concern","Forest/Woodland","Woody","Otway RangesRiparian Forest","80",20,30,40,0,5,4,30,null,null,4,20,null,null,null,null,2,5,3,5,null,null,2,5,1,5,null,null,null,null,null,null,null,null,4,25,"2","10","3","5",2,1,0,20,null,null,"Continuous",0,12,8,5,50,50,300]
["Otway Ranges","OtR","Scoria Cone Woodland","OtR_0894",1,"E","Endangered","Forest/Woodland","Woody","Otway RangesScoria Cone Woodland","50/70",15,15,15,0,5,1,5,null,null,2,10,null,null,null,null,3,5,6,10,3,5,1,15,null,null,4,15,1,5,null,null,null,null,2,20,null,null,null,null,null,null,0,10,"0","10","Continuous",0,12,3,12,15,20,100]
["Otway Ranges","OtR","Sedgy Riparian Woodland","OtR_0198",1,"V","Vulnerable","Forest/Woodland","Woody","Otway RangesSedgy Riparian Woodland","70",15,15,20,0,5,1,10,null,null,5,20,null,null,null,null,null,null,6,10,3,5,3,25,2,15,3,10,2,10,null,null,null,null,2,10,null,null,null,null,null,null,0,10,null,null,"Continuous",0,11,6,9,30,30,200]
["Otway Ranges","OtR","Shrubby Dry Forest","OtR_0021",1,"LC","Least Concern","Forest/Woodland","Woody","Otway RangesShrubby Dry Forest","60",20,25,30,0,5,null,null,null,null,7,40,2,5,null,null,null,null,5,10,2,5,1,5,2,10,5,15,1,1,null,null,null,null,null,null,null,null,null,null,null,null,0,10,null,null,"Episodic",20,10,9,7,45,20,200]
["Otway Ranges","OtR","Shrubby Foothill Forest","OtR_0045",1,"LC","Least Concern","Forest/Woodland","Woody","Otway RangesShrubby Foothill Forest","70",20,25,40,0,5,null,null,null,null,7,40,2,10,null,null,null,null,4,5,null,null,1,5,1,10,3,5,null,null,null,null,null,null,1,5,null,null,null,null,2,5,0,10,null,null,"Episodic",30,10,9,4,50,40,200]
["Otway Ranges","OtR","Shrubby Wet Forest","OtR_0201",1,"LC","Least Concern","Forest/Woodland","Woody","Otway RangesShrubby Wet Forest","90",20,30,40,0,5,4,30,null,null,6,20,null,null,null,null,2,1,4,5,1,1,1,5,1,10,1,1,null,null,null,null,null,null,3,15,"2","10",null,null,2,5,0,20,null,null,"Continuous",0,13,10,7,50,50,300]
["Otway Ranges","OtR","Swamp Scrub","OtR_0053",1.25,"E","Endangered","scrubs/shrublands/mallee without logs","Woody","Otway RangesSwamp Scrub","0",0,0,null,null,null,null,null,null,null,2,10,null,null,null,null,3,10,7,20,1,5,2,5,3,15,3,10,1,5,null,null,null,null,null,null,null,null,null,null,1,1,0,20,null,null,"Continuous",0,10,2,11,10,40,0]
["Otway Ranges","OtR","Swampy Riparian Woodland","OtR_0083",1,"E","Endangered","Forest/Woodland","Woody","Otway RangesSwampy Riparian Woodland","70",10,15,10,0,5,2,10,null,null,3,10,null,null,null,null,3,5,9,15,4,5,5,25,1,5,8,20,2,5,null,null,null,null,1,1,null,null,null,null,2,5,0,20,null,null,"Continuous",0,13,5,16,20,20,200]
["Otway Ranges","OtR","Wet Forest","OtR_0030",1,"LC","Least Concern","Forest/Woodland","Woody","Otway RangesWet Forest","90",20,30,40,0,5,4,25,null,null,4,20,null,null,null,null,1,1,1,5,null,null,1,5,1,10,null,null,null,null,null,null,null,null,3,20,"2","20","2","1",1,1,0,20,null,null,"Continuous",0,12,8,2,45,50,300]
["Otway Ranges","OtR","Wet Heathland","OtR_0008",1.36,"LC","Least Concern","heathlands","Woody","Otway RangesWet Heathland","0",0,0,null,null,null,null,null,null,null,5,55,3,5,null,null,1,1,2,20,null,null,2,10,null,null,1,10,2,20,null,null,null,null,2,10,null,null,null,null,1,1,0,20,null,null,"Episodic",30,10,8,3,60,20,0]
["Otway Ranges","OtR","Wet Sands Thicket","OtR_0233",1.36,"R","Rare","heathlands","Woody","Otway RangesWet Sands Thicket","0",0,0,null,null,null,null,null,null,null,5,50,2,5,1,5,null,null,null,null,null,null,2,5,1,25,null,null,null,null,null,null,null,null,2,5,"1","1",null,null,null,null,0,20,null,null,"Episodic",30,8,7,null,55,40,0]
["Robinvale Plains","RobP","Alluvial Plains Semi-arid Grassland","RobP0806",1.36,"V","Vulnerable","grasslands","Other grassland","Robinvale PlainsAlluvial Plains Semi-arid Grassland","0",0,0,null,null,null,null,null,null,null,1,5,3,5,null,null,3,5,6,10,3,5,null,null,null,null,3,50,null,null,null,null,null,null,null,null,null,null,null,null,null,null,null,null,"0","10","Episodic",5,7,4,12,10,5,0]
["Robinvale Plains","RobP","Chenopod Mallee","RobP0158",1,"V","Vulnerable","Forest/Woodland","Woody","Robinvale PlainsChenopod Mallee","20",20,12,20,0,5,null,null,null,null,1,5,8,40,null,null,null,null,3,5,2,10,null,null,null,null,null,null,null,null,null,null,null,null,null,null,null,null,null,null,null,null,0,10,"0","15","Continuous",0,7,9,5,45,10,200]
["Robinvale Plains","RobP","Dunefield Heathland","RobP0089",1.36,"TBC","TBC","heathlands","Woody","Robinvale PlainsDunefield Heathland","0",0,0,null,null,null,null,null,null,null,6,50,6,20,null,null,null,null,4,5,null,null,1,1,null,null,3,5,2,5,null,null,"1","1",null,null,null,null,null,null,null,null,null,null,"0","10",null,0,8,12,4,70,0,0]
["Robinvale Plains","RobP","Floodplain Grassy Wetland","RobP0809",1.36,"E","Endangered","wetlands","Non-woody wetland","Robinvale PlainsFloodplain Grassy Wetland","0",0,0,null,null,null,null,null,null,null,null,null,null,null,null,null,null,null,5,10,3,5,1,5,null,null,3,5,4,60,null,null,null,null,null,null,null,null,null,null,null,null,null,null,null,null,"Episodic",5,5,null,8,null,10,50]
["Robinvale Plains","RobP","Floodway Pond Herbland","RobP0810",1.36,"D","Depleted","wetlands","Non-woody wetland","Robinvale PlainsFloodway Pond Herbland","0",0,0,null,null,null,null,null,null,null,null,null,null,null,null,null,1,1,5,20,4,15,null,null,null,null,2,10,3,20,null,null,null,null,null,null,null,null,null,null,null,null,null,null,null,null,"Episodic",5,5,null,10,null,5,50]
["Robinvale Plains","RobP","Grassy Riverine Forest","RobP0106",1,"D","Depleted","Forest/Woodland","Woody","Robinvale PlainsGrassy Riverine Forest","90",20,25,30,0,5,2,10,null,null,null,null,null,null,null,null,3,5,7,10,1,5,null,null,null,null,2,15,1,1,null,null,null,null,null,null,null,null,null,null,null,null,0,10,null,null,"Continuous",0,8,2,11,10,40,300]
["Robinvale Plains","RobP","Intermittent Swampy Woodland","RobP0813",1,"D","Depleted","Forest/Woodland","Woody","Robinvale PlainsIntermittent Swampy Woodland","50/70",15,15,20,0,5,1,5,null,null,1,5,1,5,null,null,2,5,5,10,1,5,null,null,null,null,3,30,2,10,null,null,null,null,null,null,null,null,null,null,null,null,null,null,null,null,"Continuous",0,9,3,8,15,20,200]
["Robinvale Plains","RobP","Lake Bed Herbland","RobP0107",1.36,"D","Depleted","wetlands","Non-woody wetland","Robinvale PlainsLake Bed Herbland","0",0,0,null,null,null,null,null,null,null,2,5,2,5,null,null,null,null,3,25,3,20,null,null,null,null,2,5,null,null,null,null,null,null,null,null,null,null,null,null,null,null,null,null,null,null,"Episodic",10,5,4,6,10,5,0]
["Robinvale Plains","RobP","Lignum Shrubland","RobP0808",1.36,"LC","Least Concern","wetlands","Woody","Robinvale PlainsLignum Shrubland","0",0,0,null,null,null,null,null,null,null,2,30,3,10,null,null,1,1,6,10,5,5,null,null,1,10,2,20,null,null,null,null,null,null,null,null,null,null,null,null,null,null,null,null,"0","10","Continuous",0,8,5,12,40,10,0]
["Robinvale Plains","RobP","Lignum Swamp","RobP0104",1.36,"V","Vulnerable","wetlands","Woody","Robinvale PlainsLignum Swamp","0",0,0,null,null,null,null,null,null,null,1,20,null,null,null,null,4,5,8,25,2,10,null,null,1,5,2,5,2,5,null,null,null,null,null,null,null,null,null,null,1,1,null,null,"0","10","Continuous",0,9,1,14,20,5,0]
["Robinvale Plains","RobP","Lignum Swampy Woodland","RobP0823",1,"D","Depleted","Forest/Woodland","Woody","Robinvale PlainsLignum Swampy Woodland","50/70",15,15,20,0,5,null,null,null,null,2,30,1,5,null,null,2,1,8,10,4,10,null,null,1,5,2,5,3,15,null,null,null,null,null,null,null,null,null,null,null,null,null,null,"0","10","Continuous",0,10,3,14,35,10,100]
["Robinvale Plains","RobP","Loamy Sands Mallee","RobP0091",1.1499999999999999,"LC","Least Concern","scrubs/shrublands/mallee with logs","Woody","Robinvale PlainsLoamy Sands Mallee","0",0,5,25,null,null,null,null,null,null,5,20,5,10,null,null,2,1,6,10,2,1,1,1,null,null,3,5,null,null,null,null,"1","5",null,null,null,null,null,null,null,null,0,10,"0","10","Episodic",20,10,10,10,30,15,50]
["Robinvale Plains","RobP","Low Chenopod Shrubland","RobP0102",1.36,"D","Depleted","grasslands","Woody","Robinvale PlainsLow Chenopod Shrubland","0",0,0,null,null,null,null,null,null,null,1,5,7,20,1,5,2,1,10,25,4,15,null,null,null,null,2,5,1,5,null,null,null,null,null,null,null,null,null,null,null,null,0,10,"0","10","Continuous",0,10,8,16,25,20,0]
["Robinvale Plains","RobP","Plains Grassland","RobP0132",1.36,"E","Endangered","grasslands","Other grassland","Robinvale PlainsPlains Grassland","0",0,0,null,null,null,null,null,null,null,null,null,2,5,null,null,3,5,10,20,3,5,1,5,1,5,10,30,2,5,null,null,null,null,null,null,null,null,null,null,null,null,0,10,"0","20","Episodic",5,10,2,16,5,10,0]
["Robinvale Plains","RobP","Plains Woodland","RobP0803",1,"E","Endangered","Forest/Woodland","Woody","Robinvale PlainsPlains Woodland","40/70",15,15,15,null,null,null,null,null,null,3,10,1,5,2,10,3,1,9,10,5,10,1,1,null,null,4,20,2,1,null,null,null,null,null,null,null,null,null,null,1,1,0,10,"0","10","Continuous",0,12,4,17,15,10,100]
["Robinvale Plains","RobP","Ridged Plains Mallee","RobP0096",1,"E","Endangered","Forest/Woodland","Woody","Robinvale PlainsRidged Plains Mallee","30/40",15,10,10,0,5,null,null,null,null,3,5,3,10,1,1,2,5,5,10,5,15,1,5,1,1,3,20,1,1,null,null,null,null,null,null,null,null,null,null,null,null,0,10,"0","20","Continuous",0,13,6,12,15,5,50]
["Robinvale Plains","RobP","Riverine Chenopod Woodland","RobP0103",1,"D","Depleted","Forest/Woodland","Woody","Robinvale PlainsRiverine Chenopod Woodland","40",5,15,10,0,5,null,null,null,null,3,30,5,25,1,1,null,null,5,5,5,10,null,null,null,null,2,5,null,null,null,null,null,null,null,null,null,null,null,null,null,null,null,null,null,null,"Continuous",0,7,8,10,55,10,50]
["Robinvale Plains","RobP","Riverine Grassy Woodland","RobP0295",1,"D","Depleted","Forest/Woodland","Woody","Robinvale PlainsRiverine Grassy Woodland","80",15,20,20,0,5,null,null,null,null,null,null,4,10,null,null,4,10,2,10,5,10,1,1,null,null,5,20,2,5,null,null,null,null,null,null,null,null,null,null,null,null,0,10,null,null,"Continuous",0,9,4,11,10,10,200]
["Robinvale Plains","RobP","Sedgy Riverine Forest","RobP0816",1,"D","Depleted","Forest/Woodland","Woody","Robinvale PlainsSedgy Riverine Forest","80",20,25,30,0,5,null,null,null,null,1,10,null,null,null,null,null,null,2,5,2,5,1,50,null,null,2,10,2,10,null,null,null,null,null,null,null,null,null,null,null,null,null,null,null,null,"Episodic",10,7,1,4,10,10,200]
["Robinvale Plains","RobP","Semi-arid Chenopod Woodland","RobP0098",1,"V","Vulnerable","Forest/Woodland","Woody","Robinvale PlainsSemi-arid Chenopod Woodland","35/40",15,12,15,0,5,3,10,null,null,2,40,4,15,1,1,2,5,6,15,8,15,null,null,1,5,2,5,1,1,null,null,null,null,null,null,null,null,null,null,null,null,0,10,"0","30","Continuous",0,13,9,16,65,15,50]
["Robinvale Plains","RobP","Semi-arid Chenopod Woodland - non-treed","RobP0098_61",1.36,"V","Vulnerable","Forest/Woodland","Woody","Robinvale PlainsSemi-arid Chenopod Woodland - non-treed","0",0,0,null,null,null,null,null,null,null,2,40,4,15,1,1,2,5,6,15,8,15,null,null,1,5,2,5,1,1,null,null,null,null,null,null,null,null,null,null,null,null,0,10,"0","30","Continuous",0,11,6,16,55,5,0]
["Robinvale Plains","RobP","Semi-arid Parilla Woodland","RobP0828",1,"V","Vulnerable","Forest/Woodland","Woody","Robinvale PlainsSemi-arid Parilla Woodland","40",20,15,20,0,5,null,null,null,null,4,10,4,10,null,null,2,5,10,10,null,null,null,null,1,1,2,15,1,5,null,null,null,null,null,null,null,null,"1","1",null,null,0,5,"0","30","Continuous",0,11,8,12,20,10,120]
["Robinvale Plains","RobP","Semi-arid Woodland","RobP0097",1,"V","Vulnerable","Forest/Woodland","Woody","Robinvale PlainsSemi-arid Woodland","35/40",20,12,20,0,5,null,null,null,null,5,15,5,20,null,null,2,5,7,5,2,5,null,null,null,null,2,10,1,1,null,null,null,null,null,null,null,null,null,null,null,null,0,10,"0","20","Continuous",0,10,10,11,35,20,200]
["Robinvale Plains","RobP","Shallow Freshwater Marsh","RobP0200",1.36,"V","Vulnerable","wetlands","Non-woody wetland","Robinvale PlainsShallow Freshwater Marsh","0",null,0,null,null,null,null,null,null,null,null,null,null,null,null,null,null,null,null,null,null,null,null,null,null,null,null,null,null,null,null,null,null,null,null,null,null,null,null,null,null,null,null,null,null,null,null,5,0,null,null,null,null,0]
["Robinvale Plains","RobP","Shrubby Riverine Woodland","RobP0818",1,"LC","Least Concern","Forest/Woodland","Woody","Robinvale PlainsShrubby Riverine Woodland","50/80",5,15,10,0,5,1,5,null,null,2,10,2,5,null,null,4,10,5,10,2,1,null,null,null,null,2,10,null,null,null,null,null,null,null,null,null,null,null,null,null,null,null,null,null,null,"Continuous",0,8,5,11,20,10,100]
["Robinvale Plains","RobP","Spike-sedge Wetland","RobP0819",1.36,"V","Vulnerable","wetlands","Non-woody wetland","Robinvale PlainsSpike-sedge Wetland","0",0,0,null,null,null,null,null,null,null,null,null,null,null,null,null,1,5,6,15,4,5,null,null,null,null,2,10,2,50,null,null,null,null,null,null,null,null,null,null,null,null,null,null,null,null,"Episodic",5,5,null,11,null,20,50]
["Robinvale Plains","RobP","Sub-saline Depression Shrubland","RobP0820",1.36,"D","Depleted","wetlands","Non-woody wetland","Robinvale PlainsSub-saline Depression Shrubland","0",0,0,null,null,null,null,null,null,null,null,null,4,25,2,5,null,null,6,25,4,20,null,null,null,null,null,null,null,null,null,null,null,null,null,null,null,null,null,null,null,null,0,10,"0","20","Continuous",0,6,4,10,25,5,0]
["Robinvale Plains","RobP","Tall Marsh","RobP0821",1.36,"D","Depleted","wetlands","Non-woody wetland","Robinvale PlainsTall Marsh","0",0,0,null,null,null,null,null,null,null,null,null,null,null,null,null,null,null,6,20,3,10,1,10,3,40,null,null,2,10,null,null,null,null,null,null,null,null,null,null,null,null,null,null,null,null,"Episodic",1,5,null,9,null,10,50]
["Robinvale Plains","RobP","Woorinen Mallee","RobP0824",1,"V","Vulnerable","Forest/Woodland","Woody",{"$f":"CONCATENATE(A899,C899)","v":"Robinvale PlainsWoorinen Mallee"},"15",30,12,25,null,null,null,null,null,null,6,10,6,20,null,null,null,null,6,10,7,10,null,null,null,null,1,1,null,null,null,null,null,null,null,null,null,null,null,null,null,null,0,10,"0","15","Continuous",0,7,12,13,30,20,200]
["Robinvale Plains","RobP","Woorinen Sands Mallee","RobP0086",1,"D","Depleted","Forest/Woodland","Woody","Robinvale PlainsWoorinen Sands Mallee","15",30,7,25,null,null,null,null,null,null,4,5,2,10,1,5,null,null,6,5,6,5,null,null,null,null,3,5,1,1,null,null,"1","15",null,null,null,null,null,null,null,null,0,10,"0","10","Continuous",0,10,6,12,15,15,100]
["Strzelecki Ranges","Strz","Coast Banksia Woodland","Strz0002",1,"V","Vulnerable","Forest/Woodland","Woody","Strzelecki RangesCoast Banksia Woodland","50",10,15,15,0,5,2,15,null,null,3,30,null,null,null,null,2,1,3,15,2,10,1,1,null,null,2,1,null,null,null,null,null,null,1,5,null,null,null,null,1,5,0,10,null,null,"Episodic",30,11,5,7,45,40,100]
["Strzelecki Ranges","Strz","Coastal Headland Scrub","Strz0161",1.36,"V","Vulnerable","heathlands","Woody","Strzelecki RangesCoastal Headland Scrub","0",0,0,null,null,null,null,null,null,null,7,50,2,5,null,null,2,1,4,5,2,5,1,1,null,null,4,10,2,5,null,null,null,null,null,null,null,null,null,null,2,5,0,10,null,null,"Continuous",0,10,9,8,55,40,0]
["Strzelecki Ranges","Strz","Coastal Tussock Grassland","Strz0163",1.36,"D","Depleted","grasslands","Other grassland","Strzelecki RangesCoastal Tussock Grassland","0",0,0,null,null,null,null,null,null,null,3,20,1,5,1,1,2,5,5,10,3,5,3,10,null,null,4,25,2,5,null,null,null,null,null,null,null,null,null,null,null,null,0,10,"0","10","Continuous",0,11,4,10,25,20,0]
["Strzelecki Ranges","Strz","Cool Temperate Rainforest","Strz0031",1,"E","Endangered","Forest/Woodland","Woody","Strzelecki RangesCool Temperate Rainforest","70",20,0,50,0,5,2,10,null,null,2,5,null,null,null,null,2,5,2,5,null,null,null,null,null,null,null,null,null,null,null,null,null,null,6,15,"3","40","5","5",2,1,0,40,null,null,"Continuous",0,10,4,4,15,50,200]
["Strzelecki Ranges","Strz","Damp Forest","Strz0029",1,"E","Endangered","Forest/Woodland","Woody","Strzelecki RangesDamp Forest","90",20,30,40,0,5,4,20,null,null,6,30,1,1,null,null,2,1,8,10,1,1,1,1,1,5,3,10,2,5,null,null,null,null,3,10,"1","5",null,null,3,5,0,20,null,null,"Continuous",0,15,11,11,51,50,300]
["Strzelecki Ranges","Strz","Damp Heathy Woodland","Strz0793",1,"D","Depleted","Forest/Woodland","Woody","Strzelecki RangesDamp Heathy Woodland","60",10,10,15,0,5,null,null,null,null,5,30,4,5,2,1,null,null,3,5,3,20,2,5,null,null,3,10,1,5,null,null,null,null,1,5,null,null,null,null,null,null,0,20,"0","10","Episodic",30,12,9,6,35,20,100]
["Strzelecki Ranges","Strz","Grassy Forest","Strz0128",1,"E","Endangered","Forest/Woodland","Woody","Strzelecki RangesGrassy Forest","0",null,null,null,null,null,null,null,null,null,null,null,null,null,null,null,null,null,null,null,null,null,null,null,null,null,null,null,null,null,null,null,null,null,null,null,null,null,null,null,null,null,null,null,null,null,null,null,0,null,null,null,null,0]
["Strzelecki Ranges","Strz","Grassy Woodland","Strz0175",1,"E","Endangered","Forest/Woodland","Woody","Strzelecki RangesGrassy Woodland","0",null,null,null,null,null,null,null,null,null,null,null,null,null,null,null,null,null,null,null,null,null,null,null,null,null,null,null,null,null,null,null,null,null,null,null,null,null,null,null,null,null,null,null,null,null,null,null,0,null,null,null,null,0]
["Strzelecki Ranges","Strz","Heathy Woodland","Strz0048",1,"D","Depleted","Forest/Woodland","Woody","Strzelecki RangesHeathy Woodland","50",15,10,10,0,5,null,null,null,null,5,30,5,20,null,null,null,null,2,5,2,5,1,5,1,1,1,1,2,5,null,null,null,null,1,5,null,null,null,null,null,null,0,10,"0","10","Episodic",20,12,10,4,50,40,150]
["Strzelecki Ranges","Strz","Herb-rich Foothill Forest","Strz0023",1,"E","Endangered","Forest/Woodland","Woody","Strzelecki RangesHerb-rich Foothill Forest","70",20,25,40,0,5,2,15,null,null,5,20,null,null,null,null,3,5,9,15,2,5,3,15,2,5,3,10,2,5,null,null,null,null,2,10,null,null,null,null,3,5,0,20,null,null,"Continuous",0,13,7,14,35,40,200]
["Strzelecki Ranges","Strz","Lowland Forest","Strz0016",1,"V","Vulnerable","Forest/Woodland","Woody","Strzelecki RangesLowland Forest","70",20,25,30,0,5,2,10,null,null,8,35,4,10,1,1,null,null,6,10,3,5,3,10,2,10,3,5,2,5,null,null,null,null,2,15,null,null,null,null,3,5,0,10,null,null,"Continuous",0,14,14,9,55,40,200]
["Strzelecki Ranges","Strz","Plains Grassy Forest","Strz0151",1,"E","Endangered","Forest/Woodland","Woody","Strzelecki RangesPlains Grassy Forest","70",20,20,30,0,5,3,15,null,null,6,20,3,5,2,5,3,5,6,10,2,5,2,10,1,5,4,15,2,1,null,null,null,null,2,10,null,null,null,null,null,null,0,10,null,null,"Continuous",0,14,12,11,40,20,200]
["Strzelecki Ranges","Strz","Plains Grassy Woodland","Strz0055",1,"E","Endangered","Forest/Woodland","Woody","Strzelecki RangesPlains Grassy Woodland","80",10,15,20,0,5,1,5,null,null,2,10,1,1,1,1,1,5,10,20,3,5,2,5,1,10,9,35,2,10,null,null,null,null,null,null,null,null,null,null,null,null,0,10,null,null,"Continuous",0,13,4,14,16,10,100]
["Strzelecki Ranges","Strz","Riparian Forest","Strz0018",1,"V","Vulnerable","Forest/Woodland","Woody","Strzelecki RangesRiparian Forest","80",20,30,40,0,5,4,20,null,null,8,20,1,1,1,1,2,1,6,10,2,1,3,10,2,5,3,5,1,5,null,null,null,null,5,20,"2","10",null,null,3,5,0,20,null,null,"Continuous",0,16,13,10,41,50,300]
["Strzelecki Ranges","Strz","Riparian Scrub","Strz0191",1.25,"V","Vulnerable","scrubs/shrublands/mallee without logs","Woody","Strzelecki RangesRiparian Scrub","0",0,0,null,null,null,null,null,null,null,3,10,1,1,null,null,2,5,1,1,1,1,3,10,1,5,1,1,3,15,null,null,null,null,1,5,null,null,null,null,null,null,0,20,null,null,"Continuous",0,11,4,4,11,40,0]
["Strzelecki Ranges","Strz","Sand Heathland","Strz0006",1.36,"TBC","TBC","heathlands","Woody","Strzelecki RangesSand Heathland","0",0,0,null,null,null,null,null,null,null,7,55,4,10,null,null,null,null,3,5,2,5,1,5,1,1,2,5,2,15,null,null,null,null,1,1,null,null,null,null,null,null,0,10,"0","10","Episodic",30,11,11,5,65,20,0]
["Strzelecki Ranges","Strz","Shrubby Foothill Forest","Strz0045",1,"E","Endangered","Forest/Woodland","Woody","Strzelecki RangesShrubby Foothill Forest","70",20,25,40,0,5,1,5,null,null,8,35,4,15,1,5,null,null,3,5,1,1,1,5,1,10,2,5,null,null,null,null,null,null,2,10,null,null,null,null,1,1,0,10,"0","10","Episodic",30,14,13,4,55,40,200]
["Strzelecki Ranges","Strz","Swamp Scrub","Strz0053",1.25,"E","Endangered","scrubs/shrublands/mallee without logs","Woody","Strzelecki RangesSwamp Scrub","0",0,0,70,null,null,null,null,null,null,2,10,2,1,null,null,2,1,3,15,2,5,2,10,3,10,2,5,2,15,null,null,null,null,1,5,null,null,null,null,1,1,0,20,null,null,"Continuous",0,12,4,7,11,40,0]
["Strzelecki Ranges","Strz","Swampy Riparian Woodland","Strz0083",1,"E","Endangered","Forest/Woodland","Woody","Strzelecki RangesSwampy Riparian Woodland","70",15,15,20,0,5,4,30,null,null,5,20,1,1,1,1,3,5,7,10,3,5,3,15,1,5,5,10,2,5,null,null,null,null,2,5,null,null,null,null,null,null,0,10,null,null,"Continuous",0,14,10,13,51,20,200]
["Strzelecki Ranges","Strz","Swampy Woodland","Strz0937",1,"E","Endangered","Forest/Woodland","Woody","Strzelecki RangesSwampy Woodland","70",15,15,15,0,5,1,5,null,null,2,20,null,null,null,null,null,null,5,10,3,10,4,30,2,10,4,10,null,null,null,null,null,null,null,null,null,null,null,null,null,null,0,20,null,null,"Continuous",0,9,3,8,25,20,150]
["Strzelecki Ranges","Strz","Warm Temperate Rainforest","Strz0032",1,"E","Endangered","Forest/Woodland","Woody","Strzelecki RangesWarm Temperate Rainforest","70",20,25,50,null,null,3,30,null,null,2,15,null,null,null,null,1,1,3,5,1,1,2,5,1,1,null,null,2,5,null,null,null,null,4,15,"2","5","1","1",3,20,0,20,null,null,"Continuous",0,13,5,5,45,50,200]
["Strzelecki Ranges","Strz","Wet Forest","Strz0030",1,"D","Depleted","Forest/Woodland","Woody","Strzelecki RangesWet Forest","90",20,30,40,0,5,4,30,null,null,3,15,null,null,null,null,null,null,3,5,null,null,1,5,1,10,null,null,null,null,null,null,null,null,4,20,"2","20","2","1",2,5,0,20,null,null,"Continuous",0,11,7,3,45,50,300]
["Strzelecki Ranges","Strz","Wet Heathland","Strz0008",1.36,"V","Vulnerable","heathlands","Woody","Strzelecki RangesWet Heathland","0",0,0,null,null,null,null,null,null,null,6,40,3,5,1,1,null,null,3,5,2,5,1,5,2,10,2,5,3,20,null,null,null,null,1,5,null,null,null,null,null,null,0,20,null,null,"Episodic",30,11,9,5,45,20,0]
["Strzelecki Ranges","Strz","Wet Sands Thicket","Strz0233",1.36,"R","Rare","heathlands","Woody","Strzelecki RangesWet Sands Thicket","0",0,0,null,null,null,null,null,null,null,5,50,4,10,null,null,null,null,2,1,1,1,1,5,null,null,1,1,1,1,null,null,null,null,1,1,null,null,null,null,1,1,0,10,null,null,"Episodic",30,10,9,3,60,40,0]
["Strzelecki Ranges","Strz","Wetland Formation","Strz0074",1.36,"TBC","TBC","wetlands","Non-woody wetland","Strzelecki RangesWetland Formation","0",null,0,null,null,null,null,null,null,null,null,null,null,null,null,null,null,null,null,null,null,null,null,null,null,null,null,null,null,null,null,null,null,null,null,null,null,null,null,null,null,null,null,null,null,null,null,5,0,null,null,null,null,0]
["Victorian Alps","VAlp","Alpine Damp Grassland","VAlp1002",1.36,"R","Rare","grasslands","Other grassland","Victorian AlpsAlpine Damp Grassland","0",0,0,null,null,null,null,null,null,null,null,null,null,null,null,null,null,null,null,null,null,null,null,null,null,null,null,null,null,null,null,null,null,null,null,null,null,null,null,null,null,null,null,null,null,null,null,0,0,null,null,null,0,0]
["Victorian Alps","VAlp","Alpine Fen","VAlp0171",1.36,"E","Endangered","wetlands","Non-woody wetland","Victorian AlpsAlpine Fen","0",0,0,null,null,null,null,null,null,null,null,null,null,null,null,null,null,null,null,null,null,null,null,null,null,null,null,null,null,null,null,null,null,null,null,null,null,null,null,null,null,null,null,null,null,null,null,0,0,null,null,null,0,0]
["Victorian Alps","VAlp","Alpine Grassland","VAlp1001",1.36,"R","Rare","grasslands","Other grassland","Victorian AlpsAlpine Grassland","0",0,0,null,null,null,null,null,null,null,null,null,null,null,null,null,null,null,null,null,null,null,null,null,null,null,null,null,null,null,null,null,null,null,null,null,null,null,null,null,null,null,null,null,null,null,null,0,0,null,null,null,0,0]
["Victorian Alps","VAlp","Alpine Valley Bog","VAlp0288",1.36,"E","Endangered","wetlands","Non-woody wetland","Victorian AlpsAlpine Valley Bog","0",0,0,null,null,null,null,null,null,null,null,null,null,null,null,null,null,null,null,null,null,null,null,null,null,null,null,null,null,null,null,null,null,null,null,null,null,null,null,null,null,null,null,null,null,null,null,0,0,null,null,null,0,0]
["Victorian Alps","VAlp","Blackthorn Scrub","VAlp0027",1.25,"R","Rare","scrubs/shrublands/mallee without logs","Woody","Victorian AlpsBlackthorn Scrub","0",0,0,null,0,5,null,null,null,null,5,20,null,null,null,null,null,null,2,1,null,null,null,null,null,null,3,5,1,1,null,null,null,null,2,5,null,null,"2","1",2,1,0,10,"0","10","Continuous",0,10,5,2,20,40,100]
["Victorian Alps","VAlp","Cool Temperate Rainforest","VAlp0031",1,"E","Endangered","Forest/Woodland","Woody","Victorian AlpsCool Temperate Rainforest","70",20,25,50,0,5,1,10,null,null,3,10,1,5,null,null,1,1,4,5,2,1,1,1,null,null,2,10,null,null,null,null,null,null,5,25,"1","10",null,null,null,null,0,40,null,null,"Continuous",0,12,5,7,25,50,200]
["Victorian Alps","VAlp","Damp Forest","VAlp0029",1,"LC","Least Concern","Forest/Woodland","Woody","Victorian AlpsDamp Forest","90",20,30,40,0,5,3,25,null,null,3,20,null,null,null,null,1,1,5,10,2,5,null,null,null,null,1,15,null,null,null,null,null,null,2,20,"1","5",null,null,1,5,0,20,null,null,"Continuous",0,11,6,8,45,50,300]
["Victorian Alps","VAlp","Dry Valley Forest","VAlp0169",1,"V","Vulnerable","Forest/Woodland","Woody","Victorian AlpsDry Valley Forest","70",20,20,30,0,5,4,15,null,null,9,30,3,10,1,1,4,5,11,15,3,5,3,5,null,null,4,15,1,1,null,null,null,null,3,10,"1","5",null,null,2,5,0,10,null,null,"Continuous",0,15,16,18,55,40,200]
["Victorian Alps","VAlp","Granitic Hills Woodland","VAlp0072",1,"LC","Least Concern","Forest/Woodland","Woody","Victorian AlpsGranitic Hills Woodland","60",15,10,15,0,5,1,5,null,null,4,20,3,20,null,null,2,5,11,20,null,null,null,null,null,null,4,5,3,5,null,null,null,null,1,1,null,null,null,null,null,null,0,10,null,null,"Continuous",0,10,8,13,45,20,150]
["Victorian Alps","VAlp","Grassy Dry Forest","VAlp0022",1,"LC","Least Concern","Forest/Woodland","Woody","Victorian AlpsGrassy Dry Forest","60",20,20,30,0,5,1,5,null,null,4,10,3,5,2,1,3,5,11,20,3,5,1,5,null,null,7,20,2,5,null,null,null,null,1,5,null,null,null,null,1,1,0,10,"0","10","Continuous",0,15,8,17,20,20,200]
["Victorian Alps","VAlp","Grassy Woodland","VAlp0175",1,"D","Depleted","Forest/Woodland","Woody","Victorian AlpsGrassy Woodland","60",15,15,20,0,5,1,5,null,null,4,10,1,1,null,null,5,10,7,20,3,5,1,1,null,null,7,30,1,1,null,null,null,null,1,1,null,null,null,null,1,5,0,10,null,null,"Continuous",0,13,6,15,16,20,150]
["Victorian Alps","VAlp","Heathy Dry Forest","VAlp0020",1,"LC","Least Concern","Forest/Woodland","Woody","Victorian AlpsHeathy Dry Forest","60",20,20,30,0,5,1,5,null,null,8,30,2,5,3,15,2,1,4,5,null,null,1,5,null,null,6,20,null,null,null,null,null,null,1,1,null,null,null,null,null,null,0,10,"0","10","Episodic",20,12,11,6,40,20,200]
["Victorian Alps","VAlp","Herb-rich Foothill Forest","VAlp0023",1,"LC","Least Concern","Forest/Woodland","Woody","Victorian AlpsHerb-rich Foothill Forest","70",20,25,40,0,5,2,10,null,null,6,20,3,10,2,5,4,5,12,20,2,5,2,5,null,null,6,20,1,5,null,null,null,null,2,15,null,null,null,null,1,5,0,20,null,null,"Continuous",0,14,11,18,40,40,200]
["Victorian Alps","VAlp","Late-lying Snowpatch Herbland","VAlp1014",1.36,"E","Endangered","grasslands","Non-woody wetland","Victorian AlpsLate-lying Snowpatch Herbland","0",0,0,null,null,null,null,null,null,null,null,null,null,null,null,null,null,null,null,null,null,null,null,null,null,null,null,null,null,null,null,null,null,null,null,null,null,null,null,null,null,null,null,null,null,null,null,0,0,null,null,null,0,0]
["Victorian Alps","VAlp","Montane Damp Forest","VAlp0038",1,"LC","Least Concern","Forest/Woodland","Woody","Victorian AlpsMontane Damp Forest","90",20,30,40,0,5,2,15,null,null,7,25,3,10,null,null,3,5,10,15,2,5,1,5,null,null,6,15,1,1,null,null,null,null,2,10,null,null,null,null,1,5,0,20,null,null,"Continuous",0,13,12,15,50,50,300]
["Victorian Alps","VAlp","Montane Dry Woodland","VAlp0036",1,"LC","Least Concern","Forest/Woodland","Woody","Victorian AlpsMontane Dry Woodland","50",15,15,20,0,5,2,20,"1","1",6,20,2,5,null,null,2,5,9,20,2,5,2,5,null,null,6,15,1,5,null,null,null,null,1,5,null,null,null,null,null,null,0,10,"0","10","Continuous",0,14,10,13,45,20,150]
["Victorian Alps","VAlp","Montane Grassy Woodland","VAlp0037",1,"LC","Least Concern","Forest/Woodland","Woody","Victorian AlpsMontane Grassy Woodland","50",15,10,20,0,5,1,5,null,null,6,20,3,10,2,5,2,5,15,20,3,10,2,5,null,null,7,20,1,1,null,null,null,null,1,1,null,null,null,null,null,null,0,10,"0","10","Continuous",0,14,10,20,35,20,150]
["Victorian Alps","VAlp","Montane Herb-rich Woodland","VAlp0319",1,"LC","Least Concern","Forest/Woodland","Woody","Victorian AlpsMontane Herb-rich Woodland","70",15,25,40,0,5,2,10,null,null,6,15,2,5,1,1,5,10,12,20,3,5,1,5,null,null,8,20,1,1,null,null,null,null,3,10,null,null,null,null,2,5,0,20,null,null,"Continuous",0,14,10,20,30,20,150]
["Victorian Alps","VAlp","Montane Riparian Thicket","VAlp0041",1.25,"LC","Least Concern","scrubs/shrublands/mallee without logs","Woody","Victorian AlpsMontane Riparian Thicket","0",0,0,null,null,null,null,null,null,null,1,5,null,null,null,null,null,null,null,null,1,1,2,40,null,null,2,1,null,null,null,null,null,null,3,20,"1","5","2","1",null,null,0,20,null,null,"Continuous",0,8,1,1,5,40,50]
["Victorian Alps","VAlp","Montane Riparian Woodland","VAlp0040",1,"LC","Least Concern","Forest/Woodland","Woody","Victorian AlpsMontane Riparian Woodland","60",0,0,null,null,null,1,10,null,null,3,15,3,5,null,null,4,10,12,20,4,10,3,5,1,1,6,30,3,5,null,null,null,null,2,5,null,null,null,null,null,null,0,20,null,null,"Continuous",0,12,7,20,30,40,150]
["Victorian Alps","VAlp","Montane Riparian Woodland - treed","VAlp0040_61",1,"LC","Least Concern","Forest/Woodland","Woody","Victorian AlpsMontane Riparian Woodland - treed","60",10,10,15,0,5,1,10,null,null,3,15,3,5,null,null,4,10,12,20,4,10,3,5,1,1,6,30,3,5,null,null,null,null,2,5,null,null,null,null,null,null,0,20,null,null,"Continuous",0,13,7,20,30,40,150]
["Victorian Alps","VAlp","Montane Rocky Shrubland","VAlp0192",1.25,"LC","Least Concern","scrubs/shrublands/mallee without logs","Woody","Victorian AlpsMontane Rocky Shrubland","0",0,0,null,null,null,null,null,null,null,8,40,2,5,1,1,5,5,7,5,3,5,2,5,null,null,4,5,1,1,null,null,null,null,3,5,null,null,null,null,1,1,0,20,null,null,"Episodic",30,12,10,15,45,40,0]
["Victorian Alps","VAlp","Montane Wet Forest","VAlp0039",1,"LC","Least Concern","Forest/Woodland","Woody","Victorian AlpsMontane Wet Forest","90",20,30,40,0,5,5,20,null,null,5,25,null,null,null,null,2,5,5,15,2,1,1,1,1,1,1,5,null,null,null,null,null,null,3,25,"2","5",null,null,2,1,0,20,null,null,"Continuous",0,13,10,9,45,50,300]
["Victorian Alps","VAlp","Riparian Forest","VAlp0018",1,"LC","Least Concern","Forest/Woodland","Woody","Victorian AlpsRiparian Forest","90",20,30,40,0,5,3,20,null,null,7,30,2,5,2,1,5,10,16,20,4,10,null,null,null,null,8,10,4,5,null,null,null,null,3,10,null,null,null,null,null,null,0,20,null,null,"Continuous",0,12,12,25,55,50,300]
["Victorian Alps","VAlp","Riparian Shrubland","VAlp0019",1.25,"R","Rare","scrubs/shrublands/mallee without logs","Woody","Victorian AlpsRiparian Shrubland","0",0,0,null,null,null,null,null,null,null,9,20,null,null,null,null,null,null,2,5,null,null,1,10,null,null,4,5,1,1,null,null,null,null,4,10,"2","1",null,null,2,5,0,20,null,null,"Continuous",0,9,9,2,20,40,100]
["Victorian Alps","VAlp","Riverine Escarpment Scrub","VAlp0082",1.25,"V","Vulnerable","scrubs/shrublands/mallee without logs","Woody","Victorian AlpsRiverine Escarpment Scrub","0",0,0,null,0,5,null,null,null,null,8,30,2,1,1,1,2,5,12,20,3,5,4,15,null,null,3,10,2,5,null,null,null,null,3,10,null,null,null,null,1,5,0,10,null,null,"Continuous",0,13,10,17,31,40,50]
["Victorian Alps","VAlp","Rocky Outcrop Shrubland","VAlp0028",1.36,"R","Rare","heathlands","Woody","Victorian AlpsRocky Outcrop Shrubland","0",0,0,null,null,null,null,null,null,null,7,30,2,5,1,1,2,5,2,1,null,null,null,null,null,null,4,5,1,1,null,null,null,null,1,1,null,null,null,null,1,1,0,20,"0","10","Continuous",0,11,9,4,35,40,0]
["Victorian Alps","VAlp","Shrubby Damp Forest","VAlp0316",1,"LC","Least Concern","Forest/Woodland","Woody","Victorian AlpsShrubby Damp Forest","90",20,25,40,0,5,4,20,null,null,8,20,2,10,1,1,4,5,8,15,2,5,2,5,1,1,3,10,1,5,null,null,null,null,2,15,"1","1",null,null,2,5,0,20,null,null,"Continuous",0,16,14,14,50,50,300]
["Victorian Alps","VAlp","Shrubby Dry Forest","VAlp0021",1,"LC","Least Concern","Forest/Woodland","Woody","Victorian AlpsShrubby Dry Forest","60",20,25,30,0,5,1,5,"1","5",8,40,2,5,2,5,3,5,5,10,null,null,2,5,null,null,4,10,1,1,null,null,null,null,null,null,null,null,null,null,null,null,0,10,"0","10","Episodic",20,13,11,8,50,20,200]
["Victorian Alps","VAlp","Shrubby Foothill Forest","VAlp0045",1,"LC","Least Concern","Forest/Woodland","Woody","Victorian AlpsShrubby Foothill Forest","70",20,25,40,0,5,1,5,null,null,8,35,2,10,2,5,2,5,1,1,1,1,null,null,null,null,3,5,null,null,null,null,null,null,null,null,null,null,"1","1",1,0,0,10,null,null,"Episodic",30,12,11,4,50,40,200]
["Victorian Alps","VAlp","Shrubby Wet Forest","VAlp0201",1,"LC","Least Concern","Forest/Woodland","Woody","Victorian AlpsShrubby Wet Forest","90",20,30,40,0,5,2,20,null,null,7,25,3,10,null,null,2,1,8,15,2,1,1,1,null,null,6,15,1,1,null,null,null,null,2,5,null,null,null,null,null,null,0,20,null,null,"Continuous",0,12,12,12,55,50,300]
["Victorian Alps","VAlp","Snowpatch Grassland","VAlp1012",1.36,"V","Vulnerable","grasslands","Other grassland","Victorian AlpsSnowpatch Grassland","0",0,0,null,null,null,null,null,null,null,null,null,null,null,null,null,null,null,null,null,null,null,null,null,null,null,null,null,null,null,null,null,null,null,null,null,null,null,null,null,null,null,null,null,null,null,null,0,0,null,null,null,0,0]
["Victorian Alps","VAlp","Sub-alpine Dry Shrubland","VAlp1003",1.25,"R","Rare","scrubs/shrublands/mallee without logs","Woody","Victorian AlpsSub-alpine Dry Shrubland","0",0,0,null,null,null,null,null,null,null,null,null,null,null,null,null,null,null,null,null,null,null,null,null,null,null,null,null,null,null,null,null,null,null,null,null,null,null,null,null,null,null,null,null,null,null,null,0,0,null,null,null,0,0]
["Victorian Alps","VAlp","Sub-alpine Grassland","VAlp0206",1.36,"TBC","TBC","grasslands","Other grassland","Victorian AlpsSub-alpine Grassland","0",0,0,null,null,null,null,null,null,null,1,5,3,5,1,1,3,5,11,20,3,10,1,1,null,null,5,20,2,10,null,null,null,null,null,null,null,null,null,null,null,null,0,20,"0","10","Continuous",0,11,4,17,10,10,0]
["Victorian Alps","VAlp","Sub-alpine Riparian Shrubland","VAlp0208",1.25,"R","Rare","scrubs/shrublands/mallee without logs","Woody","Victorian AlpsSub-alpine Riparian Shrubland","0",0,0,null,null,null,null,null,null,null,null,null,null,null,null,null,null,null,null,null,null,null,null,null,null,null,null,null,null,null,null,null,null,null,null,null,null,null,null,null,null,null,null,null,null,null,null,0,0,null,null,null,0,0]
["Victorian Alps","VAlp","Sub-alpine Shrubland","VAlp0042",1.25,"R","Rare","scrubs/shrublands/mallee without logs","Woody","Victorian AlpsSub-alpine Shrubland","0",0,0,null,null,null,null,null,null,null,6,40,4,15,2,1,3,5,8,15,2,5,null,null,null,null,5,20,1,5,null,null,null,null,null,null,null,null,null,null,null,null,0,20,null,null,"Continuous",0,9,10,13,55,40,100]
["Victorian Alps","VAlp","Sub-alpine Wet Heathland","VAlp0210",1.36,"E","Endangered","heathlands","Woody","Victorian AlpsSub-alpine Wet Heathland","0",0,0,null,null,null,null,null,null,null,4,15,3,10,1,1,1,1,8,15,4,10,1,1,null,null,4,10,2,15,null,null,null,null,1,1,null,null,null,null,null,null,0,40,null,null,"Episodic",30,11,7,13,25,10,0]
["Victorian Alps","VAlp","Sub-alpine Woodland","VAlp0043",1,"LC","Least Concern","Forest/Woodland","Woody",{"$f":"CONCATENATE(A963,C963)","v":"Victorian AlpsSub-alpine Woodland"},"40",15,10,15,0,5,1,5,null,null,5,20,2,10,null,null,3,10,8,20,2,5,null,null,null,null,4,20,1,5,null,null,null,null,1,1,null,null,null,null,null,null,0,20,"0","10","Continuous",0,12,8,13,35,20,100]
["Victorian Alps","VAlp","Swampy Riparian Woodland","VAlp0083",1,"V","Vulnerable","Forest/Woodland","Woody","Victorian AlpsSwampy Riparian Woodland","70",10,15,20,0,5,2,15,null,null,5,10,1,1,null,null,3,5,8,15,4,5,5,30,2,5,3,5,3,5,null,null,null,null,4,10,null,null,null,null,1,1,0,20,null,null,"Continuous",0,14,8,15,26,20,200]
["Victorian Alps","VAlp","Tableland Damp Forest","VAlp0035",1,"LC","Least Concern","Forest/Woodland","Woody","Victorian AlpsTableland Damp Forest","90",20,30,40,0,5,3,20,null,null,7,20,2,10,null,null,2,5,8,15,2,15,1,5,1,1,3,15,1,5,null,null,null,null,2,5,null,null,null,null,null,null,0,20,null,null,"Continuous",0,13,12,12,50,50,300]
["Victorian Alps","VAlp","Wet Forest","VAlp0030",1,"LC","Least Concern","Forest/Woodland","Woody","Victorian AlpsWet Forest","90",20,30,40,0,5,3,25,null,null,7,15,null,null,null,null,2,5,6,10,1,1,1,1,null,null,2,5,null,null,null,null,null,null,4,25,"1","15",null,null,1,5,0,20,null,null,"Continuous",0,12,10,9,40,50,300]
["Victorian Riverina","VRiv","Alluvial Terraces Herb-rich Woodland","VRiv0067",1,"V","Vulnerable","Forest/Woodland","Woody","Victorian RiverinaAlluvial Terraces Herb-rich Woodland","70",10,15,15,0,5,1,5,null,null,5,5,2,5,null,null,2,5,11,20,3,5,1,1,null,null,15,30,2,5,null,null,null,null,null,null,null,null,null,null,null,null,0,10,"0","10","Continuous",0,12,8,16,15,10,150]
["Victorian Riverina","VRiv","Box Ironbark Forest","VRiv0061",1,"V","Vulnerable","Forest/Woodland","Woody","Victorian RiverinaBox Ironbark Forest","70",15,20,20,0,5,null,null,null,null,5,20,3,5,null,null,2,5,5,10,null,null,1,1,null,null,5,15,null,null,null,null,null,null,null,null,null,null,null,null,1,1,0,10,"0","20","Continuous",0,10,8,7,25,20,200]
["Victorian Riverina","VRiv","Cane Grass Wetland","VRiv0291",1.36,"V","Vulnerable","wetlands","Non-woody wetland","Victorian RiverinaCane Grass Wetland","0",null,null,null,null,null,null,null,null,null,null,null,null,null,null,null,null,null,null,null,null,null,null,null,null,null,null,null,null,null,null,null,null,null,null,null,null,null,null,null,null,null,null,null,null,null,null,null,0,null,null,null,null,0]
["Victorian Riverina","VRiv","Chenopod Grassland","VRiv0829",1.36,"E","Endangered","grasslands","Other grassland","Victorian RiverinaChenopod Grassland","0",0,0,null,null,null,null,null,null,null,2,20,6,30,2,1,2,5,4,10,4,5,null,null,null,null,3,20,null,null,null,null,null,null,null,null,null,null,null,null,null,null,0,10,"0","20","Continuous",0,9,8,10,50,5,0]
["Victorian Riverina","VRiv","Chenopod Mallee","VRiv0158",1,"V","Vulnerable","Forest/Woodland","Woody","Victorian RiverinaChenopod Mallee","0",0,0,null,null,null,null,null,null,null,null,null,null,null,null,null,null,null,null,null,null,null,null,null,null,null,null,null,null,null,null,null,null,null,null,null,null,null,null,null,null,null,null,null,null,null,null,0,0,null,null,null,0,0]
["Victorian Riverina","VRiv","Creekline Grassy Woodland","VRiv0068",1,"E","Endangered","Forest/Woodland","Woody","Victorian RiverinaCreekline Grassy Woodland","80",15,15,15,0,5,1,5,null,null,4,10,3,5,null,null,2,5,9,15,3,5,2,10,1,5,16,35,3,5,null,null,null,null,null,null,null,null,null,null,null,null,0,10,null,null,"Continuous",0,12,8,14,20,40,300]
["Victorian Riverina","VRiv","Damp Sands Herb-rich Woodland","VRiv0003",1,"E","Endangered","Forest/Woodland","Woody","Victorian RiverinaDamp Sands Herb-rich Woodland","70",15,15,15,0,5,2,10,null,null,2,5,1,1,null,null,3,5,8,15,2,5,3,10,null,null,8,25,2,5,null,null,null,null,1,5,null,null,null,null,null,null,0,10,"0","10","Continuous",0,13,5,13,16,40,100]
["Victorian Riverina","VRiv","Floodplain Riparian Woodland","VRiv0056",1,"V","Vulnerable","Forest/Woodland","Woody","Victorian RiverinaFloodplain Riparian Woodland","80",15,20,20,0,5,1,5,null,null,2,5,1,1,null,null,null,null,4,10,2,1,2,10,1,5,6,35,2,10,null,null,null,null,null,null,null,null,null,null,null,null,0,10,null,null,"Episodic",10,11,4,6,11,40,300]
["Victorian Riverina","VRiv","Floodway Pond Herbland","VRiv0810",1.36,"V","Vulnerable","wetlands","Non-woody wetland","Victorian RiverinaFloodway Pond Herbland","0",0,0,null,null,null,null,null,null,null,null,null,null,null,null,null,1,1,5,20,4,15,null,null,null,null,2,10,3,20,null,null,null,null,null,null,null,null,null,null,null,null,null,null,null,null,null,0,5,null,10,null,5,50]
["Victorian Riverina","VRiv","Granitic Hills Woodland","VRiv0072",1,"E","Endangered","Forest/Woodland","Woody","Victorian RiverinaGranitic Hills Woodland","30/50",15,10,15,0,5,null,null,null,null,7,20,3,5,null,null,4,5,11,15,2,1,null,null,null,null,6,5,2,1,null,null,null,null,2,1,null,null,null,null,null,null,0,10,"0","10","Continuous",0,11,10,17,25,20,150]
["Victorian Riverina","VRiv","Grassy Dry Forest","VRiv0022",1,"D","Depleted","Forest/Woodland","Woody","Victorian RiverinaGrassy Dry Forest","40/60",20,20,30,0,5,2,5,null,null,5,10,4,5,1,1,3,1,5,15,2,1,1,1,null,null,8,25,1,1,null,null,null,null,2,1,null,null,null,null,1,1,0,10,"0","10","Continuous",0,15,11,10,20,20,200]
["Victorian Riverina","VRiv","Grassy Riverine Forest","VRiv0106",1,"D","Depleted","Forest/Woodland","Woody","Victorian RiverinaGrassy Riverine Forest","90",20,25,30,0,5,1,10,null,null,null,null,null,null,null,null,2,10,3,10,null,null,null,null,null,null,3,25,3,10,null,null,null,null,null,null,null,null,null,null,null,null,0,10,null,null,"Continuous",0,7,1,5,10,40,300]
["Victorian Riverina","VRiv","Heathy Dry Forest","VRiv0020",1,"LC","Least Concern","Forest/Woodland","Woody","Victorian RiverinaHeathy Dry Forest","60",20,20,30,0,5,1,5,null,null,6,20,6,20,1,1,3,5,7,15,2,1,2,15,null,null,6,15,1,1,null,null,null,null,null,null,null,null,null,null,null,null,0,10,"0","10","Episodic",20,13,13,12,45,20,200]
["Victorian Riverina","VRiv","Herb-rich Foothill Forest","VRiv0023",1,"D","Depleted","Forest/Woodland","Woody","Victorian RiverinaHerb-rich Foothill Forest","70",20,30,40,0,5,2,10,null,null,3,10,3,5,2,5,3,5,13,25,4,5,2,5,null,null,6,20,1,1,null,null,null,null,1,5,null,null,null,null,2,1,0,20,null,null,"Continuous",0,14,8,20,25,40,200]
["Victorian Riverina","VRiv","Intermittent Swampy Woodland","VRiv0813",1,"D","Depleted","Forest/Woodland","Woody","Victorian RiverinaIntermittent Swampy Woodland","50/70",15,15,20,0,5,1,5,null,null,1,5,1,5,null,null,2,5,5,10,1,5,null,null,null,null,3,30,2,10,null,null,null,null,null,null,null,null,null,null,null,null,null,null,null,null,"Continuous",0,9,3,8,15,20,200]
["Victorian Riverina","VRiv","Lake Bed Herbland","VRiv0107",1.36,"D","Depleted","wetlands","Non-woody wetland","Victorian RiverinaLake Bed Herbland","0",0,0,null,null,null,null,null,null,null,2,5,2,5,null,null,null,null,3,25,3,20,null,null,null,null,null,null,null,null,null,null,null,null,null,null,null,null,null,null,null,null,null,null,null,null,"Episodic",10,4,4,6,10,5,0]
["Victorian Riverina","VRiv","Lignum Swamp","VRiv0104",1.36,"V","Vulnerable","wetlands","Woody","Victorian RiverinaLignum Swamp","0",0,0,null,null,null,null,null,null,null,1,20,null,null,null,null,4,5,8,25,2,10,null,null,1,5,2,5,2,5,null,null,null,null,null,null,null,null,null,null,1,1,null,null,"0","10","Continuous",0,9,1,14,20,5,0]
["Victorian Riverina","VRiv","Lignum Swampy Woodland","VRiv0823",1,"V","Vulnerable","Forest/Woodland","Woody","Victorian RiverinaLignum Swampy Woodland","50/70",15,15,20,0,5,1,5,null,null,2,30,1,5,null,null,2,1,8,10,4,10,null,null,1,5,2,5,3,15,null,null,null,null,null,null,null,null,null,null,null,null,null,null,"0","10","Continuous",0,11,4,14,40,5,100]
["Victorian Riverina","VRiv","Low Rises Grassy Woodland","VRiv0175_61",1,"E","Endangered","Forest/Woodland","Woody","Victorian RiverinaLow Rises Grassy Woodland","40/70",15,15,15,0,5,1,5,null,null,3,10,4,5,1,1,3,5,12,20,null,null,1,5,1,5,19,40,4,5,null,null,null,null,1,1,null,null,null,null,null,null,0,10,"0","10","Continuous",0,14,8,15,20,20,150]
["Victorian Riverina","VRiv","Low Rises Woodland","VRiv0066",1,"E","Endangered","Forest/Woodland","Woody","Victorian RiverinaLow Rises Woodland","40/60",20,15,20,0,5,2,5,null,null,5,15,3,5,null,null,1,1,3,5,2,1,null,null,null,null,7,25,1,1,null,null,null,null,null,null,null,null,null,null,null,null,0,10,"0","10","Continuous",0,11,10,6,25,15,200]
["Victorian Riverina","VRiv","Lunette Woodland","VRiv0652",1,"E","Endangered","Forest/Woodland","Woody","Victorian RiverinaLunette Woodland","80",8,15,10,0,5,1,5,null,null,3,10,1,1,null,null,3,5,8,15,2,5,2,5,null,null,12,45,2,5,null,null,null,null,null,null,null,null,null,null,null,null,0,10,"0","10","Continuous",0,12,5,13,16,10,100]
["Victorian Riverina","VRiv","Mountain Valley Riparian Woodland","VRiv1085",1,"V","Vulnerable","Forest/Woodland","Woody","Victorian RiverinaMountain Valley Riparian Woodland","0",0,0,null,null,null,null,null,null,null,null,null,null,null,null,null,null,null,null,null,null,null,null,null,null,null,null,null,null,null,null,null,null,null,null,null,null,null,null,null,null,null,null,null,null,null,null,0,0,null,null,null,0,0]
["Victorian Riverina","VRiv","Plains Grassland","VRiv0132",1.36,"E","Endangered","grasslands","Other grassland","Victorian RiverinaPlains Grassland","0",0,0,null,null,null,null,null,null,null,null,null,2,5,null,null,3,5,10,20,3,5,1,5,1,5,10,30,2,5,null,null,null,null,null,null,null,null,null,null,null,null,0,10,"0","20","Episodic",5,10,2,16,5,10,0]
["Victorian Riverina","VRiv","Plains Grassy Wetland","VRiv0125",1.36,"E","Endangered","wetlands","Non-woody wetland","Victorian RiverinaPlains Grassy Wetland","0",0,0,null,null,null,null,null,null,null,null,null,null,null,null,null,5,5,11,20,6,10,2,5,null,null,7,20,3,30,null,null,null,null,null,null,null,null,null,null,null,null,0,10,null,null,"Episodic",5,7,null,22,null,10,50]
["Victorian Riverina","VRiv","Plains Grassy Woodland","VRiv0055_61",1,"E","Endangered","Forest/Woodland","Woody","Victorian RiverinaPlains Grassy Woodland","80",10,15,10,0,5,1,5,null,null,3,10,2,1,1,1,3,5,8,15,3,5,2,5,null,null,12,45,2,5,null,null,null,null,null,null,null,null,null,null,null,null,0,10,"0","10","Continuous",0,13,6,14,16,10,100]
["Victorian Riverina","VRiv","Plains Saltmarsh","VRiv0888",1.36,"E","Endangered","grasslands","Non-woody wetland","Victorian RiverinaPlains Saltmarsh","0",0,0,null,0,5,null,null,null,null,null,null,1,10,1,5,null,null,1,5,2,10,null,null,null,null,1,5,2,25,null,null,null,null,null,null,null,null,null,null,null,null,0,10,"0","10","Continuous",0,9,1,3,10,10,0]
["Victorian Riverina","VRiv","Plains Savannah","VRiv0826",1,"E","Endangered","Forest/Woodland","Woody","Victorian RiverinaPlains Savannah","0",0,0,null,null,null,null,null,null,null,null,null,2,5,null,null,3,5,6,20,3,10,1,5,1,5,5,35,2,5,null,null,null,null,null,null,null,null,null,null,null,null,0,10,"0","25","Continuous",0,10,2,12,5,5,0]
["Victorian Riverina","VRiv","Plains Savannah - treed","VRiv0826_61",1,"E","Endangered","Forest/Woodland","Woody","Victorian RiverinaPlains Savannah - treed","40",5,10,10,0,5,null,null,null,null,null,null,2,5,null,null,3,5,6,20,3,10,1,5,1,5,5,35,2,5,null,null,null,null,null,null,null,null,null,null,null,null,0,10,"0","25","Continuous",0,11,2,12,5,5,50]
["Victorian Riverina","VRiv","Plains Woodland","VRiv0803",1,"E","Endangered","Forest/Woodland","Woody","Victorian RiverinaPlains Woodland","40/50/70",15,15,15,0,5,null,null,null,null,2,1,1,1,null,null,1,5,11,25,2,5,1,5,null,null,15,45,2,5,null,null,null,null,null,null,null,null,null,null,null,null,0,10,null,null,"Continuous",0,10,3,14,2,10,100]
["Victorian Riverina","VRiv","Red Gum Swamp","VRiv0292",1,"V","Vulnerable","Forest/Woodland","Woody","Victorian RiverinaRed Gum Swamp","80",10,15,10,0,5,1,10,null,null,null,null,null,null,null,null,null,null,1,15,null,null,2,5,null,null,2,10,2,40,null,null,null,null,null,null,null,null,null,null,null,null,0,10,"0","0","Episodic",5,8,1,1,10,20,150]
["Victorian Riverina","VRiv","Ridged Plains Mallee","VRiv0096",1,"E","Endangered","Forest/Woodland","Woody","Victorian RiverinaRidged Plains Mallee","30/40",15,10,10,0,5,null,null,null,null,3,5,3,10,1,1,2,5,5,10,5,15,1,5,1,1,3,20,1,1,null,null,null,null,null,null,null,null,null,null,null,null,0,10,"0","20","Continuous",0,13,6,12,15,5,50]
["Victorian Riverina","VRiv","Riparian Forest","VRiv0018",1,"D","Depleted","Forest/Woodland","Woody","Victorian RiverinaRiparian Forest","80",20,30,40,0,5,3,15,null,null,5,20,1,1,1,1,2,5,11,20,2,5,4,15,2,5,4,10,2,5,null,null,null,null,4,15,"1","5",null,null,2,5,0,20,null,null,"Continuous",0,16,9,15,36,50,300]
["Victorian Riverina","VRiv","Riparian Shrubland","VRiv0019",1.25,"D","Depleted","scrubs/shrublands/mallee without logs","Woody","Victorian RiverinaRiparian Shrubland","0",0,0,20,null,null,null,null,null,null,4,5,1,1,null,null,5,5,8,10,3,5,3,5,2,1,8,10,4,5,null,null,null,null,1,1,null,null,null,null,null,null,0,20,null,null,"Continuous",0,11,5,16,6,10,100]
["Victorian Riverina","VRiv","Riparian Woodland","VRiv0641",1,"E","Endangered","Forest/Woodland","Woody","Victorian RiverinaRiparian Woodland","80",15,15,10,0,5,2,10,null,null,2,10,null,null,null,null,4,10,5,10,1,1,3,10,null,null,4,30,2,5,null,null,null,null,null,null,null,null,null,null,1,5,0,10,null,null,"Continuous",0,11,4,10,20,30,200]
["Victorian Riverina","VRiv","Riverina Plains Grassy Woodland (syn. Plain","VRiv0055_62",1,"E","Endangered","Forest/Woodland","Woody","Victorian RiverinaRiverina Plains Grassy Woodland (syn. Plain","40/50/70",15,15,15,0,5,null,null,null,null,2,5,1,1,null,null,1,5,11,25,2,5,1,5,null,null,15,45,2,5,null,null,null,null,null,null,null,null,null,null,null,null,0,10,null,null,"Continuous",0,10,3,14,6,10,100]
["Victorian Riverina","VRiv","Riverine Chenopod Woodland","VRiv0103",1,"V","Vulnerable","Forest/Woodland","Woody","Victorian RiverinaRiverine Chenopod Woodland","50",5,15,10,0,5,1,5,null,null,3,30,5,25,1,1,null,null,5,5,5,10,null,null,null,null,2,5,null,null,null,null,null,null,null,null,null,null,null,null,null,null,null,null,"0","10","Continuous",0,9,9,10,60,5,50]
["Victorian Riverina","VRiv","Riverine Escarpment Scrub","VRiv0082",1.25,"E","Endangered","scrubs/shrublands/mallee without logs","Woody","Victorian RiverinaRiverine Escarpment Scrub","0",0,10,30,0,5,null,null,null,null,8,30,2,1,1,1,2,5,12,20,3,5,4,15,null,null,3,10,2,5,null,null,null,null,3,10,null,null,null,null,1,5,0,10,null,null,"Continuous",0,13,10,17,31,40,50]
["Victorian Riverina","VRiv","Riverine Grassy Woodland","VRiv0295",1,"V","Vulnerable","Forest/Woodland","Woody","Victorian RiverinaRiverine Grassy Woodland","80",15,20,20,0,5,1,5,null,null,null,null,1,1,null,null,null,null,2,1,2,1,2,5,null,null,5,20,2,20,null,null,null,null,null,null,null,null,null,null,null,null,0,10,null,null,"Continuous",0,9,2,4,6,10,200]
["Victorian Riverina","VRiv","Riverine Swamp Forest","VRiv0814",1,"D","Depleted","Forest/Woodland","Woody","Victorian RiverinaRiverine Swamp Forest","90",20,25,30,0,5,null,null,null,null,null,null,null,null,null,null,2,5,6,15,null,null,null,null,1,5,1,5,2,30,null,null,null,null,null,null,null,null,null,null,null,null,null,null,null,null,"Continuous",0,6,null,8,null,20,200]
["Victorian Riverina","VRiv","Riverine Swampy Woodland","VRiv0815",1,"V","Vulnerable","Forest/Woodland","Woody","Victorian RiverinaRiverine Swampy Woodland","70",15,15,20,0,5,null,null,null,null,null,null,null,null,null,null,2,5,3,10,1,5,3,10,null,null,2,10,3,20,null,null,null,null,null,null,null,null,null,null,null,null,null,null,null,null,"Episodic",5,7,null,6,null,10,100]
["Victorian Riverina","VRiv","Rocky Outcrop Shrubland","VRiv0028",1.36,"V","Vulnerable","heathlands","Woody","Victorian RiverinaRocky Outcrop Shrubland","0",0,0,null,null,null,null,null,null,null,5,25,2,5,null,null,2,5,5,5,1,1,2,5,null,null,4,10,null,null,null,null,null,null,2,5,null,null,null,null,null,null,0,20,"0","10","Continuous",0,10,7,8,30,40,0]
["Victorian Riverina","VRiv","Rushy Riverine Swamp","VRiv0804",1.36,"D","Depleted","wetlands","Non-woody wetland","Victorian RiverinaRushy Riverine Swamp","0",0,0,null,null,null,null,null,null,null,null,null,null,null,null,null,null,null,null,null,null,null,null,null,null,null,null,null,null,null,null,null,null,null,null,null,null,null,null,null,null,null,null,null,null,null,null,0,0,null,null,null,0,0]
["Victorian Riverina","VRiv","Samphire Shrubland","VRiv0101",1.36,"LC","Least Concern","grasslands","Woody","Victorian RiverinaSamphire Shrubland","0",0,0,null,null,null,null,null,null,null,null,null,4,20,null,null,null,null,7,5,3,5,null,null,null,null,2,1,2,1,null,null,null,null,null,null,null,null,null,null,null,null,null,null,null,null,"Continuous",0,5,4,10,20,0,0]
["Victorian Riverina","VRiv","Sand Ridge Woodland","VRiv0264",1,"E","Endangered","Forest/Woodland","Woody","Victorian RiverinaSand Ridge Woodland","40/70",15,15,15,0,5,1,5,null,null,4,20,3,10,2,5,2,5,10,15,5,5,3,10,null,null,8,15,null,null,null,null,null,null,1,5,null,null,null,null,1,5,0,10,"0","10","Continuous",0,14,8,17,35,10,150]
["Victorian Riverina","VRiv","Sandstone Ridge Shrubland","VRiv0093",1.1499999999999999,"V","Vulnerable","scrubs/shrublands/mallee with logs","Woody","Victorian RiverinaSandstone Ridge Shrubland","0",0,0,null,null,null,null,null,null,null,9,30,5,10,1,1,1,1,6,15,null,null,null,null,null,null,3,5,null,null,null,null,null,null,null,null,null,null,null,null,null,null,0,20,"0","20","Episodic",30,8,14,7,40,20,0]
["Victorian Riverina","VRiv","Sandstone Ridge Shrubland - treed","VRiv0093_61",1,"V","Vulnerable","scrubs/shrublands/mallee with logs","Woody","Victorian RiverinaSandstone Ridge Shrubland - treed","0",0,3,30,null,null,null,null,null,null,9,30,5,10,1,1,1,1,6,15,null,null,null,null,null,null,3,5,null,null,null,null,null,null,null,null,null,null,null,null,null,null,0,20,"0","20","Episodic",30,8,14,7,40,20,50]
["Victorian Riverina","VRiv","Sedgy Riverine Forest","VRiv0816",1,"V","Vulnerable","Forest/Woodland","Woody","Victorian RiverinaSedgy Riverine Forest","90",20,25,30,0,5,1,5,null,null,null,null,null,null,null,null,2,5,7,15,3,10,2,10,null,null,4,5,3,20,null,null,null,null,null,null,null,null,null,null,null,null,0,10,null,null,"Continuous",0,9,1,12,5,10,200]
["Victorian Riverina","VRiv","Semi-arid Chenopod Woodland","VRiv0098",1,"E","Endangered","Forest/Woodland","Woody","Victorian RiverinaSemi-arid Chenopod Woodland","35/40",15,12,15,0,5,3,10,null,null,2,40,4,15,1,1,2,5,6,15,8,15,null,null,1,5,2,5,1,1,null,null,null,null,null,null,null,null,null,null,null,null,0,10,"0","30","Continuous",0,13,9,16,65,15,50]
["Victorian Riverina","VRiv","Semi-arid Chenopod Woodland - non-treed","VRiv0098_61",1.36,"E","Endangered","Forest/Woodland","Woody","Victorian RiverinaSemi-arid Chenopod Woodland - non-treed","0",0,0,null,null,null,null,null,null,null,2,40,4,15,1,1,2,5,6,15,8,15,null,null,1,5,2,5,1,1,null,null,null,null,null,null,null,null,null,null,null,null,0,10,"0","30","Continuous",0,11,6,16,55,5,0]
["Victorian Riverina","VRiv","Semi-arid Woodland","VRiv0097",1,"E","Endangered","Forest/Woodland","Woody","Victorian RiverinaSemi-arid Woodland","35/40",20,12,20,0,5,null,null,null,null,5,15,5,20,null,null,2,5,7,5,2,5,null,null,null,null,2,10,1,1,null,null,null,null,null,null,null,null,null,null,null,null,0,10,"0","20","Continuous",0,10,10,11,35,20,200]
["Victorian Riverina","VRiv","Shallow Sands Woodland","VRiv0882",1,"E","Endangered","Forest/Woodland","Woody","Victorian RiverinaShallow Sands Woodland","40/70",15,15,15,0,5,1,5,null,null,4,15,3,10,1,5,null,null,10,20,2,5,1,1,null,null,13,30,3,5,null,null,null,null,null,null,null,null,null,null,null,null,0,10,"0","10","Continuous",0,12,8,12,30,20,150]
["Victorian Riverina","VRiv","Shrubby Dry Forest","VRiv0021",1,"V","Vulnerable","Forest/Woodland","Woody","Victorian RiverinaShrubby Dry Forest","70",20,25,30,0,5,2,10,null,null,8,15,3,5,2,5,2,1,7,5,2,1,1,1,1,1,6,10,null,null,null,null,null,null,2,5,null,null,null,null,2,1,0,10,"0","10","Episodic",20,15,13,11,30,20,200]
["Victorian Riverina","VRiv","Shrubby Granitic-outwash Grassy Woodland","VRiv0175_62",1,"E","Endangered","Forest/Woodland","Woody","Victorian RiverinaShrubby Granitic-outwash Grassy Woodland","50/70",15,15,15,0,5,2,10,null,null,2,5,7,15,1,1,null,null,8,10,null,null,1,5,null,null,10,20,5,10,null,null,null,null,1,1,null,null,null,null,1,1,0,10,"0","10","Continuous",0,13,11,8,30,20,150]
["Victorian Riverina","VRiv","Spike-sedge Wetland","VRiv0819",1.36,"V","Vulnerable","wetlands","Non-woody wetland","Victorian RiverinaSpike-sedge Wetland","0",0,0,null,null,null,null,null,null,null,null,null,null,null,null,null,null,null,2,5,2,5,null,null,null,null,2,5,2,60,null,null,null,null,null,null,null,null,null,null,null,null,null,null,null,null,"Episodic",5,4,null,4,null,20,0]
["Victorian Riverina","VRiv","Spring Soak Woodland","VRiv0080",1,"V","Vulnerable","Forest/Woodland","Woody","Victorian RiverinaSpring Soak Woodland","50",5,10,10,0,5,null,null,null,null,2,5,null,null,null,null,2,1,6,10,3,10,2,10,3,5,9,35,1,5,null,null,null,null,null,null,null,null,null,null,null,null,0,20,null,null,"Continuous",0,10,2,11,5,20,50]
["Victorian Riverina","VRiv","Swampy Riparian Woodland","VRiv0083",1,"E","Endangered","Forest/Woodland","Woody","Victorian RiverinaSwampy Riparian Woodland","0",null,null,null,null,null,null,null,null,null,null,null,null,null,null,null,null,null,null,null,null,null,null,null,null,null,null,null,null,null,null,null,null,null,null,null,null,null,null,null,null,null,null,null,null,null,null,null,0,null,null,null,null,0]
["Victorian Riverina","VRiv","Swampy Woodland","VRiv0937",1,"E","Endangered","Forest/Woodland","Woody","Victorian RiverinaSwampy Woodland","0",0,0,null,null,null,null,null,null,null,null,null,null,null,null,null,null,null,null,null,null,null,null,null,null,null,null,null,null,null,null,null,null,null,null,null,null,null,null,null,null,null,null,null,null,null,null,0,0,null,null,null,0,0]
["Victorian Riverina","VRiv","Tall Marsh","VRiv0821",1.36,"D","Depleted","wetlands","Non-woody wetland","Victorian RiverinaTall Marsh","0",0,0,null,null,null,null,null,null,null,null,null,null,null,null,null,null,null,6,20,3,10,1,10,3,40,null,null,2,10,null,null,null,null,null,null,null,null,null,null,null,null,null,null,null,null,"Episodic",1,5,null,9,null,10,0]
["Victorian Riverina","VRiv","Valley Grassy Forest","VRiv0047",1,"V","Vulnerable","Forest/Woodland","Woody","Victorian RiverinaValley Grassy Forest","70",20,20,20,0,5,3,10,null,null,3,10,3,5,null,null,1,1,9,20,3,5,1,1,null,null,12,25,1,5,null,null,null,null,null,null,null,null,null,null,null,null,0,20,null,null,"Continuous",0,11,9,13,25,20,200]
["Victorian Riverina","VRiv","Valley Heathy Forest","VRiv0127",1,"E","Endangered","Forest/Woodland","Woody","Victorian RiverinaValley Heathy Forest","70",20,15,30,0,5,2,10,null,null,7,15,5,5,2,1,null,null,6,10,3,5,3,5,2,20,6,15,1,1,null,null,null,null,1,1,null,null,null,null,3,5,0,10,null,null,"Episodic",30,14,14,9,30,40,200]
["Victorian Riverina","VRiv","Wetland Formation","VRiv0074",1.36,"E","Endangered","wetlands","Non-woody wetland",{"$f":"CONCATENATE(A1027,C1027)","v":"Victorian RiverinaWetland Formation"},"0",null,0,null,null,null,null,null,null,null,null,null,null,null,null,null,null,null,null,null,null,null,null,null,null,null,null,null,null,null,null,null,null,null,null,null,null,null,null,null,null,null,null,null,null,null,null,5,0,null,null,null,null,0]
["Victorian Riverina","VRiv","Woorinen Mallee","VRiv0824",1,"V","Vulnerable","Forest/Woodland","Woody","Victorian RiverinaWoorinen Mallee","15",30,12,25,null,null,null,null,null,null,6,10,6,20,null,null,null,null,6,10,7,10,null,null,null,null,1,1,null,null,null,null,null,null,null,null,null,null,null,null,null,null,0,10,"0","15","Continuous",0,7,12,13,30,20,200]
["Victorian Volcanic Plain","VVP","Alluvial Terraces Herb-rich Woodland","VVP_0067",1,"E","Endangered","Forest/Woodland","Woody","Victorian Volcanic PlainAlluvial Terraces Herb-rich Woodland","70",10,15,15,0,5,1,10,null,null,5,15,4,5,2,5,2,5,15,15,8,10,2,5,null,null,10,15,4,10,null,null,null,null,null,null,null,null,null,null,null,null,0,10,"0","10","Continuous",0,13,10,25,30,10,150]
["Victorian Volcanic Plain","VVP","Aquatic Herbland","VVP_0653",1.36,"E","Endangered","wetlands","Non-woody wetland","Victorian Volcanic PlainAquatic Herbland","0",0,0,null,null,null,null,null,null,null,null,null,null,null,null,null,2,10,5,40,2,10,null,null,1,5,4,10,2,10,null,null,null,null,null,null,null,null,null,null,null,null,null,null,null,null,"Episodic",5,6,null,9,null,10,0]
["Victorian Volcanic Plain","VVP","Basalt Creekline Shrubby Woodland","VVP_0705",1,"E","Endangered","Forest/Woodland","Woody","Victorian Volcanic PlainBasalt Creekline Shrubby Woodland","70",10,10,10,0,5,1,10,null,null,4,15,null,null,null,null,2,5,8,15,5,10,2,15,null,null,7,20,2,10,null,null,null,null,null,null,null,null,null,null,null,null,0,10,null,null,"Continuous",0,10,5,15,25,20,200]
["Victorian Volcanic Plain","VVP","Basalt Shrubby Woodland","VVP_0642",1,"E","Endangered","Forest/Woodland","Woody","Victorian Volcanic PlainBasalt Shrubby Woodland","70",15,15,15,0,5,2,10,null,null,2,5,null,null,2,1,2,1,10,15,5,10,3,5,1,5,10,25,3,10,null,null,null,null,1,15,null,null,null,null,null,null,0,10,"0","10","Continuous",0,14,4,17,15,20,150]
["Victorian Volcanic Plain","VVP","Berm Grassy Shrubland","VVP_0311",1.36,"TBC","TBC","scrubs/shrublands/mallee without logs","Woody","Victorian Volcanic PlainBerm Grassy Shrubland","0",0,0,null,null,null,null,null,null,null,3,20,1,5,null,null,2,5,2,10,2,5,1,1,null,null,2,25,2,10,null,null,null,null,null,null,null,null,null,null,null,null,null,null,null,null,"Continuous",0,8,4,6,25,10,0]
["Victorian Volcanic Plain","VVP","Box Ironbark Forest","VVP_0061",1,"D","Depleted","Forest/Woodland","Woody","Victorian Volcanic PlainBox Ironbark Forest","70",15,20,20,0,5,null,null,null,null,5,20,2,5,null,null,2,1,8,20,2,5,2,5,1,1,8,15,2,5,null,null,null,null,null,null,null,null,"1","0",1,1,0,10,"0","10","Continuous",0,14,7,12,25,20,200]
["Victorian Volcanic Plain","VVP","Brackish Grassland","VVP_0934",1.36,"E","Endangered","grasslands","Other grassland","Victorian Volcanic PlainBrackish Grassland","0",0,0,null,null,null,null,null,null,null,null,null,null,null,null,null,1,1,3,5,5,5,2,20,null,null,4,20,1,10,null,null,null,null,null,null,null,null,null,null,null,null,0,10,null,null,"Continuous",0,7,null,9,null,10,0]
["Victorian Volcanic Plain","VVP","Brackish Wetland","VVP_0656",1.36,"E","Endangered","wetlands","Non-woody wetland","Victorian Volcanic PlainBrackish Wetland","0",0,0,null,null,null,null,null,null,null,null,null,null,null,null,null,1,5,3,15,3,10,1,10,2,10,2,5,3,15,null,null,null,null,null,null,null,null,null,null,1,1,null,null,"0","10","Episodic",5,9,null,7,null,10,0]
["Victorian Volcanic Plain","VVP","Cane Grass Wetland","VVP_0291",1.36,"V","Vulnerable","wetlands","Non-woody wetland","Victorian Volcanic PlainCane Grass Wetland","0",0,0,null,null,null,null,null,null,null,null,null,null,null,null,null,null,null,null,null,2,10,null,null,null,null,null,null,2,40,null,null,null,null,null,null,null,null,null,null,null,null,null,null,null,null,"Episodic",5,2,null,2,null,10,0]
["Victorian Volcanic Plain","VVP","Cinder Cone Woodland","VVP_0644",1,"E","Endangered","Forest/Woodland","Woody","Victorian Volcanic PlainCinder Cone Woodland","70",15,15,15,0,5,1,5,null,null,2,10,null,null,null,null,2,5,5,10,1,1,1,20,null,null,2,5,1,1,null,null,null,null,2,20,null,null,null,null,1,1,0,10,null,null,"Continuous",0,12,3,8,15,20,100]
["Victorian Volcanic Plain","VVP","Coast Banksia Woodland","VVP_0002",1,"TBC","TBC","Forest/Woodland","Woody","Victorian Volcanic PlainCoast Banksia Woodland","50",10,15,15,0,5,null,null,null,null,3,40,1,1,null,null,2,1,3,15,2,10,1,1,null,null,1,5,1,10,null,null,null,null,1,10,null,null,null,null,2,10,0,20,null,null,"Episodic",30,12,4,7,41,40,100]
["Victorian Volcanic Plain","VVP","Coastal Alkaline Scrub","VVP_0858",1.1499999999999999,"E","Endangered","scrubs/shrublands/mallee with logs","Woody","Victorian Volcanic PlainCoastal Alkaline Scrub","0",0,8,30,null,null,null,null,null,null,3,20,1,1,1,5,2,1,5,10,2,5,1,5,null,null,4,10,1,5,null,null,null,null,null,null,null,null,null,null,2,1,0,20,null,null,null,0,11,4,9,21,40,50]
["Victorian Volcanic Plain","VVP","Coastal Dune Scrub","VVP_0160",1.36,"TBC","TBC","scrubs/shrublands/mallee without logs","Woody","Victorian Volcanic PlainCoastal Dune Scrub","0",0,0,null,null,null,null,null,null,null,5,50,3,5,null,null,2,5,6,10,3,5,2,1,1,5,3,10,2,5,null,null,null,null,1,5,null,null,null,null,2,1,0,10,null,null,"Episodic",30,12,8,11,55,40,50]
["Victorian Volcanic Plain","VVP","Coastal Headland Scrub","VVP_0161",1.36,"V","Vulnerable","heathlands","Woody","Victorian Volcanic PlainCoastal Headland Scrub","0",null,0,null,null,null,null,null,null,null,null,null,null,null,null,null,null,null,null,null,null,null,null,null,null,null,null,null,null,null,null,null,null,null,null,null,null,null,null,null,null,null,null,null,null,null,null,0,0,null,null,null,null,0]
["Victorian Volcanic Plain","VVP","Coastal Saltmarsh","VVP_0009",1.36,"V","Vulnerable","grasslands","Non-woody wetland","Victorian Volcanic PlainCoastal Saltmarsh","0",0,0,null,null,null,null,null,null,null,1,20,2,10,null,null,null,null,2,30,1,1,null,null,null,null,1,5,1,5,null,null,null,null,null,null,null,null,null,null,null,null,null,null,"0","10","Continuous",0,7,3,3,30,10,0]
["Victorian Volcanic Plain","VVP","Coastal Tussock Grassland","VVP_0163",1.36,"V","Vulnerable","grasslands","Other grassland","Victorian Volcanic PlainCoastal Tussock Grassland","0",0,0,null,null,null,null,null,null,null,3,10,1,5,null,null,1,10,3,10,2,5,3,10,1,5,4,20,2,10,null,null,null,null,null,null,null,null,null,null,null,null,0,10,null,null,"Continuous",0,10,4,6,15,20,0]
["Victorian Volcanic Plain","VVP","Creekline Grassy Woodland","VVP_0068",1,"E","Endangered","Forest/Woodland","Woody","Victorian Volcanic PlainCreekline Grassy Woodland","80",15,15,15,0,5,2,10,null,null,5,10,1,1,null,null,2,5,6,10,3,5,2,10,1,5,10,25,3,10,null,null,null,null,null,null,null,null,null,null,3,10,0,10,null,null,"Continuous",0,13,8,11,21,40,200]
["Victorian Volcanic Plain","VVP","Creekline Herb-rich Woodland","VVP_0164",1,"E","Endangered","Forest/Woodland","Woody","Victorian Volcanic PlainCreekline Herb-rich Woodland","70",10,0,15,0,5,2,10,null,null,2,10,null,null,1,5,2,5,9,15,1,5,3,20,1,5,5,15,1,5,null,null,null,null,1,5,null,null,null,null,2,1,0,20,null,null,"Continuous",0,14,4,12,20,20,100]
["Victorian Volcanic Plain","VVP","Creekline Tussock Grassland","VVP_0654",1.36,"E","Endangered","grasslands","Other grassland","Victorian Volcanic PlainCreekline Tussock Grassland","0",0,0,null,null,null,null,null,null,null,null,null,null,null,null,null,4,5,8,10,11,10,3,40,null,null,10,10,4,10,null,null,null,null,null,null,null,null,null,null,null,null,0,20,null,null,"Episodic",10,7,null,23,null,10,0]
["Victorian Volcanic Plain","VVP","Damp Heathland","VVP_0710",1.36,"V","Vulnerable","heathlands","Woody","Victorian Volcanic PlainDamp Heathland","0",0,0,null,null,null,null,null,null,null,6,30,5,20,2,5,null,null,6,10,2,1,1,5,1,1,4,15,3,20,null,null,null,null,null,null,null,null,null,null,2,5,0,10,"0","10","Episodic",30,12,11,8,50,20,0]
["Victorian Volcanic Plain","VVP","Damp Heathy Woodland","VVP_0793",1,"V","Vulnerable","Forest/Woodland","Woody","Victorian Volcanic PlainDamp Heathy Woodland","60",10,10,10,0,5,null,null,null,null,6,40,2,10,2,1,3,5,6,10,4,5,3,5,2,5,11,20,3,15,null,null,null,null,null,null,null,null,null,null,null,null,0,10,null,null,"Episodic",30,12,8,13,50,20,100]
["Victorian Volcanic Plain","VVP","Damp Sands Herb-rich Woodland","VVP_0003",1,"V","Vulnerable","Forest/Woodland","Woody","Victorian Volcanic PlainDamp Sands Herb-rich Woodland","70",15,15,15,0,5,3,15,null,null,6,15,3,5,3,5,4,5,15,25,6,5,2,5,1,5,12,15,4,10,null,null,null,null,1,10,null,null,null,null,1,1,0,10,null,null,"Continuous",0,15,12,25,35,40,150]
["Victorian Volcanic Plain","VVP","Deep Freshwater Marsh","VVP_0681",1.36,"V","Vulnerable","wetlands","Non-woody wetland","Victorian Volcanic PlainDeep Freshwater Marsh","0",null,0,null,null,null,null,null,null,null,null,null,null,null,null,null,null,null,null,null,null,null,null,null,null,null,null,null,null,null,null,null,null,null,null,null,null,null,null,null,null,null,null,null,null,null,null,5,0,null,null,null,null,0]
["Victorian Volcanic Plain","VVP","Escarpment Shrubland","VVP_0895",1.1499999999999999,"E","Endangered","Forest/Woodland","Woody","Victorian Volcanic PlainEscarpment Shrubland","0",0,8,15,null,null,null,null,null,null,3,10,2,5,null,null,3,5,4,10,5,5,1,5,1,5,9,25,3,5,null,null,null,null,1,5,null,null,null,null,1,5,0,10,"0","10","Continuous",0,13,5,12,15,20,50]
["Victorian Volcanic Plain","VVP","Escarpment Shrubland - treed","VVP_0895_61",1,"E","Endangered","Forest/Woodland","Woody","Victorian Volcanic PlainEscarpment Shrubland - treed","70",15,15,15,0,5,3,10,null,null,3,10,2,5,null,null,3,5,4,10,5,5,1,5,1,5,9,25,3,5,null,null,null,null,1,5,null,null,null,null,1,5,0,10,"0","10","Continuous",0,15,8,12,25,20,150]
["Victorian Volcanic Plain","VVP","Estuarine Flats Grassland","VVP_0914",1.36,"E","Endangered","wetlands","Non-woody wetland","Victorian Volcanic PlainEstuarine Flats Grassland","0",0,0,null,null,null,null,null,null,null,2,5,1,5,null,null,1,1,3,15,4,15,2,15,null,null,2,20,3,15,null,null,null,null,null,null,null,null,null,null,null,null,null,null,null,null,"Continuous",0,8,3,8,10,10,0]
["Victorian Volcanic Plain","VVP","Estuarine Wetland","VVP_0010",1.36,"E","Endangered","wetlands","Non-woody wetland","Victorian Volcanic PlainEstuarine Wetland","0",0,0,null,null,null,null,null,null,null,1,1,null,null,null,null,3,10,4,10,4,15,1,10,1,25,2,5,1,1,null,null,null,null,null,null,null,null,null,null,1,5,null,null,null,null,"Episodic",5,9,1,11,1,10,0]
["Victorian Volcanic Plain","VVP","Floodplain Riparian Woodland","VVP_0056",1,"E","Endangered","Forest/Woodland","Woody","Victorian Volcanic PlainFloodplain Riparian Woodland","80",15,20,20,0,5,1,5,null,null,3,15,null,null,null,null,2,5,4,10,3,10,3,15,1,10,5,15,3,10,null,null,null,null,null,null,null,null,null,null,1,5,0,10,null,null,"Episodic",5,12,4,9,20,40,300]
["Victorian Volcanic Plain","VVP","Freshwater Lignum Shrubland","VVP_0657",1.36,"E","Endangered","wetlands","Woody","Victorian Volcanic PlainFreshwater Lignum Shrubland","0",null,0,null,null,null,null,null,null,null,null,null,null,null,null,null,null,null,null,null,null,null,null,null,null,null,null,null,null,null,null,null,null,null,null,null,null,null,null,null,null,null,null,null,null,null,null,0,0,null,null,null,null,0]
["Victorian Volcanic Plain","VVP","Freshwater Meadow","VVP_0680",1.36,"E","Endangered","wetlands","Non-woody wetland","Victorian Volcanic PlainFreshwater Meadow","0",null,0,null,null,null,null,null,null,null,null,null,null,null,null,null,null,null,null,null,null,null,null,null,null,null,null,null,null,null,null,null,null,null,null,null,null,null,null,null,null,null,null,null,null,null,null,5,0,null,null,null,null,0]
["Victorian Volcanic Plain","VVP","Granitic Hills Woodland","VVP_0072",1,"E","Endangered","Forest/Woodland","Woody","Victorian Volcanic PlainGranitic Hills Woodland","60",15,10,15,0,5,2,10,null,null,5,5,null,null,null,null,4,10,9,15,2,5,null,null,null,null,11,20,2,1,null,null,null,null,2,5,null,null,null,null,2,1,0,10,"0","10","Continuous",0,12,7,15,15,20,150]
["Victorian Volcanic Plain","VVP","Grassy Dry Forest","VVP_0022",1,"D","Depleted","Forest/Woodland","Woody","Victorian Volcanic PlainGrassy Dry Forest","70",20,20,30,0,5,1,5,null,null,3,10,3,5,1,1,3,5,7,20,2,5,1,5,null,null,7,30,1,1,null,null,null,null,1,1,null,null,null,null,1,1,0,10,"0","10","Continuous",0,15,7,12,20,20,200]
["Victorian Volcanic Plain","VVP","Grassy Forest","VVP_0128",1,"E","Endangered","Forest/Woodland","Woody","Victorian Volcanic PlainGrassy Forest","0",0,0,null,null,null,null,null,null,null,null,null,null,null,null,null,null,null,null,null,null,null,null,null,null,null,null,null,null,null,null,null,null,null,null,null,null,null,null,null,null,null,null,null,null,null,null,0,0,null,null,null,0,0]
["Victorian Volcanic Plain","VVP","Grassy Woodland","VVP_0175",1,"E","Endangered","Forest/Woodland","Woody","Victorian Volcanic PlainGrassy Woodland","70",15,15,15,0,5,2,10,null,null,2,10,2,1,2,5,2,5,8,20,3,5,1,1,null,null,8,45,1,5,null,null,null,null,null,null,null,null,null,null,1,1,0,10,null,null,"Continuous",0,13,6,13,21,20,150]
["Victorian Volcanic Plain","VVP","Grassy Woodland - Non-Eucalypt","VVP_0175_61",1,"E","Endangered","Forest/Woodland","Woody","Victorian Volcanic PlainGrassy Woodland - Non-Eucalypt","70",15,10,15,0,5,null,null,null,null,2,10,2,1,2,5,null,null,8,20,3,5,1,1,null,null,8,45,1,5,null,null,null,null,null,null,null,null,null,null,1,1,0,10,null,null,"Continuous",0,11,4,11,11,20,150]
["Victorian Volcanic Plain","VVP","Heathy Dry Forest","VVP_0020",1,"LC","Least Concern","Forest/Woodland","Woody","Victorian Volcanic PlainHeathy Dry Forest","60",20,20,30,0,5,null,null,null,null,2,15,3,20,null,null,1,1,2,5,2,5,1,1,null,null,4,20,1,1,null,null,null,null,null,null,null,null,null,null,null,null,0,10,"0","10","Episodic",20,11,5,5,35,20,200]
["Victorian Volcanic Plain","VVP","Heathy Woodland","VVP_0048",1,"V","Vulnerable","Forest/Woodland","Woody","Victorian Volcanic PlainHeathy Woodland","60",15,10,15,0,5,1,5,null,null,7,35,9,20,3,5,null,null,8,10,1,1,2,5,1,5,3,5,3,5,null,null,null,null,1,5,null,null,null,null,1,1,0,10,"0","10","Episodic",20,15,17,9,60,40,150]
["Victorian Volcanic Plain","VVP","Herb-rich Foothill Forest","VVP_0023",1,"V","Vulnerable","Forest/Woodland","Woody","Victorian Volcanic PlainHerb-rich Foothill Forest","70",20,25,40,0,5,2,10,null,null,3,20,1,1,null,null,2,5,6,15,3,5,3,20,1,5,5,10,2,10,null,null,null,null,1,5,null,null,null,null,2,5,0,20,null,null,"Continuous",0,14,6,11,31,40,200]
["Victorian Volcanic Plain","VVP","Hills Herb-rich Woodland","VVP_0071",1,"V","Vulnerable","Forest/Woodland","Woody","Victorian Volcanic PlainHills Herb-rich Woodland","70",15,15,15,0,5,1,5,null,null,4,10,2,1,1,1,1,5,4,5,null,null,1,1,null,null,8,25,3,5,null,null,null,null,null,null,null,null,null,null,null,null,0,10,"0","10","Continuous",0,12,7,5,16,20,150]
["Victorian Volcanic Plain","VVP","Lignum Cane Grass Swamp","VVP_0655",1.36,"E","Endangered","wetlands","Woody","Victorian Volcanic PlainLignum Cane Grass Swamp","0",null,0,null,null,null,null,null,null,null,1,25,null,null,2,10,null,null,null,null,null,null,null,null,null,null,null,null,3,40,null,null,null,null,null,null,null,null,null,null,null,null,null,null,"0","10","Episodic",5,4,1,null,25,10,0]
["Victorian Volcanic Plain","VVP","Lignum Swamp","VVP_0104",1.36,"E","Endangered","wetlands","Woody","Victorian Volcanic PlainLignum Swamp","80",0,0,0,0,0,null,null,null,null,1,20,null,null,null,null,2,5,3,15,3,10,1,5,null,null,6,20,3,10,null,null,null,null,null,null,null,null,null,null,null,null,0,10,"0","10","Episodic",10,9,1,8,20,10,0]
["Victorian Volcanic Plain","VVP","Lowland Forest","VVP_0016",1,"LC","Least Concern","Forest/Woodland","Woody","Victorian Volcanic PlainLowland Forest","70",20,25,30,0,5,2,10,null,null,6,15,3,5,2,1,2,5,8,20,2,5,2,5,2,10,5,10,1,5,null,null,null,null,1,5,null,null,null,null,2,1,0,10,null,null,"Continuous",0,15,11,12,30,40,200]
["Victorian Volcanic Plain","VVP","Lunette Woodland","VVP_0652",1,"E","Endangered","Forest/Woodland","Woody","Victorian Volcanic PlainLunette Woodland","80",8,15,10,0,5,1,5,null,null,3,10,2,1,1,1,3,5,8,15,3,5,2,5,null,null,12,45,2,5,null,null,null,null,null,null,null,null,null,null,null,null,0,10,"0","10","Continuous",0,13,6,14,16,10,100]
["Victorian Volcanic Plain","VVP","Mangrove Shrubland","VVP_0140",1.36,"V","Vulnerable","heathlands","Woody","Victorian Volcanic PlainMangrove Shrubland","0",0,0,null,null,null,null,null,null,null,1,40,null,null,null,null,null,null,null,null,null,null,null,null,null,null,null,null,1,5,null,null,null,null,null,null,null,null,null,null,null,null,null,null,null,null,"Continuous",0,2,1,null,40,0,0]
["Victorian Volcanic Plain","VVP","Plains Grassland - Heavier-soils ","VVP_0132_61",1.36,"E","Endangered","grasslands","High rain. VVP/GiP grassland","Victorian Volcanic PlainPlains Grassland - Heavier-soils ","0",0,0,null,null,null,null,null,null,null,null,null,null,null,null,null,2,5,12,20,4,5,1,5,null,null,13,40,4,5,null,null,null,null,null,null,null,null,null,null,null,null,null,20,null,null,"Episodic",5,7,null,18,null,10,0]
["Victorian Volcanic Plain","VVP","Plains Grassland - Lighter-soils ","VVP_0132_62",1.36,"E","Endangered","grasslands","High rain. VVP/GiP grassland","Victorian Volcanic PlainPlains Grassland - Lighter-soils ","0",0,0,null,null,null,null,null,null,null,null,null,null,null,null,null,2,5,10,20,4,5,null,null,null,null,13,40,4,5,null,null,null,null,null,null,null,null,null,null,null,null,null,20,null,null,"Episodic",5,6,null,16,null,10,0]
["Victorian Volcanic Plain","VVP","Plains Grassland - Low-rainfall ","VVP_0132_63",1.36,"E","Endangered","grasslands","Other grassland","Victorian Volcanic PlainPlains Grassland - Low-rainfall ","0",0,0,null,null,null,null,null,null,null,null,null,1,5,1,5,2,5,8,20,3,10,1,5,null,null,10,30,2,5,null,null,null,null,null,null,null,null,null,null,null,0,null,20,null,null,"Episodic",5,9,1,13,5,10,0]
["Victorian Volcanic Plain","VVP","Plains Grassy Wetland","VVP_0125",1.36,"E","Endangered","wetlands","Non-woody wetland","Victorian Volcanic PlainPlains Grassy Wetland","0",0,0,null,null,null,null,null,null,null,null,null,null,null,null,null,5,5,6,10,3,10,3,15,1,5,8,30,2,10,null,null,null,null,null,null,null,null,null,null,null,null,0,10,null,null,"Episodic",5,8,null,14,null,20,50]
["Victorian Volcanic Plain","VVP","Plains Grassy Woodland","VVP_0055_61",1,"E","Endangered","Forest/Woodland","Woody","Victorian Volcanic PlainPlains Grassy Woodland","80",8,15,10,0,5,1,5,null,null,3,10,2,1,1,1,3,5,8,15,3,5,2,5,null,null,12,45,2,5,null,null,null,null,null,null,null,null,null,null,null,null,0,10,"0","10","Continuous",0,13,6,14,16,10,100]
["Victorian Volcanic Plain","VVP","Plains Grassy Woodland - higher rainfall","VVP_0055_63",1,"E","Endangered","Forest/Woodland","Woody","Victorian Volcanic PlainPlains Grassy Woodland - higher rainfall","70/40",15,15,20,0,5,1,5,null,null,3,10,2,1,1,1,3,5,8,15,3,5,2,5,null,null,12,45,2,5,null,null,null,null,null,null,null,null,null,null,null,null,0,10,"0","10","Continuous",0,13,6,14,16,10,100]
["Victorian Volcanic Plain","VVP","Plains Sedgy Wetland","VVP_0647",1.36,"E","Endangered","wetlands","Non-woody wetland","Victorian Volcanic PlainPlains Sedgy Wetland","0",0,0,null,null,null,0,0,null,null,null,null,null,null,null,null,2,5,5,40,5,10,2,5,null,null,4,25,2,5,null,null,null,null,null,null,null,null,null,null,null,null,null,null,null,null,"Episodic",5,7,1,12,5,10,50]
["Victorian Volcanic Plain","VVP","Plains Sedgy Woodland","VVP_0283",1,"V","Vulnerable","Forest/Woodland","Woody","Victorian Volcanic PlainPlains Sedgy Woodland","70/40",15,15,10,0,5,null,null,null,null,2,5,2,1,null,null,4,15,10,20,2,5,2,1,1,1,13,30,4,20,null,null,null,null,null,null,null,null,null,null,null,null,0,10,null,null,"Continuous",0,11,4,16,6,10,150]
["Victorian Volcanic Plain","VVP","Plains Swampy Woodland","VVP_0651",1,"E","Endangered","Forest/Woodland","Woody","Victorian Volcanic PlainPlains Swampy Woodland","80",10,15,10,0,5,1,5,null,null,4,15,null,null,null,null,3,5,8,20,5,5,3,30,1,1,7,10,2,5,null,null,null,null,null,null,null,null,null,null,null,null,0,20,null,null,"Continuous",0,11,5,16,20,10,100]
["Victorian Volcanic Plain","VVP","Plains Woodland","VVP_0803",1,"E","Endangered","Forest/Woodland","Woody","Victorian Volcanic PlainPlains Woodland","70/40",15,15,15,0,5,null,null,null,null,2,5,2,5,1,1,1,1,20,20,4,10,1,1,1,1,16,45,3,5,null,null,null,null,null,null,null,null,null,null,null,null,0,10,"0","10","Continuous",0,13,4,25,10,10,100]
["Victorian Volcanic Plain","VVP","Red Gum Swamp","VVP_0292",1,"E","Endangered","Forest/Woodland","Woody","Victorian Volcanic PlainRed Gum Swamp","80",10,15,15,0,5,null,null,null,null,null,null,null,null,null,null,2,10,7,25,2,1,2,15,null,null,6,20,2,15,null,null,null,null,null,null,null,null,null,null,null,null,null,null,null,null,"Episodic",5,7,null,11,null,10,100]
["Victorian Volcanic Plain","VVP","Riparian Forest","VVP_0018",1,"V","Vulnerable","Forest/Woodland","Woody","Victorian Volcanic PlainRiparian Forest","80",20,30,40,0,5,3,20,null,null,4,20,null,null,null,null,1,5,3,10,1,1,2,20,null,null,3,15,1,5,null,null,null,null,2,10,null,null,null,null,2,5,0,20,null,null,"Continuous",0,12,7,5,40,50,300]
["Victorian Volcanic Plain","VVP","Riparian Scrub","VVP_0191",1.25,"E","Endangered","scrubs/shrublands/mallee without logs","Woody","Victorian Volcanic PlainRiparian Scrub","0",0,6,60,null,null,null,null,null,null,3,20,null,null,null,null,4,10,8,10,4,5,3,20,2,5,5,10,3,10,null,null,null,null,null,null,null,null,null,null,null,null,0,20,null,null,"Continuous",0,9,3,16,20,40,0]
["Victorian Volcanic Plain","VVP","Riparian Woodland","VVP_0641",1,"E","Endangered","Forest/Woodland","Woody","Victorian Volcanic PlainRiparian Woodland","80",15,15,20,0,5,2,10,null,null,2,10,1,5,null,null,4,15,5,10,1,5,3,10,1,5,4,20,2,5,null,null,null,null,null,null,null,null,null,null,1,5,0,10,null,null,"Continuous",0,13,5,10,25,30,200]
["Victorian Volcanic Plain","VVP","Plains Grassy Woodland - Riverina (syn. EVC 8)","VVP_0055_62",1,"E","Endangered","Forest/Woodland","Woody","Victorian Volcanic PlainPlains Grassy Woodland - Riverina (syn. EVC 8)","70/40",15,15,15,0,5,null,null,null,null,2,5,2,5,1,1,1,1,20,20,4,10,1,1,null,null,16,45,3,5,null,null,null,null,null,null,null,null,null,null,null,null,0,10,"0","10","Continuous",0,12,4,25,10,10,100]
["Victorian Volcanic Plain","VVP","Rocky Chenopod Woodland","VVP_0064",1,"V","Vulnerable","Forest/Woodland","Woody","Victorian Volcanic PlainRocky Chenopod Woodland","40",10,8,10,null,null,3,5,null,null,6,25,2,5,null,null,null,null,3,10,1,1,null,null,null,null,3,5,null,null,null,null,null,null,null,null,null,null,null,null,1,1,0,10,"0","20","Continuous",0,9,11,4,35,10,100]
["Victorian Volcanic Plain","VVP","Sand Forest","VVP_0134",1,"E","Endangered","Forest/Woodland","Woody","Victorian Volcanic PlainSand Forest","70",15,20,30,0,5,1,5,null,null,3,5,1,5,2,5,null,null,2,5,null,null,1,1,null,null,7,15,2,1,null,null,null,null,1,50,null,null,null,null,null,null,0,10,null,null,"Continuous",0,11,5,2,15,40,150]
["Victorian Volcanic Plain","VVP","Sand Heathland","VVP_0006",1.36,"LC","Least Concern","heathlands","Woody","Victorian Volcanic PlainSand Heathland","0",0,0,null,null,null,null,null,null,null,6,30,8,20,3,5,null,null,3,5,2,5,2,10,1,5,6,15,1,1,null,null,null,null,1,1,null,null,null,null,3,5,0,10,"0","10","Episodic",30,13,14,5,50,20,150]
["Victorian Volcanic Plain","VVP","Sand Heathland - treed","VVP_0006_61",1,"LC","Least Concern","heathlands","Woody","Victorian Volcanic PlainSand Heathland - treed","50",15,5,10,null,null,null,null,null,null,6,30,8,20,3,5,null,null,3,5,2,5,2,10,1,5,6,15,1,1,null,null,null,null,1,1,null,null,null,null,3,5,0,10,"0","10","Episodic",30,13,14,5,50,20,150]
["Victorian Volcanic Plain","VVP","Scoria Cone Woodland","VVP_0894",1,"E","Endangered","Forest/Woodland","Woody",{"$f":"CONCATENATE(A1092,C1092)","v":"Victorian Volcanic PlainScoria Cone Woodland"},"70/40",15,15,15,0,5,1,5,null,null,2,10,null,null,null,null,3,5,6,10,3,5,1,15,null,null,4,15,1,5,null,null,null,null,2,20,null,null,null,null,null,null,0,10,"0","10","Continuous",0,12,3,12,15,20,100]
["Victorian Volcanic Plain","VVP","Seasonally Inundated Shrubby Woodland","VVP_0195",1,"E","Endangered","Forest/Woodland","Woody","Victorian Volcanic PlainSeasonally Inundated Shrubby Woodland","70",15,15,15,0,5,1,5,null,null,8,40,2,10,1,1,null,null,5,10,4,10,2,5,null,null,4,10,2,10,null,null,null,null,null,null,null,null,null,null,null,null,0,10,"0","10","Continuous",0,12,11,9,55,20,150]
["Victorian Volcanic Plain","VVP","Sedge Wetland","VVP_0136",1.36,"V","Vulnerable","wetlands","Non-woody wetland","Victorian Volcanic PlainSedge Wetland","0",0,0,null,null,null,null,null,null,null,null,null,null,null,null,null,1,5,null,null,1,1,2,20,1,20,null,null,null,null,null,null,null,null,null,null,null,null,null,null,null,null,0,10,null,null,"Episodic",5,5,null,2,null,10,0]
["Victorian Volcanic Plain","VVP","Sedgy Riparian Woodland","VVP_0198",1,"V","Vulnerable","Forest/Woodland","Woody","Victorian Volcanic PlainSedgy Riparian Woodland","70",15,15,20,0,5,1,10,null,null,5,20,null,null,null,null,null,null,3,10,null,null,5,30,null,null,2,5,2,5,null,null,null,null,2,10,null,null,null,null,null,null,0,20,null,null,"Continuous",0,9,6,3,30,20,200]
["Victorian Volcanic Plain","VVP","Shallow Freshwater Marsh","VVP_0200",1.36,"E","Endangered","wetlands","Non-woody wetland","Victorian Volcanic PlainShallow Freshwater Marsh","0",null,0,null,null,null,null,null,null,null,null,null,null,null,null,null,null,null,null,null,null,null,null,null,null,null,null,null,null,null,null,null,null,null,null,null,null,null,null,null,null,null,null,null,null,null,null,5,0,null,null,null,null,0]
["Victorian Volcanic Plain","VVP","Shrubby Dry Forest","VVP_0021",1,"LC","Least Concern","Forest/Woodland","Woody","Victorian Volcanic PlainShrubby Dry Forest","70",20,25,30,0,5,1,5,null,null,4,20,3,10,1,1,1,1,2,5,null,null,1,15,null,null,2,10,null,null,null,null,null,null,null,null,null,null,null,null,null,null,0,10,"0","10","Episodic",20,11,8,3,35,20,200]
["Victorian Volcanic Plain","VVP","Shrubby Foothill Forest","VVP_0045",1,"D","Depleted","Forest/Woodland","Woody","Victorian Volcanic PlainShrubby Foothill Forest","70",20,25,40,0,5,1,5,null,null,5,20,3,10,2,5,1,1,7,15,null,null,2,5,1,15,5,20,1,5,null,null,null,null,2,10,null,null,null,null,1,1,0,10,"0","10","Episodic",30,15,9,8,35,40,200]
["Victorian Volcanic Plain","VVP","Stony Knoll Shrubland","VVP_0649",1.36,"E","Endangered","Forest/Woodland","Woody","Victorian Volcanic PlainStony Knoll Shrubland","0",0,0,null,null,null,null,null,null,null,3,10,null,null,1,1,2,1,11,10,4,5,null,null,null,null,10,25,2,5,"2","5",null,null,2,5,null,null,null,null,null,null,0,10,"0","10","Continuous",0,11,3,17,10,20,0]
["Victorian Volcanic Plain","VVP","Stony Knoll Shrubland - treed","VVP_0649_61",1.1499999999999999,"E","Endangered","Forest/Woodland","Woody","Victorian Volcanic PlainStony Knoll Shrubland - treed","0",0,8,15,null,null,null,null,null,null,3,10,null,null,1,1,2,1,11,10,4,5,null,null,null,null,10,25,2,5,"2","5",null,null,2,5,null,null,null,null,null,null,0,10,"0","10","Continuous",0,11,3,17,10,20,50]
["Victorian Volcanic Plain","VVP","Stony Rises Woodland","VVP_0203",1,"V","Vulnerable","Forest/Woodland","Woody","Victorian Volcanic PlainStony Rises Woodland","70",15,15,15,0,5,1,10,null,null,1,5,1,5,null,null,3,5,8,15,4,10,1,5,null,null,4,20,1,5,null,null,null,null,2,20,null,null,null,null,1,1,0,10,null,null,"Continuous",0,13,3,15,20,20,150]
["Victorian Volcanic Plain","VVP","Stream Bank Shrubland","VVP_0851",1.36,"E","Endangered","Forest/Woodland","Woody","Victorian Volcanic PlainStream Bank Shrubland","0",0,0,null,null,null,2,10,null,null,4,20,null,null,null,null,3,5,12,20,4,10,3,10,3,10,10,15,5,10,null,null,null,null,null,null,null,null,null,null,2,5,null,null,null,null,"Continuous",0,10,6,19,30,40,0]
["Victorian Volcanic Plain","VVP","Stream Bank Shrubland - treed","VVP_0851_61",1,"E","Endangered","Forest/Woodland","Woody","Victorian Volcanic PlainStream Bank Shrubland - treed","70",10,15,10,0,5,2,10,null,null,4,20,null,null,null,null,3,5,12,20,4,10,3,10,3,10,10,15,5,10,null,null,null,null,null,null,null,null,null,null,2,5,null,null,null,null,"Continuous",0,11,6,19,30,40,100]
["Victorian Volcanic Plain","VVP","Swamp Scrub","VVP_0053",1.25,"E","Endangered","scrubs/shrublands/mallee without logs","Woody","Victorian Volcanic PlainSwamp Scrub","0",0,6,60,null,null,null,null,null,null,null,null,null,null,null,null,5,10,13,30,2,5,9,15,1,1,7,15,null,null,null,null,null,null,null,null,null,null,null,null,null,null,0,20,null,null,"Continuous",0,7,null,20,null,20,0]
["Victorian Volcanic Plain","VVP","Swampy Riparian Woodland","VVP_0083",1,"E","Endangered","Forest/Woodland","Woody","Victorian Volcanic PlainSwampy Riparian Woodland","70",10,15,20,0,5,2,10,null,null,2,5,null,null,null,null,5,10,9,15,4,5,5,20,1,1,8,20,2,1,null,null,null,null,1,1,null,null,null,null,2,5,0,20,null,null,"Continuous",0,13,4,18,15,20,200]
["Victorian Volcanic Plain","VVP","Swampy Woodland","VVP_0937",1,"E","Endangered","Forest/Woodland","Woody","Victorian Volcanic PlainSwampy Woodland","0",null,0,null,null,null,null,null,null,null,null,null,null,null,null,null,null,null,null,null,null,null,null,null,null,null,null,null,null,null,null,null,null,null,null,null,null,null,null,null,null,null,null,null,null,null,null,0,0,null,null,null,null,0]
["Victorian Volcanic Plain","VVP","Tall Marsh","VVP_0821",1.36,"TBC","TBC","wetlands","Non-woody wetland","Victorian Volcanic PlainTall Marsh","0",0,0,null,null,null,null,null,null,null,null,null,null,null,null,null,3,10,2,5,6,10,1,5,2,40,null,null,1,1,null,null,null,null,null,null,null,null,null,null,null,null,null,null,null,null,"Episodic",5,6,null,11,null,10,0]
["Victorian Volcanic Plain","VVP","Valley Grassy Forest","VVP_0047",1,"V","Vulnerable","Forest/Woodland","Woody","Victorian Volcanic PlainValley Grassy Forest","70",20,25,20,0,5,2,10,null,null,2,10,null,null,1,1,2,5,11,20,3,5,2,5,1,5,16,40,2,5,null,null,null,null,null,null,null,null,null,null,1,1,0,20,null,null,"Continuous",0,13,4,16,20,20,200]
["Victorian Volcanic Plain","VVP","Valley Heathy Forest","VVP_0127",1,"E","Endangered","Forest/Woodland","Woody","Victorian Volcanic PlainValley Heathy Forest","0",0,0,null,null,null,null,null,null,null,null,null,null,null,null,null,5,5,6,10,3,10,3,15,1,5,8,30,2,10,null,null,null,null,null,null,null,null,null,null,null,null,0,10,null,null,"Episodic",5,8,null,14,null,20,50]
["Victorian Volcanic Plain","VVP","Wet Heathland","VVP_0008",1.36,"LC","Least Concern","heathlands","Woody","Victorian Volcanic PlainWet Heathland","0",0,0,null,null,null,null,null,null,null,7,50,6,15,1,5,null,null,3,5,2,1,2,15,null,null,2,5,3,10,null,null,null,null,2,10,null,null,null,null,null,null,0,20,null,null,"Episodic",30,10,13,5,65,20,0]
["Victorian Volcanic Plain","VVP","Wet Verge Sedgeland","VVP_0932",1.36,"E","Endangered","wetlands","Non-woody wetland","Victorian Volcanic PlainWet Verge Sedgeland","0",null,0,null,null,null,null,null,null,null,null,null,null,null,null,null,null,null,null,null,null,null,null,null,null,null,null,null,null,null,null,null,null,null,null,null,null,null,null,null,null,null,null,null,null,null,null,0,0,null,null,null,null,0]
["Victorian Volcanic Plain","VVP","Wetland Formation","VVP_0074",1.36,"E","Endangered","wetlands","Non-woody wetland","Victorian Volcanic PlainWetland Formation","0",null,0,null,null,null,null,null,null,null,null,null,null,null,null,null,null,null,null,null,null,null,null,null,null,null,null,null,null,null,null,null,null,null,null,null,null,null,null,null,null,null,null,null,null,null,null,5,0,null,null,null,null,0]
["Warrnambool Plain","WaP","Aquatic Herbland","WaP_0653",1.36,"E","Endangered","wetlands","Non-woody wetland","Warrnambool PlainAquatic Herbland","0",0,0,null,null,null,null,null,null,null,null,null,null,null,null,null,null,null,3,20,null,null,1,25,null,null,4,25,1,1,null,null,null,null,null,null,null,null,null,null,null,null,null,null,null,null,"Episodic",5,4,null,3,null,10,0]
["Warrnambool Plain","WaP","Basalt Creekline Shrubby Woodland","WaP_0705",1,"E","Endangered","Forest/Woodland","Woody","Warrnambool PlainBasalt Creekline Shrubby Woodland","70",10,10,10,0,5,1,10,null,null,4,15,null,null,null,null,2,5,8,15,5,10,2,15,null,null,7,20,2,10,null,null,null,null,null,null,null,null,null,null,null,null,0,10,null,null,"Continuous",0,10,5,15,25,20,200]
["Warrnambool Plain","WaP","Basalt Shrubby Woodland","WaP_0642",1,"E","Endangered","Forest/Woodland","Woody","Warrnambool PlainBasalt Shrubby Woodland","70",15,15,15,0,5,2,10,null,null,2,5,null,null,2,1,2,1,10,15,5,10,3,5,1,5,10,25,3,10,null,null,null,null,1,15,null,null,null,null,null,null,0,10,"0","10","Continuous",0,14,4,17,15,20,150]
["Warrnambool Plain","WaP","Bird Colony Shrubland","WaP_0154",1.36,"R","Rare","grasslands","Woody","Warrnambool PlainBird Colony Shrubland","0",0,0,null,null,null,null,null,null,null,null,null,null,null,null,null,null,null,null,null,null,null,null,null,null,null,null,null,null,null,null,null,null,null,null,null,null,null,null,null,null,null,null,null,null,null,null,0,0,null,null,null,0,0]
["Warrnambool Plain","WaP","Bird Colony Succulent Herbland","WaP_0155",1.36,"V","Vulnerable","grasslands","Non-woody wetland","Warrnambool PlainBird Colony Succulent Herbland","0",0,0,null,null,null,null,null,null,null,1,30,null,null,null,null,null,null,2,5,2,20,1,1,null,null,null,null,null,null,null,null,null,null,null,null,null,null,null,null,2,40,null,null,null,null,"Continuous",0,5,1,4,30,10,0]
["Warrnambool Plain","WaP","Coast Gully Thicket","WaP_0181",1.25,"E","Endangered","scrubs/shrublands/mallee without logs","Woody","Warrnambool PlainCoast Gully Thicket","0",0,0,null,null,null,null,null,null,null,5,50,1,5,null,null,null,null,2,1,null,null,2,5,null,null,3,5,null,null,null,null,null,null,2,5,null,null,null,null,2,5,0,10,null,null,"Continuous",0,8,6,2,55,40,50]
["Warrnambool Plain","WaP","Coastal Dune Scrub","WaP_0160",1.36,"D","Depleted","heathlands","Woody","Warrnambool PlainCoastal Dune Scrub","0",0,0,null,null,null,null,null,null,null,7,50,1,1,null,null,3,5,7,15,3,10,null,null,null,null,2,15,2,5,null,null,null,null,null,null,null,null,null,null,3,5,0,10,null,null,"Episodic",30,9,8,13,51,40,0]
["Warrnambool Plain","WaP","Coastal Headland Scrub","WaP_0161",1.36,"V","Vulnerable","heathlands","Woody","Warrnambool PlainCoastal Headland Scrub","0",0,0,null,null,null,null,null,null,null,5,50,2,10,1,1,2,1,4,10,2,5,1,5,1,1,5,15,2,5,null,null,null,null,null,null,null,null,null,null,null,null,0,10,"0","10","Continuous",0,12,7,8,60,40,0]
["Warrnambool Plain","WaP","Coastal Tussock Grassland","WaP_0163",1.36,"V","Vulnerable","grasslands","Other grassland","Warrnambool PlainCoastal Tussock Grassland","0",0,0,null,null,null,null,null,null,null,5,20,2,15,1,1,2,1,6,10,2,5,1,10,null,null,5,25,2,5,null,null,null,null,null,null,null,null,null,null,null,null,0,10,"0","10","Continuous",0,11,7,10,35,20,0]
["Warrnambool Plain","WaP","Damp Heath Scrub","WaP_0165",1.36,"V","Vulnerable","heathlands","Woody","Warrnambool PlainDamp Heath Scrub","0",0,0,null,null,null,null,null,null,null,6,50,3,5,2,5,null,null,4,5,2,1,2,10,null,null,4,15,2,10,null,null,null,null,null,null,null,null,null,null,null,null,0,10,"0","10","Episodic",30,10,9,6,55,40,0]
["Warrnambool Plain","WaP","Damp Sands Herb-rich Woodland","WaP_0003",1,"E","Endangered","Forest/Woodland","Woody","Warrnambool PlainDamp Sands Herb-rich Woodland","70",15,15,15,0,5,1,10,null,null,3,10,1,1,1,1,2,5,7,15,4,5,2,10,2,10,4,15,2,5,null,null,null,null,1,10,null,null,null,null,null,null,0,10,null,null,"Continuous",0,14,5,13,21,40,150]
["Warrnambool Plain","WaP","Deep Freshwater Marsh","WaP_0681",1.36,"E","Endangered","wetlands","Non-woody wetland","Warrnambool PlainDeep Freshwater Marsh","0",null,0,null,null,null,null,null,null,null,null,null,null,null,null,null,null,null,null,null,null,null,null,null,null,null,null,null,null,null,null,null,null,null,null,null,null,null,null,null,null,null,null,null,null,null,null,5,0,null,null,null,null,0]
["Warrnambool Plain","WaP","Estuarine Wetland","WaP_0010",1.36,"D","Depleted","wetlands","Non-woody wetland","Warrnambool PlainEstuarine Wetland","0",0,0,null,null,null,null,null,null,null,null,null,null,null,null,null,null,null,2,25,1,10,1,10,null,null,1,5,3,20,null,null,null,null,null,null,null,null,null,null,null,null,null,null,null,null,"Episodic",5,5,null,3,null,10,0]
["Warrnambool Plain","WaP","Freshwater Meadow","WaP_0680",1.36,"E","Endangered","wetlands","Non-woody wetland","Warrnambool PlainFreshwater Meadow","0",null,0,null,null,null,null,null,null,null,null,null,null,null,null,null,null,null,null,null,null,null,null,null,null,null,null,null,null,null,null,null,null,null,null,null,null,null,null,null,null,null,null,null,null,null,null,5,0,null,null,null,null,0]
["Warrnambool Plain","WaP","Grassy Woodland","WaP_0175",1,"E","Endangered","Forest/Woodland","Woody","Warrnambool PlainGrassy Woodland","70",15,15,15,0,5,2,10,null,null,2,10,2,1,2,5,2,5,8,20,3,5,1,1,null,null,8,45,1,5,null,null,null,null,null,null,null,null,null,null,1,1,0,10,null,null,"Continuous",0,13,6,13,21,20,150]
["Warrnambool Plain","WaP","Heathy Woodland","WaP_0048",1,"V","Vulnerable","Forest/Woodland","Woody","Warrnambool PlainHeathy Woodland","60",15,10,15,0,5,null,null,null,null,7,30,4,5,2,1,null,null,4,10,1,1,1,5,1,1,3,5,1,5,null,null,null,null,2,5,null,null,null,null,null,null,0,10,"0","10","Episodic",20,13,11,5,35,40,150]
["Warrnambool Plain","WaP","Herb-rich Foothill Forest","WaP_0023",1,"V","Vulnerable","Forest/Woodland","Woody","Warrnambool PlainHerb-rich Foothill Forest","70",20,25,40,0,5,1,5,null,null,5,15,2,1,2,5,1,1,10,20,3,5,3,10,2,10,5,20,2,5,null,null,null,null,3,10,null,null,null,null,2,1,0,20,null,null,"Continuous",0,15,8,14,21,40,200]
["Warrnambool Plain","WaP","Lowland Forest","WaP_0016",1,"V","Vulnerable","Forest/Woodland","Woody","Warrnambool PlainLowland Forest","70",20,25,30,0,5,2,10,null,null,8,25,3,5,1,1,2,1,6,10,2,5,2,5,1,5,3,5,2,5,null,null,null,null,2,10,null,null,null,null,2,1,0,10,null,null,"Continuous",0,15,13,10,40,40,200]
["Warrnambool Plain","WaP","Plains Grassy Wetland","WaP_0125",1.36,"E","Endangered","wetlands","Non-woody wetland","Warrnambool PlainPlains Grassy Wetland","0",null,0,null,null,null,null,null,null,null,null,null,null,null,null,null,null,null,null,null,null,null,null,null,null,null,null,null,null,null,null,null,null,null,null,null,null,null,null,null,null,null,null,null,null,null,null,0,0,null,null,null,null,0]
["Warrnambool Plain","WaP","Plains Grassy Woodland","WaP_0055",1,"E","Endangered","Forest/Woodland","Woody","Warrnambool PlainPlains Grassy Woodland","80",8,15,10,0,5,1,5,null,null,3,10,2,1,1,1,3,5,8,15,3,5,2,5,null,null,12,45,2,5,null,null,null,null,null,null,null,null,null,null,null,null,0,10,"0","10","Continuous",0,13,6,14,16,10,100]
["Warrnambool Plain","WaP","Plains Sedgy Wetland","WaP_0647",1.36,"E","Endangered","wetlands","Non-woody wetland","Warrnambool PlainPlains Sedgy Wetland","0",0,0,null,null,null,null,null,null,null,null,null,null,null,null,null,2,5,5,40,5,10,2,5,1,5,4,25,2,5,null,null,null,null,null,null,null,null,null,null,null,null,null,null,null,null,"Episodic",5,7,null,12,null,10,50]
["Warrnambool Plain","WaP","Plains Swampy Woodland","WaP_0651",1,"E","Endangered","Forest/Woodland","Woody","Warrnambool PlainPlains Swampy Woodland","80",10,15,10,0,5,1,5,null,null,3,15,null,null,null,null,3,5,8,20,5,5,3,30,1,1,7,10,2,5,null,null,null,null,null,null,null,null,null,null,null,null,0,20,null,null,"Continuous",0,11,4,16,20,10,100]
["Warrnambool Plain","WaP","Riparian Forest","WaP_0018",1,"V","Vulnerable","Forest/Woodland","Woody","Warrnambool PlainRiparian Forest","80",20,30,40,0,5,3,15,null,null,4,15,null,null,null,null,2,5,4,10,2,5,3,10,1,5,null,null,1,1,null,null,null,null,5,30,"1","5","2","1",2,5,0,20,null,null,"Continuous",0,14,7,8,30,50,300]
["Warrnambool Plain","WaP","Scoria Cone Woodland","WaP_0894",1,"E","Endangered","Forest/Woodland","Woody","Warrnambool PlainScoria Cone Woodland","70/40",15,15,15,0,5,1,5,null,null,2,10,null,null,null,null,3,5,6,10,3,5,1,15,null,null,4,15,1,5,null,null,null,null,2,20,null,null,null,null,null,null,0,10,"0","10","Continuous",0,12,3,12,15,20,100]
["Warrnambool Plain","WaP","Sedge Wetland","WaP_0136",1.36,"E","Endangered","wetlands","Non-woody wetland","Warrnambool PlainSedge Wetland","0",null,0,null,null,null,null,null,null,null,null,null,null,null,null,null,null,null,null,null,null,null,null,null,null,null,null,null,null,null,null,null,null,null,null,null,null,null,null,null,null,null,null,null,null,null,null,0,0,null,null,null,null,0]
["Warrnambool Plain","WaP","Sedgy Riparian Woodland","WaP_0198",1,"E","Endangered","Forest/Woodland","Woody","Warrnambool PlainSedgy Riparian Woodland","70",15,15,20,0,5,null,null,null,null,5,30,null,null,null,null,1,1,7,10,2,5,3,30,1,5,1,1,3,10,null,null,null,null,2,10,null,null,null,null,1,1,0,20,null,null,"Continuous",0,12,5,10,30,30,200]
["Warrnambool Plain","WaP","Shallow Freshwater Marsh","WaP_0200",1.36,"E","Endangered","wetlands","Non-woody wetland","Warrnambool PlainShallow Freshwater Marsh","0",null,0,null,null,null,null,null,null,null,null,null,null,null,null,null,null,null,null,null,null,null,null,null,null,null,null,null,null,null,null,null,null,null,null,null,null,null,null,null,null,null,null,null,null,null,null,5,0,null,null,null,null,0]
["Warrnambool Plain","WaP","Shrubby Foothill Forest","WaP_0045",1,"D","Depleted","Forest/Woodland","Woody","Warrnambool PlainShrubby Foothill Forest","70",20,25,40,0,5,1,5,null,null,7,40,2,10,null,null,null,null,4,5,1,1,2,10,1,10,2,5,1,1,null,null,null,null,3,10,null,null,null,null,2,1,0,10,null,null,"Episodic",30,13,10,5,55,40,200]
["Warrnambool Plain","WaP","Shrubby Wet Forest","WaP_0201",1,"LC","Least Concern","Forest/Woodland","Woody","Warrnambool PlainShrubby Wet Forest","90",20,30,40,0,5,2,10,null,null,9,20,null,null,1,1,2,1,5,10,2,5,2,10,1,10,2,5,1,1,null,null,null,null,3,20,"1","15",null,null,1,1,0,20,null,null,"Continuous",0,15,11,9,30,50,300]
["Warrnambool Plain","WaP","Stony Rises Woodland","WaP_0203",1,"V","Vulnerable","Forest/Woodland","Woody","Warrnambool PlainStony Rises Woodland","70",15,15,15,0,5,1,10,null,null,1,5,1,5,null,null,3,5,9,20,3,10,1,5,null,null,4,20,1,5,null,null,null,null,2,20,null,null,null,null,1,1,0,10,null,null,"Continuous",0,13,3,15,20,20,150]
["Warrnambool Plain","WaP","Swamp Scrub","WaP_0053",1.25,"E","Endangered","scrubs/shrublands/mallee without logs","Woody","Warrnambool PlainSwamp Scrub","0",0,0,null,null,null,null,null,null,null,2,10,null,null,null,null,3,5,1,5,1,5,3,30,1,10,null,null,2,5,null,null,null,null,2,5,null,null,null,null,1,5,0,20,null,null,"Continuous",0,10,2,5,10,40,0]
["Warrnambool Plain","WaP","Swampy Riparian Woodland","WaP_0083",1,"E","Endangered","Forest/Woodland","Woody","Warrnambool PlainSwampy Riparian Woodland","70",10,15,15,0,5,2,10,null,null,2,5,null,null,null,null,5,10,9,20,4,10,5,20,1,5,8,20,2,1,null,null,null,null,1,1,null,null,null,null,2,5,0,20,null,null,"Continuous",0,13,4,18,15,20,200]
["Warrnambool Plain","WaP","Tall Marsh","WaP_0821",1.36,"TBC","TBC","wetlands","Non-woody wetland","Warrnambool PlainTall Marsh","0",0,0,null,null,null,null,null,null,null,null,null,null,null,null,null,3,10,3,5,5,20,1,5,3,40,2,5,2,1,null,null,null,null,null,null,null,null,null,null,null,null,null,null,null,null,"Episodic",5,7,null,11,null,0,0]
["Warrnambool Plain","WaP","Wet Heathland","WaP_0008",1.36,"E","Endangered","heathlands","Woody","Warrnambool PlainWet Heathland","0",0,0,null,null,null,null,null,null,null,7,40,6,15,1,5,null,null,3,5,2,1,2,15,null,null,2,5,3,10,null,null,null,null,2,5,null,null,null,null,null,null,0,20,null,null,"Episodic",30,10,13,5,55,20,0]
["Wilsons Promontory","WPro","Bird Colony Shrubland","WPro0154",1.36,"R","Rare","grasslands","Woody","Wilsons PromontoryBird Colony Shrubland","0",0,0,null,null,null,null,null,null,null,6,20,null,null,null,null,3,15,null,null,null,null,null,null,null,null,null,null,null,null,null,null,null,null,null,null,null,null,null,null,null,null,null,null,null,null,"Continuous",0,2,6,3,20,10,0]
["Wilsons Promontory","WPro","Blocked Coastal Stream Swamp","WPro0875",1.36,"R","Rare","wetlands","Non-woody wetland","Wilsons PromontoryBlocked Coastal Stream Swamp","0",0,0,null,null,null,null,null,null,null,null,null,null,null,null,null,2,10,1,5,1,1,null,null,2,55,3,5,1,1,null,null,null,null,null,null,null,null,null,null,null,null,null,null,null,null,"Episodic",5,6,null,4,null,10,0]
["Wilsons Promontory","WPro","Coast Banksia Woodland","WPro0002",1,"R","Rare","Forest/Woodland","Woody","Wilsons PromontoryCoast Banksia Woodland","50",10,15,15,0,5,2,20,null,null,3,30,null,null,null,null,2,1,3,15,2,10,1,1,null,null,1,5,1,5,null,null,null,null,1,5,null,null,null,null,1,10,0,10,null,null,"Episodic",30,12,5,7,50,40,100]
["Wilsons Promontory","WPro","Coastal Alkaline Scrub","WPro0858",1.1499999999999999,"D","Depleted","scrubs/shrublands/mallee with logs","Woody","Wilsons PromontoryCoastal Alkaline Scrub","0",0,0,null,0,5,null,null,null,null,4,30,2,5,null,null,1,1,5,10,2,5,1,5,null,null,4,10,2,5,null,null,null,null,null,null,null,null,null,null,2,1,0,20,null,null,"Continuous",0,11,6,8,35,40,50]
["Wilsons Promontory","WPro","Coastal Headland Scrub","WPro0161",1.36,"V","Vulnerable","heathlands","Woody","Wilsons PromontoryCoastal Headland Scrub","0",0,0,null,null,null,2,25,null,null,7,50,2,5,null,null,2,5,2,5,2,5,1,1,null,null,4,10,2,1,null,null,null,null,null,null,null,null,null,null,2,1,0,10,null,null,"Continuous",0,11,11,6,80,40,0]
["Wilsons Promontory","WPro","Coastal Lagoon Wetland","WPro0011",1.36,"R","Rare","wetlands","Non-woody wetland","Wilsons PromontoryCoastal Lagoon Wetland","0",0,0,null,null,null,null,null,null,null,null,null,null,null,null,null,1,1,2,5,1,1,2,10,2,15,1,1,2,5,null,null,null,null,null,null,null,null,null,null,null,null,null,null,null,null,"Continuous",0,7,null,4,null,20,0]
["Wilsons Promontory","WPro","Coastal Saltmarsh","WPro0009",1.36,"LC","Least Concern","grasslands","Non-woody wetland","Wilsons PromontoryCoastal Saltmarsh","0",0,0,null,null,null,null,null,null,null,1,20,1,1,null,null,null,null,3,20,2,15,null,null,1,1,1,5,2,10,null,null,null,null,null,null,null,null,null,null,null,null,null,null,"0","10","Continuous",0,8,2,5,21,10,0]
["Wilsons Promontory","WPro","Coastal Sand Heathland","WPro0005",1.36,"R","Rare","heathlands","Woody","Wilsons PromontoryCoastal Sand Heathland","0",0,0,null,null,null,null,null,null,null,null,null,10,55,null,null,2,5,2,5,1,1,null,null,null,null,4,10,2,5,null,null,null,null,null,null,null,null,null,null,null,null,0,10,null,null,"Continuous",0,7,10,5,55,40,0]
["Wilsons Promontory","WPro","Coastal Tussock Grassland","WPro0163",1.36,"R","Rare","grasslands","Other grassland","Wilsons PromontoryCoastal Tussock Grassland","0",0,0,null,null,null,null,null,null,null,3,20,1,5,1,1,2,5,5,10,3,5,3,10,null,null,4,25,2,5,null,null,null,null,null,null,null,null,null,null,null,null,0,10,"0","10","Continuous",0,11,4,10,25,20,0]
["Wilsons Promontory","WPro","Cool Temperate Rainforest","WPro0031",1,"E","Endangered","Forest/Woodland","Woody",{"$f":"CONCATENATE(A1156,C1156)","v":"Wilsons PromontoryCool Temperate Rainforest"},"70",20,25,50,0,5,2,10,null,null,2,5,null,null,null,null,2,5,2,5,null,null,null,null,null,null,null,null,null,null,null,null,null,null,6,15,"3","40","5","5",2,1,0,40,null,null,"Continuous",0,10,4,4,15,50,200]
["Wilsons Promontory","WPro","Damp Forest","WPro0029",1,"LC","Least Concern","Forest/Woodland","Woody","Wilsons PromontoryDamp Forest","90",20,30,40,0,5,4,20,null,null,6,25,1,1,null,null,null,null,3,1,null,null,2,5,1,1,2,10,1,1,null,null,null,null,3,10,"1","5",null,null,2,1,0,20,null,null,"Continuous",0,13,11,3,46,50,300]
["Wilsons Promontory","WPro","Damp Sands Herb-rich Woodland","WPro0003",1,"V","Vulnerable","Forest/Woodland","Woody","Wilsons PromontoryDamp Sands Herb-rich Woodland","70",15,15,15,0,5,null,null,null,null,5,25,3,5,1,1,2,5,8,15,5,10,2,10,1,1,4,10,2,10,null,null,null,null,1,15,null,null,null,null,null,null,0,10,null,null,"Continuous",0,13,8,15,30,40,150]
["Wilsons Promontory","WPro","Estuarine Flats Grassland","WPro0914",1.36,"TBC","TBC","grasslands","Other grassland","Wilsons PromontoryEstuarine Flats Grassland","0",0,0,null,null,null,null,null,null,null,2,5,1,5,null,null,1,1,3,15,4,15,2,15,null,null,2,20,3,15,null,null,null,null,null,null,null,null,null,null,null,null,null,null,null,null,"Continuous",0,8,3,8,10,10,0]
["Wilsons Promontory","WPro","Estuarine Wetland","WPro0010",1.36,"R","Rare","wetlands","Non-woody wetland","Wilsons PromontoryEstuarine Wetland","0",0,0,null,null,null,null,null,null,null,1,10,2,5,null,null,2,5,6,20,2,5,2,10,1,5,2,5,3,20,null,null,null,null,1,5,null,null,null,null,1,1,null,null,null,null,"Episodic",5,11,3,10,15,10,0]
["Wilsons Promontory","WPro","Granitic Hills Woodland","WPro0072",1,"LC","Least Concern","Forest/Woodland","Woody","Wilsons PromontoryGranitic Hills Woodland","60",15,10,15,0,5,1,10,null,null,10,30,6,10,2,5,null,null,3,5,null,null,2,10,1,1,4,20,1,1,null,null,null,null,2,5,null,null,null,null,null,null,0,10,null,null,"Continuous",0,12,17,3,50,20,150]
["Wilsons Promontory","WPro","Heathy Woodland","WPro0048",1,"LC","Least Concern","Forest/Woodland","Woody","Wilsons PromontoryHeathy Woodland","50",15,10,10,0,5,1,5,null,null,6,40,5,10,1,1,null,null,2,1,null,null,2,15,null,null,2,10,2,10,null,null,null,null,1,5,null,null,null,null,null,null,0,10,"0","10","Episodic",20,12,12,2,55,40,150]
["Wilsons Promontory","WPro","Lowland Forest","WPro0016",1,"LC","Least Concern","Forest/Woodland","Woody","Wilsons PromontoryLowland Forest","70",20,25,30,0,5,null,null,null,null,7,30,5,10,2,5,null,null,7,10,4,5,2,5,1,5,7,15,1,1,null,null,null,null,2,15,null,null,null,null,3,1,0,10,null,null,"Continuous",0,13,12,11,40,40,200]
["Wilsons Promontory","WPro","Mangrove Shrubland","WPro0140",1.36,"R","Rare","heathlands","Woody","Wilsons PromontoryMangrove Shrubland","0",0,0,null,null,null,null,null,null,null,1,40,null,null,null,null,null,null,null,null,null,null,null,null,null,null,null,null,1,5,null,null,null,null,null,null,null,null,null,null,null,null,null,null,null,null,"Continuous",0,2,1,null,40,0,0]
["Wilsons Promontory","WPro","Montane Rocky Shrubland","WPro0192",1.25,"R","Rare","scrubs/shrublands/mallee without logs","Woody","Wilsons PromontoryMontane Rocky Shrubland","0",0,0,null,null,null,null,null,null,null,6,30,null,null,null,null,null,null,1,1,null,null,2,15,null,null,2,5,1,1,null,null,null,null,3,10,"1","5","2","5",null,null,0,20,null,null,"Episodic",30,9,6,1,30,40,0]
["Wilsons Promontory","WPro","Riparian Forest","WPro0018",1,"LC","Least Concern","Forest/Woodland","Woody","Wilsons PromontoryRiparian Forest","80",20,30,40,0,5,1,15,null,null,8,20,1,1,null,null,2,1,6,10,2,1,3,10,1,5,3,5,3,10,null,null,null,null,3,15,"1","1",null,null,2,5,0,20,null,null,"Continuous",0,15,10,10,36,50,300]
["Wilsons Promontory","WPro","Riparian Scrub","WPro0191",1.25,"LC","Least Concern","scrubs/shrublands/mallee without logs","Woody","Wilsons PromontoryRiparian Scrub","0",0,0,null,null,null,null,null,null,null,6,50,1,1,null,null,null,null,3,10,null,null,3,30,1,5,2,5,3,5,null,null,null,null,2,10,null,null,null,null,1,10,0,20,null,null,"Continuous",0,10,7,3,51,40,50]
["Wilsons Promontory","WPro","Rocky Outcrop Shrubland","WPro0028",1.36,"TBC","TBC","scrubs/shrublands/mallee without logs","Woody","Wilsons PromontoryRocky Outcrop Shrubland","0",0,0,null,null,null,null,null,null,null,7,25,2,5,2,5,2,5,2,1,null,null,2,5,null,null,4,10,1,1,null,null,null,null,1,1,null,null,null,null,null,null,0,20,"0","10","Continuous",0,11,9,4,30,40,100]
["Wilsons Promontory","WPro","Sand Heathland","WPro0006",1.36,"R","Rare","heathlands","Woody","Wilsons PromontorySand Heathland","0",0,0,null,null,null,null,null,null,null,7,40,6,15,2,1,null,null,3,5,null,null,1,1,null,null,3,10,2,5,null,null,null,null,1,1,null,null,null,null,null,null,0,10,"0","10","Episodic",30,10,13,3,55,20,0]
["Wilsons Promontory","WPro","Sedge Wetland","WPro0136",1.36,"R","Rare","wetlands","Non-woody wetland","Wilsons PromontorySedge Wetland","0",0,0,null,null,null,null,null,null,null,1,5,null,null,null,null,1,5,4,10,null,null,1,15,2,30,1,1,2,1,null,null,null,null,null,null,null,null,null,null,null,null,0,10,null,null,"Episodic",5,8,1,5,5,10,0]
["Wilsons Promontory","WPro","Shrubby Foothill Forest","WPro0045",1,"LC","Least Concern","Forest/Woodland","Woody","Wilsons PromontoryShrubby Foothill Forest","70",20,25,40,0,5,3,25,null,null,7,35,2,10,null,null,null,null,2,1,null,null,1,5,1,5,1,5,null,null,null,null,null,null,2,5,null,null,null,null,null,null,0,10,null,null,"Episodic",30,10,12,2,70,40,200]
["Wilsons Promontory","WPro","Spray-zone Coastal Shrubland","WPro0876",1.36,"R","Rare","grasslands","Woody","Wilsons PromontorySpray-zone Coastal Shrubland","0",0,0,null,null,null,null,null,null,null,2,5,4,30,null,null,null,null,2,5,4,5,2,5,null,null,4,10,1,1,null,null,null,null,null,null,null,null,null,null,1,5,null,null,"0","20","Continuous",0,9,6,6,35,10,0]
["Wilsons Promontory","WPro","Swamp Scrub","WPro0053",1.25,"E","Endangered","scrubs/shrublands/mallee without logs","Woody","Wilsons PromontorySwamp Scrub","0",0,0,null,null,null,null,null,null,null,2,10,2,1,null,null,2,5,3,15,2,5,2,10,3,10,2,5,2,15,null,null,null,null,1,5,null,null,null,null,1,1,0,20,null,null,"Continuous",0,12,4,7,11,40,0]
["Wilsons Promontory","WPro","Warm Temperate Rainforest","WPro0032",1,"R","Rare","Forest/Woodland","Woody","Wilsons PromontoryWarm Temperate Rainforest","70",20,25,50,0,5,3,10,null,null,3,10,null,null,null,null,null,null,3,5,null,null,2,10,null,null,null,null,null,null,null,null,null,null,5,20,"3","30","6","5",2,5,0,20,null,null,"Continuous",0,10,6,3,20,50,200]
["Wilsons Promontory","WPro","Wet Forest","WPro0030",1,"LC","Least Concern","Forest/Woodland","Woody","Wilsons PromontoryWet Forest","90",20,30,40,0,5,4,25,null,null,3,15,null,null,null,null,null,null,3,5,null,null,1,1,null,null,1,1,null,null,null,null,null,null,4,15,"2","5","2","1",2,1,0,20,null,null,"Continuous",0,11,7,3,40,50,300]
["Wilsons Promontory","WPro","Wet Heathland","WPro0008",1.36,"LC","Least Concern","heathlands","Woody","Wilsons PromontoryWet Heathland","0",0,0,null,null,null,null,null,null,null,5,50,2,5,null,null,1,5,2,5,null,null,3,20,1,1,2,5,4,20,null,null,null,null,1,10,null,null,null,null,1,1,0,20,null,null,"Episodic",30,11,7,3,55,20,0]
["Wilsons Promontory","WPro","Wet Rocky Outcrop Scrub","WPro0310",1.36,"R","Rare","grasslands","Woody","Wilsons PromontoryWet Rocky Outcrop Scrub","0",0,0,null,null,null,2,10,null,null,6,30,2,10,null,null,null,null,4,10,null,null,2,5,null,null,1,1,3,5,null,null,null,null,3,10,null,null,"2","5",null,null,0,20,null,null,"Episodic",30,10,10,4,50,40,0]
["Wilsons Promontory","WPro","Wet Swale Herbland","WPro0012",1.36,"R","Rare","wetlands","Non-woody wetland","Wilsons PromontoryWet Swale Herbland","0",0,0,null,null,null,null,null,null,null,null,null,null,null,null,null,1,1,7,15,3,5,2,5,1,1,4,10,4,25,null,null,null,null,1,5,null,null,null,null,2,1,null,null,null,null,"Episodic",5,9,null,11,null,10,0]
["Wilsons Promontory","WPro","Wetland Formation","WPro0074",1.36,"R","Rare","wetlands","Non-woody wetland","Wilsons PromontoryWetland Formation","0",null,0,null,null,null,null,null,null,null,null,null,null,null,null,null,null,null,null,null,null,null,null,null,null,null,null,null,null,null,null,null,null,null,null,null,null,null,null,null,null,null,null,null,null,null,null,0,0,null,null,null,null,0]
["Wimmera","Wim","Alluvial Terraces Herb-rich Woodland","Wim_0067",1,"V","Vulnerable","Forest/Woodland","Woody","WimmeraAlluvial Terraces Herb-rich Woodland","70/40",8,15,15,0,5,1,5,null,null,3,5,3,5,1,1,3,5,15,20,5,10,1,1,null,null,12,20,2,5,null,null,null,null,1,1,null,null,null,null,null,null,0,10,"0","10","Continuous",0,14,7,23,15,10,150]
["Wimmera","Wim","Aquatic Herbland","Wim_0653",1.36,"E","Endangered","wetlands","Non-woody wetland","WimmeraAquatic Herbland","0",0,0,null,null,null,null,null,null,null,null,null,null,null,null,null,null,null,3,30,2,5,null,null,null,null,3,10,2,20,null,null,null,null,null,null,null,null,null,null,null,null,null,null,null,null,"Episodic",5,4,null,5,null,10,0]
["Wimmera","Wim","Black Box Lignum Woodland","Wim_0663",1,"E","Endangered","Forest/Woodland","Woody","WimmeraBlack Box Lignum Woodland","70",10,12,10,0,5,null,null,null,null,1,25,1,1,null,null,4,5,9,20,2,5,2,5,null,null,7,20,3,20,null,null,null,null,null,null,null,null,null,null,null,null,null,null,"0","10","Episodic",10,10,2,15,26,20,150]
["Wimmera","Wim","Box Ironbark Forest","Wim_0061",1,"D","Depleted","Forest/Woodland","Woody","WimmeraBox Ironbark Forest","70",15,20,30,0,5,null,null,null,null,7,25,4,5,2,1,null,null,9,20,null,null,1,1,null,null,8,15,null,null,null,null,null,null,null,null,null,null,null,null,null,null,0,10,"0","20","Continuous",0,9,11,9,30,20,200]
["Wimmera","Wim","Brackish Sedgeland","Wim_0013",1.36,"E","Endangered","wetlands","Non-woody wetland","WimmeraBrackish Sedgeland","0",0,0,null,null,null,null,null,null,null,null,null,null,null,null,null,1,5,5,10,5,5,1,5,null,null,4,10,3,50,"3","5",null,null,null,null,null,null,null,null,null,null,null,null,null,null,"Episodic",5,7,null,11,null,10,0]
["Wimmera","Wim","Brackish Wetland","Wim_0656",1.36,"E","Endangered","wetlands","Non-woody wetland","WimmeraBrackish Wetland","0",0,0,null,null,null,null,null,null,null,null,null,null,null,null,null,1,5,3,15,3,10,1,10,2,10,2,5,3,15,null,null,null,null,null,null,null,null,null,null,1,1,null,null,"0","10","Episodic",5,9,null,7,null,10,0]
["Wimmera","Wim","Cane Grass Wetland","Wim_0291",1.36,"V","Vulnerable","wetlands","Non-woody wetland","WimmeraCane Grass Wetland","0",0,0,null,null,null,null,null,null,null,null,null,null,null,null,null,null,null,null,null,2,10,null,null,null,null,null,null,2,40,null,null,null,null,null,null,null,null,null,null,null,null,null,null,null,null,"Episodic",5,2,null,2,null,10,0]
["Wimmera","Wim","Chenopod Grassland","Wim_0829",1.36,"E","Endangered","grasslands","Other grassland","WimmeraChenopod Grassland","0",0,0,null,null,null,null,null,null,null,1,10,6,30,null,null,1,1,5,15,4,5,null,null,null,null,3,20,null,null,null,null,null,null,null,null,null,null,null,null,null,null,0,10,"0","20","Continuous",0,8,7,10,40,5,0]
["Wimmera","Wim","Creekline Grassy Woodland","Wim_0068",1,"E","Endangered","Forest/Woodland","Woody","WimmeraCreekline Grassy Woodland","80",15,15,15,0,5,null,null,null,null,2,10,2,1,null,null,null,null,5,10,1,1,3,20,null,null,6,25,null,null,null,null,null,null,null,null,null,null,null,null,null,null,0,10,null,null,"Continuous",0,8,4,6,11,40,200]
["Wimmera","Wim","Creekline Herb-rich Woodland","Wim_0164",1,"E","Endangered","Forest/Woodland","Woody","WimmeraCreekline Herb-rich Woodland","70",10,15,15,0,5,1,5,null,null,3,15,1,5,null,null,null,null,6,20,1,5,1,20,1,5,2,5,1,5,null,null,null,null,null,null,null,null,null,null,null,null,0,20,null,null,"Continuous",0,11,5,7,25,20,100]
["Wimmera","Wim","Creekline Sedgy Woodland","Wim_0640",1,"E","Endangered","Forest/Woodland","Woody","WimmeraCreekline Sedgy Woodland","80",15,15,15,0,5,2,10,null,null,2,5,2,1,null,null,2,5,5,10,1,1,3,15,1,5,6,20,null,null,null,null,null,null,null,null,null,null,null,null,null,null,0,10,null,null,"Continuous",0,11,6,8,16,40,200]
["Wimmera","Wim","Damp Heathland","Wim_0710",1.36,"LC","Least Concern","heathlands","Woody","WimmeraDamp Heathland","0",0,0,null,null,null,null,null,null,null,6,30,5,20,2,5,null,null,6,10,2,1,1,5,1,1,4,10,3,15,null,null,null,null,null,null,null,null,null,null,2,5,0,10,"0","10","Episodic",30,12,11,8,50,20,0]
["Wimmera","Wim","Damp Sands Herb-rich Woodland","Wim_0003",1,"V","Vulnerable","Forest/Woodland","Woody",{"$f":"CONCATENATE(A1192,C1192)","v":"WimmeraDamp Sands Herb-rich Woodland"},"70",15,15,10,0,5,1,5,null,null,4,25,7,15,null,null,1,1,8,10,3,1,1,5,null,null,7,10,4,10,"2","1","1","15",1,10,null,null,null,null,2,5,0,10,null,null,"Continuous",0,15,12,12,45,40,150]
["Wimmera","Wim","Deep Freshwater Marsh","Wim_0681",1.36,"E","Endangered","wetlands","Non-woody wetland",{"$f":"CONCATENATE(A1193,C1193)","v":"WimmeraDeep Freshwater Marsh"},"0",null,0,null,null,null,null,null,null,null,null,null,null,null,null,null,null,null,null,null,null,null,null,null,null,null,null,null,null,null,null,null,null,null,null,null,null,null,null,null,null,null,null,null,null,null,null,5,0,null,null,null,null,0]
["Wimmera","Wim","Drainage-line Woodland","Wim_0679",1,"E","Endangered","Forest/Woodland","Woody","WimmeraDrainage-line Woodland","80",15,15,15,0,5,null,null,null,null,null,null,null,null,null,null,2,5,5,10,1,1,3,15,1,5,6,20,null,null,null,null,null,null,null,null,null,null,null,null,null,null,0,10,null,null,"Continuous",0,8,null,8,null,40,200]
["Wimmera","Wim","Dry Creekline Woodland","Wim_0285",1,"E","Endangered","Forest/Woodland","Woody","WimmeraDry Creekline Woodland","70",15,15,20,0,5,null,null,null,null,4,20,null,null,null,null,1,1,5,10,null,null,1,5,null,null,5,20,2,5,"2","1",null,null,null,null,null,null,null,null,null,null,0,20,null,null,"Continuous",0,9,4,6,20,20,200]
["Wimmera","Wim","Dune Soak Woodland","Wim_0673",1,"E","Endangered","Forest/Woodland","Woody","WimmeraDune Soak Woodland","70",15,15,20,0,5,2,20,null,null,8,35,5,10,2,1,3,5,5,10,null,null,1,1,2,5,8,30,6,20,"3","5",null,null,1,1,null,null,null,null,1,1,0,10,null,null,"Continuous",0,15,15,8,65,20,150]
["Wimmera","Wim","Dunefield Heathland","Wim_0089",1.36,"LC","Least Concern","heathlands","Woody","WimmeraDunefield Heathland","0",0,0,null,null,null,null,null,null,null,6,50,6,20,null,null,null,null,4,5,null,null,1,1,null,null,3,5,2,5,null,null,"1","1",null,null,null,null,null,null,null,null,null,null,"0","10","Episodic",20,8,12,4,70,5,0]
["Wimmera","Wim","Escarpment Shrubland","Wim_0895",1.1499999999999999,"E","Endangered","Forest/Woodland","Woody","WimmeraEscarpment Shrubland","0",0,0,null,null,null,null,null,null,null,2,10,2,5,null,null,3,5,4,10,5,5,1,5,1,5,9,25,3,5,null,null,null,null,null,null,null,null,null,null,1,5,0,10,"0","20","Continuous",0,12,4,12,15,20,50]
["Wimmera","Wim","Escarpment Shrubland - treed","Wim_0895_61",1,"E","Endangered","Forest/Woodland","Woody","WimmeraEscarpment Shrubland - treed","70",15,0,0,0,5,3,10,null,null,2,10,2,5,null,null,3,5,4,10,5,5,1,5,1,5,9,25,3,5,null,null,null,null,null,null,null,null,null,null,1,5,0,10,"0","20","Continuous",0,14,7,12,25,20,150]
["Wimmera","Wim","Floodplain Riparian Woodland","Wim_0056",1,"E","Endangered","Forest/Woodland","Woody","WimmeraFloodplain Riparian Woodland","80",15,20,15,0,5,1,5,null,null,3,10,null,null,null,null,5,10,4,10,2,5,2,15,1,5,6,20,1,5,null,null,null,null,null,null,null,null,null,null,null,null,0,10,null,null,"Episodic",5,11,4,11,15,40,300]
["Wimmera","Wim","Freshwater Lignum Shrubland","Wim_0657",1.36,"E","Endangered","wetlands","Woody","WimmeraFreshwater Lignum Shrubland","0",0,0,null,null,null,null,null,null,null,1,20,null,null,null,null,2,5,3,20,3,10,1,5,null,null,6,25,3,10,null,null,null,null,null,null,null,null,null,null,null,null,0,10,"0","10","Episodic",10,9,1,8,20,10,0]
["Wimmera","Wim","Freshwater Meadow","Wim_0680",1.36,"E","Endangered","wetlands","Non-woody wetland","WimmeraFreshwater Meadow","0",null,0,null,null,null,null,null,null,null,null,null,null,null,null,null,null,null,null,null,null,null,null,null,null,null,null,null,null,null,null,null,null,null,null,null,null,null,null,null,null,null,null,null,null,null,null,5,0,null,null,null,null,0]
["Wimmera","Wim","Grassy Dry Forest","Wim_0022",1,"D","Depleted","Forest/Woodland","Woody","WimmeraGrassy Dry Forest","60",20,20,30,0,5,1,5,null,null,3,5,3,5,2,1,3,10,16,30,3,5,2,5,null,null,13,30,4,5,null,null,null,null,1,5,null,null,null,null,1,1,0,10,"0","10","Continuous",0,15,7,22,15,20,200]
["Wimmera","Wim","Grassy Woodland","Wim_0175",1,"E","Endangered","Forest/Woodland","Woody","WimmeraGrassy Woodland","70",15,15,15,0,5,null,null,null,null,6,15,3,5,null,null,4,10,10,15,2,1,2,5,null,null,11,25,3,5,null,null,null,null,null,null,null,null,null,null,null,null,0,10,"0","10","Continuous",0,11,9,16,20,20,150]
["Wimmera","Wim","Heathy Herb-rich Woodland","Wim_0179",1,"D","Depleted","Forest/Woodland","Woody","WimmeraHeathy Herb-rich Woodland","70",15,15,10,0,5,1,5,null,null,6,20,7,15,2,5,1,1,6,5,2,1,2,5,null,null,6,5,2,5,null,null,null,null,1,25,null,null,null,null,null,null,0,10,null,null,"Continuous",0,13,14,9,40,20,150]
["Wimmera","Wim","Heathy Mallee","Wim_0088",1.1499999999999999,"LC","Least Concern","scrubs/shrublands/mallee with logs","Woody","WimmeraHeathy Mallee","0",0,4,25,null,null,null,null,null,null,6,30,7,20,null,null,2,1,3,5,null,null,1,1,null,null,3,5,2,5,null,null,"1","5",null,null,null,null,null,null,null,null,null,null,"0","10","Episodic",20,9,13,5,50,10,50]
["Wimmera","Wim","Heathy Woodland","Wim_0048",1,"LC","Least Concern","Forest/Woodland","Woody","WimmeraHeathy Woodland","50",15,10,15,null,null,null,null,null,null,8,40,9,25,2,5,2,1,6,5,null,null,2,5,null,null,7,10,3,10,null,null,null,null,null,null,null,null,null,null,null,null,0,10,"0","10","Episodic",20,10,17,8,65,40,150]
["Wimmera","Wim","Higher Rainfall Shallow Sands Woodland","Wim_0882_61",1,"V","Vulnerable","Forest/Woodland","Woody","WimmeraHigher Rainfall Shallow Sands Woodland","70/40",15,15,15,0,5,1,5,null,null,3,15,3,10,2,5,1,1,14,20,4,5,null,null,null,null,13,30,3,5,null,null,null,null,null,null,null,null,null,null,null,null,0,10,"0","10","Continuous",0,12,7,19,30,20,150]
["Wimmera","Wim","Hillcrest Herb-rich Woodland","Wim_0070",1,"D","Depleted","Forest/Woodland","Woody","WimmeraHillcrest Herb-rich Woodland","70",15,10,15,0,5,2,10,null,null,2,5,2,1,null,null,4,10,14,20,2,5,1,1,null,null,12,30,3,5,null,null,null,null,1,1,null,null,null,null,null,null,0,10,"0","10","Continuous",0,13,6,20,16,20,150]
["Wimmera","Wim","Hills Herb-rich Woodland","Wim_0071",1,"V","Vulnerable","Forest/Woodland","Woody","WimmeraHills Herb-rich Woodland","70",15,15,15,0,5,1,5,null,null,1,5,1,1,1,1,1,5,20,30,7,10,1,1,null,null,15,25,5,15,null,null,null,null,null,null,null,null,null,null,null,null,0,10,"0","10","Continuous",0,13,3,28,11,20,150]
["Wimmera","Wim","Inland Saltmarsh","Wim_0677",1.36,"E","Endangered","grasslands","Woody","WimmeraInland Saltmarsh","0",0,0,null,null,null,null,null,null,null,null,null,4,20,null,null,null,null,7,5,3,5,null,null,null,null,2,1,2,1,null,null,null,null,null,null,null,null,null,null,null,null,null,null,"0","10","Continuous",0,6,4,10,20,0,0]
["Wimmera","Wim","Intermittent Swampy Woodland","Wim_0813",1,"V","Vulnerable","Forest/Woodland","Woody","WimmeraIntermittent Swampy Woodland","70/50",15,15,20,0,5,null,null,null,null,1,5,1,5,null,null,2,5,5,10,1,5,null,null,null,null,3,30,2,10,null,null,null,null,null,null,null,null,null,null,null,null,null,null,null,null,"Continuous",0,8,2,8,10,20,200]
["Wimmera","Wim","Lateritic Woodland","Wim_0704",1,"V","Vulnerable","Forest/Woodland","Woody","WimmeraLateritic Woodland","70",15,15,15,0,5,1,5,null,null,11,25,11,20,4,5,2,5,14,10,4,5,2,5,1,1,15,20,4,5,"4","1",null,null,null,null,null,null,null,null,3,5,0,10,"0","10","Continuous",0,16,23,20,50,20,150]
["Wimmera","Wim","Lignum Cane Grass Swamp","Wim_0655",1.36,"E","Endangered","wetlands","Woody","WimmeraLignum Cane Grass Swamp","0",0,0,null,null,null,null,null,null,null,1,25,null,null,2,10,null,null,null,null,null,null,null,null,null,null,null,null,3,40,null,null,null,null,null,null,null,null,null,null,null,null,null,null,"0","10","Episodic",5,4,1,null,25,10,0]
["Wimmera","Wim","Lignum Swamp","Wim_0104",1.36,"E","Endangered","wetlands","Woody","WimmeraLignum Swamp","0",0,0,null,null,null,null,null,null,null,1,20,null,null,null,null,4,5,8,25,2,10,null,null,1,5,2,5,2,5,null,null,null,null,null,null,null,null,null,null,1,1,null,null,"0","10","Continuous",0,9,1,14,20,5,0]
["Wimmera","Wim","Lignum Swampy Woodland","Wim_0823",1,"V","Vulnerable","Forest/Woodland","Woody","WimmeraLignum Swampy Woodland","70/50",15,15,20,0,5,1,5,null,null,2,30,1,5,null,null,2,1,8,10,4,10,null,null,1,5,2,5,3,15,null,null,null,null,null,null,null,null,null,null,null,null,null,null,"0","10","Continuous",0,11,4,14,40,5,100]
["Wimmera","Wim","Low Chenopod Shrubland","Wim_0102",1.36,"D","Depleted","grasslands","Woody","WimmeraLow Chenopod Shrubland","0",0,0,null,null,null,null,null,null,null,null,null,null,null,null,null,null,null,null,null,null,null,null,null,null,null,null,null,null,null,null,null,null,null,null,null,null,null,null,null,null,null,null,null,null,null,null,0,0,null,null,null,0,0]
["Wimmera","Wim","Low Rises Woodland","Wim_0066",1,"E","Endangered","Forest/Woodland","Woody","WimmeraLow Rises Woodland","60/40",20,15,20,0,5,2,5,null,null,5,15,3,5,null,null,1,1,3,5,2,1,null,null,null,null,8,25,1,1,null,null,null,null,null,null,null,null,null,null,null,null,0,10,"0","10","Continuous",0,11,10,6,25,15,200]
["Wimmera","Wim","Lowan Sands Mallee","Wim_0087",1.1499999999999999,"LC","Least Concern","scrubs/shrublands/mallee with logs","Woody","WimmeraLowan Sands Mallee","0",0,7,25,null,null,null,null,null,null,5,35,7,30,1,1,null,null,4,10,null,null,1,1,null,null,5,5,2,10,null,null,null,null,null,null,null,null,null,null,null,null,null,null,"0","10","Episodic",30,8,12,4,65,5,50]
["Wimmera","Wim","Lower Rainfall Shallow Sands Woodland","Wim_0882_62",1,"V","Vulnerable","Forest/Woodland","Woody","WimmeraLower Rainfall Shallow Sands Woodland","60/40",15,15,20,0,5,1,5,null,null,3,10,4,20,2,5,1,1,7,15,3,5,null,null,null,null,8,25,3,1,"2","1",null,null,null,null,null,null,null,null,null,null,0,10,"0","10","Continuous",0,13,8,11,35,20,200]
["Wimmera","Wim","Lunette Woodland","Wim_0652",1,"E","Endangered","Forest/Woodland","Woody","WimmeraLunette Woodland","80",8,15,10,0,5,1,5,null,null,3,10,2,1,1,1,3,5,8,15,3,5,2,5,null,null,12,45,2,5,null,null,null,null,null,null,null,null,null,null,null,null,0,10,"0","10","Continuous",0,13,6,14,16,10,100]
["Wimmera","Wim","Metamorphic Slopes Shrubby Woodland","Wim_0069",1,"D","Depleted","Forest/Woodland","Woody","WimmeraMetamorphic Slopes Shrubby Woodland","40",15,8,15,null,null,1,5,null,null,7,25,3,5,1,1,2,5,11,20,2,1,1,5,null,null,7,15,null,null,null,null,null,null,1,5,null,null,null,null,null,null,0,10,"0","20","Continuous",0,12,11,15,35,20,150]
["Wimmera","Wim","Northern Wimmera Riverine Chenopod Woodland","Wim_0103_62",1,"E","Endangered","Forest/Woodland","Woody","WimmeraNorthern Wimmera Riverine Chenopod Woodland","40",5,15,10,0,5,1,5,null,null,3,30,5,25,1,1,null,null,5,5,5,10,null,null,null,null,2,5,null,null,null,null,null,null,null,null,null,null,null,null,null,null,null,null,"0","10","Continuous",0,9,9,10,60,5,50]
["Wimmera","Wim","Parilla Mallee","Wim_0981",1,"E","Endangered","Forest/Woodland","Woody","WimmeraParilla Mallee","35/20",25,10,25,0,5,null,null,null,null,4,10,3,10,null,null,1,1,3,5,5,5,null,null,null,null,6,20,1,5,null,null,null,null,null,null,null,null,null,null,null,null,0,10,"0","10","Continuous",0,10,7,9,20,20,150]
["Wimmera","Wim","Plains Grassland","Wim_0132",1.36,"E","Endangered","grasslands","Other grassland","WimmeraPlains Grassland","0",0,0,null,null,null,null,null,null,null,null,null,2,5,null,null,3,5,6,20,3,10,1,5,1,1,5,30,2,5,null,null,null,null,null,null,null,null,null,null,null,null,0,10,"0","20","Episodic",5,10,2,12,5,10,0]
["Wimmera","Wim","Plains Grassy Wetland","Wim_0125",1.36,"E","Endangered","wetlands","Non-woody wetland","WimmeraPlains Grassy Wetland","0",0,0,null,null,null,null,null,null,null,null,null,null,null,null,null,5,5,11,20,6,10,2,5,null,null,7,20,3,40,null,null,null,null,null,null,null,null,null,null,null,null,0,10,null,null,"Episodic",5,7,null,22,null,10,50]
["Wimmera","Wim","Plains Grassy Woodland","Wim_0055",1,"E","Endangered","Forest/Woodland","Woody","WimmeraPlains Grassy Woodland","80",15,15,15,0,5,null,null,null,null,1,5,2,5,1,1,1,1,18,25,4,10,1,1,null,null,15,40,4,5,null,null,null,null,null,null,null,null,null,null,null,null,0,10,null,null,"Continuous",0,11,3,23,10,10,100]
["Wimmera","Wim","Plains Riparian Shrubby Woodland","Wim_0659",1,"V","Vulnerable","Forest/Woodland","Woody","WimmeraPlains Riparian Shrubby Woodland","80",15,15,20,0,5,1,5,null,null,4,20,2,5,null,null,3,5,9,15,2,1,4,15,1,5,13,20,3,5,"3","5",null,null,null,null,null,null,null,null,1,5,0,10,null,null,"Continuous",0,14,7,14,30,20,200]
["Wimmera","Wim","Plains Savannah","Wim_0826",1,"E","Endangered","Forest/Woodland","Woody","WimmeraPlains Savannah","0",0,0,null,null,null,null,null,null,null,null,null,2,5,null,null,3,5,6,20,3,10,1,5,1,5,5,35,2,5,null,null,null,null,null,null,null,null,null,null,null,null,0,10,"0","25","Continuous",0,10,2,12,5,5,0]
["Wimmera","Wim","Plains Savannah - treed","Wim_0826_61",1,"E","Endangered","Forest/Woodland","Woody","WimmeraPlains Savannah - treed","40",5,10,10,0,5,null,null,null,null,null,null,2,5,null,null,3,5,6,20,3,10,1,5,1,5,5,35,2,5,null,null,null,null,null,null,null,null,null,null,null,null,0,10,"0","25","Continuous",0,11,2,12,5,5,50]
["Wimmera","Wim","Plains Sedgy Wetland","Wim_0647",1.36,"E","Endangered","wetlands","Non-woody wetland","WimmeraPlains Sedgy Wetland","0",0,0,null,null,null,null,null,null,null,null,null,null,null,null,null,2,5,4,20,2,5,null,null,1,25,4,10,1,5,null,null,null,null,null,null,null,null,null,null,null,null,null,null,null,null,"Episodic",5,6,null,8,null,10,50]
["Wimmera","Wim","Plains Sedgy Woodland","Wim_0283",1,"D","Depleted","Forest/Woodland","Woody","WimmeraPlains Sedgy Woodland","70/40",15,15,10,0,5,null,null,null,null,2,5,2,1,null,null,4,15,10,20,2,5,2,1,1,1,13,30,4,20,null,null,null,null,null,null,null,null,null,null,null,null,0,10,null,null,"Continuous",0,11,4,16,6,10,150]
["Wimmera","Wim","Plains Swampy Woodland","Wim_0651",1,"E","Endangered","Forest/Woodland","Woody","WimmeraPlains Swampy Woodland","80",10,15,10,0,5,1,5,null,null,4,15,null,null,null,null,3,5,8,20,4,5,3,30,1,1,7,10,2,5,null,null,null,null,null,null,null,null,null,null,null,null,0,20,null,null,"Continuous",0,11,5,15,20,10,100]
["Wimmera","Wim","Plains Woodland","Wim_0803",1,"E","Endangered","Forest/Woodland","Woody","WimmeraPlains Woodland","70",15,15,15,0,5,null,null,null,null,2,5,2,5,1,1,1,1,20,25,4,10,1,5,1,1,16,30,3,5,null,null,null,null,null,null,null,null,null,null,null,null,0,10,"0","10","Continuous",0,13,4,25,10,10,100]
["Wimmera","Wim","Red Gum Swamp","Wim_0292",1,"V","Vulnerable","Forest/Woodland","Woody","WimmeraRed Gum Swamp","80",10,15,10,0,5,1,10,null,null,1,10,null,null,null,null,3,10,10,25,3,5,2,5,null,null,8,20,2,15,null,null,null,null,null,null,null,null,null,null,null,null,0,10,null,null,"Episodic",5,10,2,16,20,20,150]
["Wimmera","Wim","Red Swale Mallee","Wim_0095",1.1499999999999999,"LC","Least Concern","scrubs/shrublands/mallee with logs","Woody","WimmeraRed Swale Mallee","0",0,6,30,null,null,null,null,null,null,4,10,3,5,null,null,1,1,7,10,2,1,1,1,null,null,3,5,null,null,null,null,null,null,null,null,null,null,null,null,null,null,0,10,"0","20","Episodic",30,9,7,10,15,15,50]
["Wimmera","Wim","Ridged Plains Mallee","Wim_0096",1,"E","Endangered","Forest/Woodland","Woody","WimmeraRidged Plains Mallee","40/30",15,10,10,0,5,null,null,null,null,3,5,3,10,1,1,2,5,5,10,5,15,1,5,1,1,3,20,1,1,null,null,null,null,null,null,null,null,null,null,null,null,0,10,"0","20","Continuous",0,13,6,12,15,5,50]
["Wimmera","Wim","Riparian Scrub","Wim_0191",1.25,"E","Endangered","scrubs/shrublands/mallee without logs","Woody","WimmeraRiparian Scrub","0",0,0,null,null,null,null,null,null,null,4,10,2,1,1,1,1,5,4,5,null,null,2,25,null,null,1,10,3,15,null,null,null,null,null,null,null,null,null,null,null,null,0,20,null,null,"Continuous",0,9,6,5,11,40,0]
["Wimmera","Wim","Riparian Shrubland","Wim_0019",1.25,"D","Depleted","scrubs/shrublands/mallee without logs","Woody","WimmeraRiparian Shrubland","0",0,0,null,null,null,null,null,null,null,6,40,null,null,null,null,2,5,6,10,2,5,3,10,null,null,3,10,2,1,null,null,null,null,2,5,null,null,null,null,2,5,0,10,null,null,"Episodic",5,10,6,10,40,20,100]
["Wimmera","Wim","Riparian Woodland","Wim_0641",1,"V","Vulnerable","Forest/Woodland","Woody","WimmeraRiparian Woodland","80",15,15,10,0,5,2,10,null,null,2,10,1,1,null,null,4,10,5,10,1,5,3,10,null,null,4,30,2,5,null,null,null,null,null,null,null,null,null,null,1,5,0,10,null,null,"Continuous",0,12,5,10,21,30,200]
["Wimmera","Wim","Rocky Outcrop Shrubland","Wim_0028",1.36,"R","Rare","heathlands","Woody","WimmeraRocky Outcrop Shrubland","0",0,0,null,null,null,null,null,null,null,9,45,2,10,1,1,2,1,2,5,null,null,2,5,null,null,5,10,null,null,null,null,null,null,null,null,null,null,null,null,null,null,0,20,"0","10","Continuous",0,9,11,4,55,40,0]
["Wimmera","Wim","Salt Paperbark Woodland","Wim_0676",1.1499999999999999,"V","Vulnerable","scrubs/shrublands/mallee with logs","Woody","WimmeraSalt Paperbark Woodland","0",0,8,10,null,null,null,null,null,null,null,null,null,null,1,10,null,null,3,15,3,10,null,null,null,null,1,1,null,null,null,null,null,null,null,null,null,null,null,null,null,null,null,null,"0","10","Continuous",0,5,null,6,null,0,100]
["Wimmera","Wim","Samphire Shrubland","Wim_0101",1.36,"LC","Least Concern","grasslands","Woody","WimmeraSamphire Shrubland","0",0,0,null,null,null,null,null,null,null,null,null,4,20,null,null,null,null,7,5,3,5,null,null,null,null,2,1,2,1,null,null,null,null,null,null,null,null,null,null,null,null,null,null,"0","10","Continuous",0,6,4,10,20,0,0]
["Wimmera","Wim","Sand Forest","Wim_0134",1,"E","Endangered","Forest/Woodland","Woody","WimmeraSand Forest","70",15,20,30,0,5,1,5,null,null,3,5,1,5,2,5,null,null,2,5,null,null,1,1,null,null,7,15,2,1,null,null,null,null,1,50,null,null,null,null,null,null,0,10,null,null,"Continuous",0,11,5,2,15,40,150]
["Wimmera","Wim","Sand Heathland","Wim_0006",1.36,"D","Depleted","heathlands","Woody","WimmeraSand Heathland","0",0,0,null,null,null,null,null,null,null,7,30,8,25,2,5,null,null,1,1,null,null,1,1,null,null,4,10,2,15,null,null,null,null,null,null,null,null,null,null,null,null,0,10,null,null,"Episodic",30,8,15,1,55,20,0]
["Wimmera","Wim","Sand Ridge Woodland","Wim_0264",1,"E","Endangered","Forest/Woodland","Woody","WimmeraSand Ridge Woodland","70/50",15,15,15,0,5,null,null,null,null,4,20,3,10,2,5,2,5,10,15,5,5,3,10,null,null,8,15,null,null,null,null,null,null,1,5,null,null,null,null,null,null,0,10,"0","10","Continuous",0,12,7,17,30,10,150]
["Wimmera","Wim","Sandstone Ridge Shrubland","Wim_0093",1.1499999999999999,"V","Vulnerable","scrubs/shrublands/mallee with logs","Woody","WimmeraSandstone Ridge Shrubland","0",0,3,15,null,null,null,null,null,null,6,40,5,20,1,5,2,1,5,10,null,null,1,5,null,null,6,15,null,null,null,null,null,null,null,null,null,null,null,null,2,1,0,10,"0","20","Episodic",30,10,11,7,60,20,50]
["Wimmera","Wim","Sandy Stream Woodland","Wim_0674",1,"E","Endangered","Forest/Woodland","Woody","WimmeraSandy Stream Woodland","80",10,15,10,0,5,2,15,null,null,5,15,null,null,null,null,null,null,6,10,3,5,2,10,2,20,10,30,3,5,null,null,null,null,null,null,null,null,null,null,null,null,0,10,null,null,"Continuous",0,10,7,9,30,40,200]
["Wimmera","Wim","Scree-slope Woodland","Wim_0709",1,"E","Endangered","Forest/Woodland","Woody","WimmeraScree-slope Woodland","40",10,15,20,0,5,null,null,null,null,2,10,null,null,2,5,1,5,6,30,1,1,1,1,null,null,5,25,null,null,null,null,null,null,null,null,null,null,null,null,null,null,0,10,"0","10","Continuous",0,10,2,8,10,15,200]
["Wimmera","Wim","Seasonally Inundated Shrubby Woodland","Wim_0195",1,"LC","Least Concern","Forest/Woodland","Woody","WimmeraSeasonally Inundated Shrubby Woodland","70",15,15,15,0,5,null,null,null,null,7,35,4,5,1,1,3,5,4,10,3,5,null,null,null,null,6,20,4,5,"3","1",null,null,null,null,null,null,"1","1",null,null,0,10,null,null,"Continuous",0,12,11,10,40,20,150]
["Wimmera","Wim","Sedge Wetland","Wim_0136",1.36,"E","Endangered","wetlands","Non-woody wetland","WimmeraSedge Wetland","80",5,15,10,0,5,null,null,null,null,1,1,null,null,null,null,4,10,10,20,3,10,3,5,null,null,11,30,3,10,"2","5",null,null,null,null,null,null,null,null,null,null,0,10,"0","10","Episodic",5,11,1,17,1,10,50]
["Wimmera","Wim","Sedge-rich Woodland","Wim_0065",1,"V","Vulnerable","Forest/Woodland","Woody","WimmeraSedge-rich Woodland","70/40",15,15,10,0,5,null,null,null,null,2,5,2,1,null,null,1,5,10,20,2,5,null,null,1,1,13,30,3,15,null,null,null,null,null,null,null,null,null,null,null,null,0,10,"0","10","Continuous",0,11,4,13,6,10,150]
["Wimmera","Wim","Semi-arid Chenopod Woodland","Wim_0098",1,"V","Vulnerable","Forest/Woodland","Woody","WimmeraSemi-arid Chenopod Woodland","0",0,0,null,null,null,null,null,null,null,null,null,null,null,null,null,null,null,null,null,null,null,null,null,null,null,null,null,null,null,null,null,null,null,null,null,null,null,null,null,null,null,null,null,null,null,null,0,0,null,null,null,0,0]
["Wimmera","Wim","Semi-arid Woodland","Wim_0097",1,"V","Vulnerable","Forest/Woodland","Woody","WimmeraSemi-arid Woodland","40/35",20,12,20,0,5,null,null,null,null,5,15,5,20,null,null,2,5,7,5,2,5,null,null,null,null,2,10,1,1,null,null,null,null,null,null,null,null,null,null,null,null,0,10,"0","20","Continuous",0,10,10,11,35,20,200]
["Wimmera","Wim","Shallow Freshwater Marsh","Wim_0200",1.36,"V","Vulnerable","wetlands","Non-woody wetland","WimmeraShallow Freshwater Marsh","0",null,0,null,null,null,null,null,null,null,null,null,null,null,null,null,null,null,null,null,null,null,null,null,null,null,null,null,null,null,null,null,null,null,null,null,null,null,null,null,null,null,null,null,null,null,null,5,0,null,null,null,null,0]
["Wimmera","Wim","Shrubby Woodland","Wim_0282",1,"LC","Least Concern","Forest/Woodland","Woody","WimmeraShrubby Woodland","70",15,15,20,0,5,2,10,null,null,6,40,3,5,1,1,2,1,5,5,2,5,2,10,1,5,4,10,2,10,null,null,null,null,1,1,null,null,null,null,null,null,0,10,null,null,"Continuous",0,14,11,9,55,20,150]
["Wimmera","Wim","Southern Wimmera Riverine Chenopod Woodland","Wim_0103_61",1,"E","Endangered","Forest/Woodland","Woody",{"$f":"CONCATENATE(A1257,C1257)","v":"WimmeraSouthern Wimmera Riverine Chenopod Woodland"},"60",10,15,10,0,5,1,5,null,null,3,5,3,5,null,null,null,null,10,20,3,5,1,1,null,null,7,25,2,5,null,null,null,null,null,null,null,null,null,null,null,null,0,10,"0","10","Continuous",0,11,7,13,15,20,150]
["Wimmera","Wim","Swamp Scrub","Wim_0053",1.25,"E","Endangered","scrubs/shrublands/mallee without logs","Woody","WimmeraSwamp Scrub","0",0,0,null,null,null,null,null,null,null,2,10,1,1,null,null,5,5,9,15,3,10,2,15,2,5,4,15,3,15,null,null,null,null,2,5,null,null,null,null,1,5,0,20,null,null,"Continuous",0,12,3,17,11,40,0]
["Wimmera","Wim","Wetland Formation","Wim_0074",1.36,"E","Endangered","wetlands","Non-woody wetland","WimmeraWetland Formation","0",null,0,null,null,null,null,null,null,null,null,null,null,null,null,null,null,null,null,null,null,null,null,null,null,null,null,null,null,null,null,null,null,null,null,null,null,null,null,null,null,null,null,null,null,null,null,5,0,null,null,null,null,0]
["Wimmera","Wim","Woorinen Mallee","Wim_0824",1,"V","Vulnerable","Forest/Woodland","Woody","WimmeraWoorinen Mallee","15",30,12,25,0,5,null,null,null,null,6,10,6,20,null,null,null,null,6,10,7,10,null,null,null,null,1,1,null,null,null,null,null,null,null,null,null,null,null,null,null,null,0,10,"0","15","Continuous",0,8,12,13,30,20,200]

{"sheet":"Dropdown_menus","index":7,"n_rows":86,"n_cols":38,"rows_kept":86,"cut":false,"hidden":true,"merged":[]}
["Dropdown lists for data entry",null,null,null,null,null,null,null,null,null,"EVCs in each bioregion (Bioregion Abbr used to name ranges as names won't allow spaces) "]
["Current land tenure","Property size","Proposal type","Current security (indirect dropdown lists depending on land tenure)","Proposed security (indirect dropdown lists depending on land tenure)",null,"Habitat zone type","Length of existing logs","Bioregion","Bioregion Abbr","Brid","CVU","DunT","EGL","EGU","GipP","GleP","Gold","GGr","HFE","HNF","HSF","LoM","MonT","MuF","MuM","MSB","NIS","OtP","OtR","RobP","Strz","VAlp","VRiv","VVP","WaP","WPro","Wim"]
["Freehold land","< 10 ha","Offset","Freehold land:","Freehold land:",null,"Patch","Logs absent","Bridgewater","BW","Coastal Alkaline Scrub","Alluvial Terraces Herb-rich Woodland","Alluvial Terraces Herb-rich Woodland","Banksia Woodland","Banksia Woodland","Aquatic Herbland","Aquatic Herbland","Alluvial Terraces Herb-rich Woodland","Alluvial Terraces Herb-rich Woodland","Cool Temperate Rainforest","Blackthorn Scrub","Aquatic Herbland","Cane Grass Wetland","Blackthorn Scrub","Aquatic Herbland","Chenopod Grassland","Alluvial Plains Semi-arid Grassland","Alluvial Terraces Herb-rich Woodland","Berm Grassy Shrubland","Coastal Headland Scrub","Alluvial Plains Semi-arid Grassland","Coast Banksia Woodland","Alpine Damp Grassland","Alluvial Terraces Herb-rich Woodland","Alluvial Terraces Herb-rich Woodland","Aquatic Herbland","Bird Colony Shrubland","Alluvial Terraces Herb-rich Woodland"]
["Crown land - conservation primary purpose","≥ 10 ha","Investment project","None","None",null,"Revegetation","< 10%","Central Victorian Uplands","CVU","Coastal Dune Scrub","Blackthorn Scrub","Aquatic Herbland","Blackthorn Scrub","Blackthorn Scrub","Banksia Woodland","Basalt Shrubby Woodland","Box Ironbark Forest","Aquatic Herbland","Cool Temperate Rainforest/Warm Temperate Rainf","Clay Heathland","Blackthorn Scrub","Chenopod Grassland","Cool Temperate Rainforest","Chenopod Grassland","Chenopod Mallee","Chenopod Mallee","Box Ironbark Forest","Bird Colony Shrubland","Coastal Tussock Grassland","Chenopod Mallee","Coastal Headland Scrub","Alpine Fen","Box Ironbark Forest","Aquatic Herbland","Basalt Creekline Shrubby Woodland","Blocked Coastal Stream Swamp","Aquatic Herbland"]
["Crown land - multiple and other purposes",null,null,"On-title agreement (voluntary)","On-title agreement",null,"Large scattered tree","< 50%, large logs absent","Dundas Tablelands","DT","Coastal Headland Scrub","Box Ironbark Forest","Basalt Creekline Shrubby Woodland","Brackish Sedgeland","Clay Heathland","Berm Grassy Shrubland","Bird Colony Succulent Herbland","Creekline Grassy Woodland","Basalt Shrubby Woodland","Damp Forest","Clay Heathland - treed","Box Ironbark Forest","Chenopod Mallee","Cool Temperate Rainforest/Warm Temperate Rainf","Chenopod Mallee","Dunefield Heathland","Disused Floodway Shrubby Herbland","Cane Grass Wetland","Cane Grass-Lignum Halophytic Herbland","Cool Temperate Rainforest","Dunefield Heathland","Coastal Tussock Grassland","Alpine Grassland","Cane Grass Wetland","Basalt Creekline Shrubby Woodland","Basalt Shrubby Woodland","Coast Banksia Woodland","Black Box Lignum Woodland"]
[null,"NV on property",null,"On-title agreement (req. of funding)","Transfer to Crown (funded)",null,"Medium scattered tree","≥ 50%, large logs absent","East Gippsland Lowlands","EGL","Coastal Saltmarsh","Clay Heathland","Basalt Shrubby Woodland","Clay Heathland","Clay Heathland - treed","Bird Colony Succulent Herbland","Brackish Sedgeland","Creekline Herb-rich Woodland","Claypan Ephemeral Wetland","Lowland Forest","Cool Temperate Rainforest","Clay Heathland","Damp Heathland","Damp Forest","Creekline Grassy Woodland","Floodplain Grassy Wetland","Floodplain Grassy Wetland","Clay Heathland","Clay Heathland","Damp Heath Scrub","Floodplain Grassy Wetland","Cool Temperate Rainforest","Alpine Valley Bog","Chenopod Grassland","Basalt Shrubby Woodland","Bird Colony Shrubland","Coastal Alkaline Scrub","Box Ironbark Forest"]
[null,"< 5 ha",null,null,"Transfer to Crown (non-funded)",null,null,"< 50%, large logs present","East Gippsland Uplands","EGU","Damp Sands Herb-rich Woodland","Clay Heathland - treed","Brackish Sedgeland","Clay Heathland - treed","Cool Temperate Rainforest","Blocked Coastal Stream Swamp","Brackish Wetland","Damp Sands Herb-rich Woodland","Creekline Grassy Woodland","Montane Damp Forest","Creekline Grassy Woodland","Cool Temperate Rainforest","Dunefield Heathland","Grassy Dry Forest","Dunefield Heathland","Floodway Pond Herbland","Floodway Pond Herbland","Clay Heathland - treed","Coastal Alkaline Scrub","Damp Sands Herb-rich Woodland","Floodway Pond Herbland","Damp Forest","Blackthorn Scrub","Chenopod Mallee","Berm Grassy Shrubland","Bird Colony Succulent Herbland","Coastal Headland Scrub","Brackish Sedgeland"]
[null,"5 to < 20 ha",null,null,null,null,null,"≥ 50%, large logs present","Gippsland Plain","GipP","Deep Freshwater Marsh","Creekline Grassy Woodland","Creekline Grassy Woodland","Coast Banksia Woodland","Damp Forest","Box Ironbark Forest","Coastal Alkaline Scrub","Drainage-line Woodland","Creekline Sedgy Woodland","Montane Dry Woodland","Damp Forest","Cool Temperate Rainforest/Warm Temperate Rainf","Heathy Mallee","Montane Damp Forest","Floodplain Grassy Wetland","Grassy Riverine Forest","Grassy Riverine Forest","Creekline Grassy Woodland","Coastal Dune Grassland","Estuarine Wetland","Grassy Riverine Forest","Damp Heathy Woodland","Cool Temperate Rainforest","Creekline Grassy Woodland","Box Ironbark Forest","Coast Gully Thicket","Coastal Lagoon Wetland","Brackish Wetland"]
["Management actions","≥ 20 ha",null,"Crown land ","Crown land",null,null,null,"Glenelg Plain","GleP","Estuarine Wetland","Creekline Herb-rich Woodland","Creekline Sedgy Woodland","Coastal Lagoon Wetland","Damp Sands Herb-rich Woodland","Brackish Grassland","Coastal Dune Scrub","Floodplain Riparian Woodland","Damp Forest","Montane Grassy Woodland","Damp Sands Herb-rich Woodland","Creekline Grassy Woodland","Heathy Woodland","Montane Dry Woodland","Floodplain Riparian Woodland","Heathy Mallee","Intermittent Swampy Woodland","Damp Forest","Coastal Dune Scrub","Floodplain Reedbed","Intermittent Swampy Woodland","Grassy Forest","Damp Forest","Damp Sands Herb-rich Woodland","Brackish Grassland","Coastal Dune Scrub","Coastal Saltmarsh","Cane Grass Wetland"]
["Yes",null,null,"None","None",null,null,"Length of logs to be introduced","Goldfields","GF","Freshwater Meadow","Damp Forest","Creekline Tussock Grassland","Coastal Saltmarsh","Dry Rainforest","Brackish Wetland","Coastal Headland Scrub","Granitic Grassy Woodland","Damp Heath Scrub","Montane Riparian Thicket","Dry Valley Forest","Creekline Herb-rich Woodland","Intermittent Swampy Woodland","Montane Grassy Woodland","Floodway Pond Herbland","Intermittent Swampy Woodland","Lake Bed Herbland","Floodplain Riparian Woodland","Coastal Headland Scrub","Grassy Dry Forest","Lake Bed Herbland","Grassy Woodland","Dry Valley Forest","Floodplain Riparian Woodland","Brackish Wetland","Coastal Headland Scrub","Coastal Sand Heathland","Chenopod Grassland"]
[null,null,null,null,"Sign Crown land offset MOU",null,null,"N/A","Greater Grampians","GG","Herb-rich Foothill Forest","Damp Sands Herb-rich Woodland","Damp Heathland","Coastal Sand Heathland","Dry Valley Forest","Calcareous Swale Grassland","Coastal Mallee Scrub","Granitic Hills Woodland","Damp Heathland","Montane Riparian Woodland","Floodplain Riparian Woodland","Damp Forest","Lake Bed Herbland","Montane Riparian Woodland","Grassy Riverine Forest","Lake Bed Herbland","Lignum Shrubland","Granitic Hills Woodland","Coastal Saltmarsh","Grassy Forest","Lignum Shrubland","Heathy Woodland","Granitic Hills Woodland","Floodway Pond Herbland","Cane Grass Wetland","Coastal Tussock Grassland","Coastal Tussock Grassland","Creekline Grassy Woodland"]
[null,null,null,null,"Reclassify to 'conservation' AND sign offset MOU",null,null,"< 10%","Highlands Far East","HFE","Shallow Freshwater Marsh","Escarpment Shrubland","Damp Heathy Woodland","Coastal Vine-rich Forest","Foothill Box Ironbark Forest","Clay Heathland","Coastal Sand Heathland","Grassy Dry Forest","Damp Sands Herb-rich Woodland","Montane Wet Forest","Granitic Hills Woodland","Damp Heathland","Lignum Swampy Woodland","Montane Wet Forest","Grassy Woodland","Lignum Shrubland","Lignum Swamp","Grassy Dry Forest","Coastal Tussock Grassland","Grassy Woodland","Lignum Swamp","Herb-rich Foothill Forest","Grassy Dry Forest","Granitic Hills Woodland","Cinder Cone Woodland","Damp Heath Scrub","Cool Temperate Rainforest","Creekline Herb-rich Woodland"]
[null,null,null,null,null,null,null,"> 10%","Highlands Northern Fall","HNF","Spray-zone Coastal Shrubland","Escarpment Shrubland - treed","Damp Sands Herb-rich Woodland","Damp Forest","Gallery Rainforest","Coast Banksia Woodland","Creekline Grassy Woodland","Heathy Dry Forest","Dry Creekline Woodland","Riparian Forest","Grassy Dry Forest","Damp Heathy Woodland","Loamy Sands Mallee","Riparian Forest","Intermittent Swampy Woodland","Lignum Swamp","Lignum Swampy Woodland","Heathy Dry Forest","Creekline Grassy Woodland","Heathy Woodland","Lignum Swampy Woodland","Lowland Forest","Grassy Woodland","Grassy Dry Forest","Coast Banksia Woodland","Damp Sands Herb-rich Woodland","Damp Forest","Creekline Sedgy Woodland"]
[null,null,null,null,null,null,null,null,"Highlands Southern Fall","HSF","Swamp Scrub","Floodplain Riparian Woodland","Dry Creekline Woodland","Damp Sands Herb-rich Woodland","Grassy Dry Forest","Coastal Alkaline Scrub","Creekline Herb-rich Woodland","Heathy Woodland","Floodplain Thicket","Rocky Outcrop Shrubland","Grassy Woodland","Damp Sands Herb-rich Woodland","Low Rises Woodland","Rocky Outcrop Shrubland","Lake Bed Herbland","Lignum Swampy Woodland","Low Chenopod Shrubland","Herb-rich Foothill Forest","Damp Heath Scrub","Herb-rich Foothill Forest","Loamy Sands Mallee","Plains Grassy Forest","Heathy Dry Forest","Grassy Riverine Forest","Coastal Alkaline Scrub","Deep Freshwater Marsh","Damp Sands Herb-rich Woodland","Damp Heathland"]
["Dropdown lists for 'manually enter' buttons",null,null,null,"Options for 'habitat units':",null,null,null,"Lowan Mallee","LM",null,"Granitic Grassy Woodland","Dune Soak Woodland","Dry Rainforest","Heathy Dry Forest","Coastal Dune Grassland","Creekline Sedgy Woodland","Herb-rich Foothill Forest","Freshwater Meadow","Shrubby Dry Forest","Heathy Dry Forest","Dry Rainforest","Lowan Sands Mallee","Shrubby Dry Forest","Lignum Shrubland","Loamy Sands Mallee","Riverine Chenopod Woodland","Lignum Swampy Woodland","Damp Sands Herb-rich Woodland","Lowland Forest","Low Chenopod Shrubland","Plains Grassy Woodland","Herb-rich Foothill Forest","Heathy Dry Forest","Coastal Dune Scrub","Estuarine Wetland","Estuarine Flats Grassland","Damp Sands Herb-rich Woodland"]
["Standardiser","EVC BCS","Veg type",null,"Type of score",null,null,null,"Monaro Tablelands","MT",null,"Granitic Hills Woodland","Escarpment Shrubland","Dry Valley Forest","Herb-rich Foothill Forest","Coastal Dune Scrub","Damp Heathland","Hillcrest Herb-rich Woodland","Grassy Dry Forest","Tableland Damp Forest","Heathy Woodland","Dry Valley Forest","Parilla Mallee","Sub-alpine Woodland","Lignum Swamp","Low Chenopod Shrubland","Semi-arid Chenopod Woodland","Low Rises Grassy Woodland","Estuarine Swamp Scrub","Riparian Forest","Plains Grassland","Riparian Forest","Late-lying Snowpatch Herbland","Herb-rich Foothill Forest","Coastal Headland Scrub","Freshwater Meadow","Estuarine Wetland","Deep Freshwater Marsh"]
[1,"Least Concern","Woody",null,"SBV",null,null,null,"Murray Fans","MF",null,"Grassy Dry Forest","Escarpment Shrubland - treed","Estuarine Swamp Scrub","Limestone Box Forest","Coastal Headland Scrub","Damp Heathy Woodland","Hills Herb-rich Woodland","Grassy Woodland","Valley Grassy Forest","Herb-rich Foothill Forest","Escarpment Shrubland","Plains Grassland","Tableland Damp Forest","Lignum Swampy Woodland","Low Rises Woodland","Semi-arid Chenopod Woodland - non-treed","Montane Damp Forest","Estuarine Wetland","Scoria Cone Woodland","Plains Woodland","Riparian Scrub","Montane Damp Forest","Intermittent Swampy Woodland","Coastal Saltmarsh","Grassy Woodland","Granitic Hills Woodland","Drainage-line Woodland"]
[1.1499999999999999,"Depleted","High rain. VVP/GiP grassland",null,"HIS",null,null,null,"Murray Mallee","MM",null,"Grassy Forest","Floodplain Riparian Woodland","Estuarine Wetland","Limestone Grassy Woodland","Coastal Lagoon Wetland","Damp Sands Herb-rich Woodland","Lateritic Woodland","Heathland Thicket","Warm Temperate Rainforest","Lake Bed Herbland","Escarpment Shrubland - treed","Plains Savannah","Valley Grassy Forest","Loamy Sands Mallee","Lowan Sands Mallee","Semi-arid Woodland","Montane Dry Woodland","Floodplain Reedbed","Sedgy Riparian Woodland","Ridged Plains Mallee","Sand Heathland","Montane Dry Woodland","Lake Bed Herbland","Coastal Tussock Grassland","Heathy Woodland","Heathy Woodland","Dry Creekline Woodland"]
[1.25,"Rare","Other grassland",null,null,null,null,null,"Murray Scroll Belt","MSB",null,"Grassy Woodland","Floodplain Thicket","Floodplain Reedbed","Limestone Pomaderris Shrubland","Coastal Saltmarsh","Deep Freshwater Marsh","Lignum Swamp","Heathy Dry Forest","Wet Forest","Limestone Montane Grassland","Floodplain Riparian Woodland","Plains Savannah - treed","Wet Forest","Low Chenopod Shrubland","Parilla Mallee","Shallow Freshwater Marsh","Mountain Valley Riparian Woodland","Floodplain Riparian Woodland","Shrubby Dry Forest","Riverine Chenopod Woodland","Shrubby Foothill Forest","Montane Grassy Woodland","Lignum Swamp","Creekline Grassy Woodland","Herb-rich Foothill Forest","Lowland Forest","Dune Soak Woodland"]
[1.36,"Vulnerable","Non-woody wetland",null,null,null,null,null,"Northern Inland Slopes","NIS",null,"Heathy Dry Forest","Freshwater Lignum Shrubland","Gallery Rainforest","Limestone Pomaderris Shrubland - treed","Coastal Tussock Grassland","Escarpment Shrubland","Low Rises Grassy Woodland","Heathy Woodland",null,"Lowland Forest","Grassy Dry Forest","Plains Woodland",null,"Low Rises Woodland","Plains Grassland","Shrubby Riverine Woodland","Plains Grassland","Grassy Forest","Shrubby Foothill Forest","Riverine Grassy Woodland","Swamp Scrub","Montane Herb-rich Woodland","Lignum Swampy Woodland","Creekline Herb-rich Woodland","Lowland Forest","Mangrove Shrubland","Dunefield Heathland"]
[null,"Endangered",null,null,null,null,null,null,"Otway Plain","OP",null,"Heathy Woodland","Freshwater Meadow","Grassy Dry Forest","Lowland Forest","Creekline Grassy Woodland","Escarpment Shrubland - treed","Metamorphic Slopes Shrubby Woodland","Herb-rich Foothill Forest",null,"Montane Damp Forest","Grassy Forest","Red Gum Swamp",null,"Lunette Woodland","Plains Savannah","Spike-sedge Wetland","Plains Grassy Wetland","Grassy Woodland","Shrubby Wet Forest","Sedgy Riverine Forest","Swampy Riparian Woodland","Montane Riparian Thicket","Low Rises Grassy Woodland","Creekline Tussock Grassland","Plains Grassy Wetland","Montane Rocky Shrubland","Escarpment Shrubland"]
[null,null,null,null,null,null,null,null,"Otway Ranges","OR",null,"Herb-rich Foothill Forest","Grassy Woodland","Heathy Dry Forest","Lowland Herb-rich Forest","Creekline Herb-rich Woodland","Floodplain Riparian Woodland","Plains Grassland","Herb-rich Heathy Forest",null,"Montane Dry Woodland","Grassy Woodland","Red Swale Mallee",null,"Plains Grassland","Plains Savannah - treed","Sub-saline Depression Shrubland","Plains Grassy Woodland","Heathy Woodland","Swamp Scrub","Semi-arid Chenopod Woodland","Swampy Woodland","Montane Riparian Woodland","Low Rises Woodland","Damp Heathland","Plains Grassy Woodland","Riparian Forest","Escarpment Shrubland - treed"]
[null,null,null,null,null,null,null,null,"Robinvale Plains","RP",null,"Hillcrest Herb-rich Woodland","Heathland Thicket","Heathy Woodland","Montane Damp Forest","Damp Forest","Freshwater Lignum Shrubland","Plains Grassy Wetland","Hills Herb-rich Woodland",null,"Montane Grassland","Gully Woodland","Ridged Plains Mallee",null,"Plains Grassy Wetland","Plains Woodland","Woorinen Mallee","Plains Savannah","Herb-rich Foothill Forest","Swampy Riparian Woodland","Semi-arid Chenopod Woodland - non-treed","Warm Temperate Rainforest","Montane Riparian Woodland - treed","Lunette Woodland","Damp Heathy Woodland","Plains Sedgy Wetland","Riparian Scrub","Floodplain Riparian Woodland"]
[null,null,null,null,null,null,null,null,"Strzelecki Ranges","SR",null,"Hills Herb-rich Woodland","Heathy Dry Forest","Herb-rich Foothill Forest","Montane Dry Woodland","Damp Heathland","Freshwater Meadow","Plains Grassy Woodland","Lateritic Woodland",null,"Montane Grassy Shrubland","Heathy Dry Forest","Riparian Woodland",null,"Plains Savannah","Red Swale Mallee","Woorinen Sands Mallee","Plains Savannah - treed","Lignum Swamp","Wet Forest","Semi-arid Parilla Woodland","Wet Forest","Montane Rocky Shrubland","Mountain Valley Riparian Woodland","Damp Sands Herb-rich Woodland","Plains Swampy Woodland","Rocky Outcrop Shrubland","Freshwater Lignum Shrubland"]
[null,null,null,null,null,null,null,null,"Victorian Alps","VA",null,"Lowland Forest","Heathy Herb-rich Woodland","Limestone Box Forest","Montane Grassy Woodland","Damp Heathy Woodland","Heathy Herb-rich Woodland","Plains Woodland","Lowland Forest",null,"Montane Grassy Shrubland - treed","Heathy Woodland","Riverine Chenopod Woodland",null,"Plains Savannah - treed","Ridged Plains Mallee",null,"Plains Woodland","Lowland Forest","Wet Heathland","Semi-arid Woodland","Wet Heathland","Montane Wet Forest","Plains Grassland","Deep Freshwater Marsh","Riparian Forest","Sand Heathland","Freshwater Meadow"]
[null,null,null,null,null,null,null,null,"Victorian Riverina","VR",null,"Montane Grassy Woodland","Heathy Woodland","Limestone Grassy Woodland","Montane Herb-rich Woodland","Damp Sands Herb-rich Woodland","Heathy Woodland","Red Gum Swamp","Montane Grassy Woodland",null,"Montane Grassy Woodland","Herb-rich Foothill Forest","Riverine Grassy Woodland",null,"Plains Woodland","Riparian Woodland",null,"Rainshadow Grassy Woodland","Mangrove Shrubland","Wet Sands Thicket","Shallow Freshwater Marsh","Wet Sands Thicket","Riparian Forest","Plains Grassy Wetland","Escarpment Shrubland","Scoria Cone Woodland","Sedge Wetland","Grassy Dry Forest"]
[null,null,null,null,null,null,null,null,"Victorian Volcanic Plain","VVP",null,"Mountain Valley Riparian Woodland","Herb-rich Foothill Forest","Limestone Pomaderris Shrubland","Montane Riparian Thicket","Deep Freshwater Marsh","Herb-rich Foothill Forest","Riparian Shrubland","Montane Rocky Shrubland",null,"Montane Herb-rich Woodland","Limestone Box Forest","Salt Paperbark Woodland",null,"Red Gum Swamp","Riverine Chenopod Woodland",null,"Red Gum Swamp","Plains Brackish Sedge Wetland",null,"Shrubby Riverine Woodland","Wetland Formation","Riparian Shrubland","Plains Grassy Woodland","Escarpment Shrubland - treed","Sedge Wetland","Shrubby Foothill Forest","Grassy Woodland"]
[null,null,null,null,null,null,null,null,"Warrnambool Plain","WarP",null,"Plains Grassland","Hills Herb-rich Woodland","Lowland Forest","Montane Riparian Woodland","Dry Rainforest","Hills Herb-rich Woodland","Riparian Woodland","Montane Wet Heathland",null,"Montane Riparian Thicket","Lowland Forest","Samphire Shrubland",null,"Ridged Plains Mallee","Riverine Grassy Woodland",null,"Riparian Forest","Plains Freshwater Sedge Wetland",null,"Spike-sedge Wetland",null,"Riverine Escarpment Scrub","Plains Saltmarsh","Estuarine Flats Grassland","Sedgy Riparian Woodland","Spray-zone Coastal Shrubland","Heathy Herb-rich Woodland"]
[null,null,null,null,null,null,null,null,"Wilsons Promontory","WilP",null,"Plains Grassy Wetland","Lateritic Woodland","Lowland Herb-rich Forest","Montane Swamp","Dry Valley Forest","Lateritic Woodland","Riverine Grassy Woodland","Plains Grassy Wetland",null,"Montane Riparian Woodland","Lowland Herb-rich Forest","Sandstone Ridge Shrubland",null,"Riparian Woodland","Salt Paperbark Woodland",null,"Riparian Shrubland","Plains Grassland",null,"Sub-saline Depression Shrubland",null,"Rocky Outcrop Shrubland","Plains Savannah","Estuarine Wetland","Shallow Freshwater Marsh","Swamp Scrub","Heathy Mallee"]
[null,null,null,null,null,null,null,null,"Wimmera","Wim",null,"Plains Grassy Woodland","Lowland Forest","Plains Grassy Forest","Montane Wet Forest","Escarpment Shrubland","Limestone Pomaderris Shrubland","Riverine Swampy Woodland","Plains Grassy Woodland",null,"Montane Swamp","Montane Damp Forest","Sandstone Ridge Shrubland - treed",null,"Riverine Chenopod Woodland","Samphire Shrubland",null,"Riverine Chenopod Woodland","Plains Grassy Wetland",null,"Tall Marsh",null,"Shrubby Damp Forest","Plains Savannah - treed","Floodplain Riparian Woodland","Shrubby Foothill Forest","Warm Temperate Rainforest","Heathy Woodland"]
[null,null,null,null,null,null,null,null,null,null,null,"Plains Sedgy Wetland","Lunette Woodland","Plains Grassy Wetland","Rainshadow Grassy Woodland","Escarpment Shrubland - treed","Limestone Ridge Woodland","Rocky Outcrop Shrubland","Plains Sedgy Wetland",null,"Montane Wet Forest","Montane Dry Woodland","Seasonally Inundated Shrubby Woodland",null,"Riverine Ephemeral Wetland","Sandstone Ridge Shrubland",null,"Riverine Escarpment Scrub","Plains Grassy Woodland",null,"Woorinen Mallee",null,"Shrubby Dry Forest","Plains Woodland","Freshwater Lignum Shrubland","Shrubby Wet Forest","Wet Forest","Higher Rainfall Shallow Sands Woodland"]
[null,null,null,null,null,null,null,null,null,null,null,"Plains Woodland","Plains Grassland","Plains Grassy Woodland","Riparian Forest","Estuarine Flats Grassland","Limestone Woodland","Sand Ridge Woodland","Plains Sedgy Woodland",null,"Perched Boggy Shrubland","Montane Grassy Woodland","Semi-arid Chenopod Woodland",null,"Riverine Grassland","Sandstone Ridge Shrubland - treed",null,"Riverine Grassy Woodland","Plains Sedgy Wetland",null,"Woorinen Sands Mallee",null,"Shrubby Foothill Forest","Red Gum Swamp","Freshwater Meadow","Stony Rises Woodland","Wet Heathland","Hillcrest Herb-rich Woodland"]
[null,null,null,null,null,null,null,null,null,null,null,"Red Gum Swamp","Plains Grassy Wetland","Rainshadow Grassy Woodland","Riparian Shrubland","Estuarine Scrub","Lowland Forest","Sandstone Ridge Shrubland","Plains Woodland",null,"Plains Grassy Woodland","Montane Herb-rich Woodland","Semi-arid Chenopod Woodland - non-treed",null,"Riverine Grassy Woodland","Sedgy Riverine Forest",null,"Riverine Swampy Woodland","Riparian Forest",null,null,null,"Shrubby Wet Forest","Ridged Plains Mallee","Granitic Hills Woodland","Swamp Scrub","Wet Rocky Outcrop Scrub","Hills Herb-rich Woodland"]
[null,null,null,null,null,null,null,null,null,null,null,"Riparian Forest","Plains Grassy Woodland","Riparian Forest","Riverine Escarpment Scrub","Estuarine Wetland","Lunette Woodland","Scoria Cone Woodland","Red Gum Swamp",null,"Riparian Forest","Montane Riparian Thicket","Semi-arid Woodland",null,"Riverine Swamp Forest","Semi-arid Chenopod Woodland",null,"Rocky Outcrop Shrubland","Sand Heathland",null,null,null,"Snowpatch Grassland","Riparian Forest","Grassy Dry Forest","Swampy Riparian Woodland","Wet Swale Herbland","Inland Saltmarsh"]
[null,null,null,null,null,null,null,null,null,null,null,"Riparian Scrub","Plains Sedgy Wetland","Riparian Scrub","Rocky Outcrop Shrubland","Floodplain Reedbed","Plains Grassy Wetland","Sedge-rich Woodland","Riparian Forest",null,"Riparian Scrub","Montane Riparian Woodland","Shallow Sands Woodland",null,"Riverine Swampy Woodland","Semi-arid Chenopod Woodland - non-treed",null,"Samphire Shrubland","Seasonally Inundated Sub-saline Herbland",null,null,null,"Sub-alpine Dry Shrubland","Riparian Shrubland","Grassy Forest","Tall Marsh","Wetland Formation","Intermittent Swampy Woodland"]
[null,null,null,null,null,null,null,null,null,null,null,"Riparian Shrubland","Plains Sedgy Woodland","Riparian Shrubland","Sand Heathland","Floodplain Riparian Woodland","Plains Grassy Woodland","Sedgy Riparian Woodland","Riparian Scrub",null,"Riparian Shrubland","Montane Rocky Shrubland","Tea-tree Scrub",null,"Rushy Riverine Swamp","Semi-arid Parilla Woodland",null,"Sandstone Ridge Shrubland","Sedgy Riparian Woodland",null,null,null,"Sub-alpine Grassland","Riparian Woodland","Grassy Woodland","Wet Heathland",null,"Lateritic Woodland"]
[null,null,null,null,null,null,null,null,null,null,null,"Riparian Woodland","Plains Swampy Woodland","Riverine Escarpment Scrub","Sand Heathland - treed","Gallery Rainforest","Plains Sedgy Wetland","Semi-arid Woodland","Riparian Shrubland",null,"Riparian Thicket","Montane Wet Forest","Woorinen Mallee",null,"Samphire Shrubland","Semi-arid Woodland",null,"Sandstone Ridge Shrubland - treed","Shallow Freshwater Marsh",null,null,null,"Sub-alpine Riparian Shrubland","Riverina Plains Grassy Woodland (syn. Plain","Grassy Woodland - Non-Eucalypt",null,null,"Lignum Cane Grass Swamp"]
[null,null,null,null,null,null,null,null,null,null,null,"Riverine Escarpment Scrub","Plains Woodland","Rocky Outcrop Shrubland","Shrubby Damp Forest","Granitic Hills Woodland","Plains Sedgy Woodland","Shrubby Dry Forest","Riparian Woodland",null,"Riverine Escarpment Scrub","Plains Grassland","Woorinen Sands Mallee",null,"Sand Ridge Woodland","Shallow Freshwater Marsh",null,"Shallow Sands Woodland","Shrubby Dry Forest",null,null,null,"Sub-alpine Shrubland","Riverine Chenopod Woodland","Heathy Dry Forest",null,null,"Lignum Swamp"]
[null,null,null,null,null,null,null,null,null,null,null,"Rocky Chenopod Woodland","Red Gum Swamp","Sandy Flood Scrub","Shrubby Dry Forest","Grassy Dry Forest","Plains Swampy Woodland","Shrubby Woodland","Rocky Outcrop Herbland",null,"Rocky Outcrop Shrubland","Plains Grassy Forest",null,null,"Sedgy Riverine Forest","Shallow Sands Woodland",null,"Shrubby Dry Forest","Shrubby Foothill Forest",null,null,null,"Sub-alpine Wet Heathland","Riverine Escarpment Scrub","Heathy Woodland",null,null,"Lignum Swampy Woodland"]
[null,null,null,null,null,null,null,null,null,null,null,"Rocky Outcrop Shrubland","Riparian Scrub","Shrubby Damp Forest","Shrubby Foothill Forest","Grassy Forest","Plains Woodland","Stream Bank Shrubland","Rocky Outcrop Shrubland",null,"Shrubby Dry Forest","Plains Grassy Wetland",null,null,"Semi-arid Chenopod Woodland","Shrubby Riverine Woodland",null,"Shrubby Granitic-outwash Grassy Woodland","Shrubby Wet Forest",null,null,null,"Sub-alpine Woodland","Riverine Grassy Woodland","Herb-rich Foothill Forest",null,null,"Low Chenopod Shrubland"]
[null,null,null,null,null,null,null,null,null,null,null,"Sand Forest","Riparian Shrubland","Shrubby Dry Forest","Shrubby Wet Forest","Grassy Woodland","Red Gum Swamp","Swamp Scrub","Sand Forest",null,"Shrubby Foothill Forest","Plains Grassy Woodland",null,null,"Semi-arid Woodland","Tall Marsh",null,"Spring Soak Woodland","Stony Rises Woodland",null,null,null,"Swampy Riparian Woodland","Riverine Swamp Forest","Hills Herb-rich Woodland",null,null,"Low Rises Woodland"]
[null,null,null,null,null,null,null,null,null,null,null,"Sand Heathland","Riparian Woodland","Swamp Scrub","Sub-alpine Grassland","Gully Woodland","Riparian Forest","Swampy Riparian Woodland","Sand Heathland",null,"Shrubby Wet Forest","Riparian Forest",null,null,"Shallow Freshwater Marsh","Woorinen Mallee",null,"Swampy Riparian Woodland","Stream Bank Shrubland",null,null,null,"Tableland Damp Forest","Riverine Swampy Woodland","Lignum Cane Grass Swamp",null,null,"Lowan Sands Mallee"]
[null,null,null,null,null,null,null,null,null,null,null,"Sand Heathland - treed","Rocky Outcrop Herbland","Valley Grassy Forest","Sub-alpine Shrubland","Heathy Woodland","Riparian Scrub","Valley Grassy Forest","Seasonally Inundated Shrubby Woodland",null,"Sub-alpine Dry Shrubland","Riparian Scrub",null,null,"Shallow Sands Woodland","Woorinen Sands Mallee",null,"Swampy Woodland","Swamp Scrub",null,null,null,"Wet Forest","Rocky Outcrop Shrubland","Lignum Swamp",null,null,"Lower Rainfall Shallow Sands Woodland"]
[null,null,null,null,null,null,null,null,null,null,null,"Scoria Cone Woodland","Rocky Outcrop Shrubland","Valley Slopes Dry Forest","Sub-alpine Woodland","Herb-rich Foothill Forest","Riparian Woodland","Valley Heathy Forest","Sedge Wetland",null,"Sub-alpine Grassland","Riparian Shrubland",null,null,"Shrubby Riverine Woodland",null,null,"Valley Grassy Forest","Swampy Riparian Woodland",null,null,null,null,"Rushy Riverine Swamp","Lowland Forest",null,null,"Lunette Woodland"]
[null,null,null,null,null,null,null,null,null,null,null,"Seasonally Inundated Shrubby Woodland","Sand Forest","Warm Temperate Rainforest","Swampy Riparian Woodland","Limestone Box Forest","Sand Heathland","Wetland Formation","Sedgy Riparian Woodland",null,"Sub-alpine Wet Heathland","Riparian Thicket",null,null,"Spike-sedge Wetland",null,null,"Wet Forest","Tall Marsh",null,null,null,null,"Samphire Shrubland","Lunette Woodland",null,null,"Metamorphic Slopes Shrubby Woodland"]
[null,null,null,null,null,null,null,null,null,null,null,"Sedge Wetland","Sand Heathland","Wet Forest","Tableland Damp Forest","Limestone Pomaderris Shrubland","Sandy Stream Woodland",null,"Shallow Freshwater Marsh",null,"Sub-alpine Woodland","Riparian Woodland",null,null,"Tall Marsh",null,null,"Wetland Formation","Wet Forest",null,null,null,null,"Sand Ridge Woodland","Mangrove Shrubland",null,null,"Northern Wimmera Riverine Chenopod Woodland"]
[null,null,null,null,null,null,null,null,null,null,null,"Sedgy Riparian Woodland","Sandy Stream Woodland","Wet Heathland","Valley Grassy Forest","Limestone Pomaderris Shrubland - treed","Seasonally Inundated Shrubby Woodland",null,"Shallow Sands Woodland",null,"Swampy Riparian Woodland","Riverine Escarpment Scrub",null,null,"Wetland Formation",null,null,null,"Wet Heathland",null,null,null,null,"Sandstone Ridge Shrubland","Plains Grassland - Heavier-soils ",null,null,"Parilla Mallee"]
[null,null,null,null,null,null,null,null,null,null,null,"Shallow Sands Woodland","Seasonally Inundated Shrubby Woodland","Wet Swale Herbland","Valley Heathy Forest","Lowland Forest","Sedge Wetland",null,"Shrubby Foothill Forest",null,"Swampy Woodland","Rocky Outcrop Shrubland",null,null,"Woorinen Mallee",null,null,null,"Wet Sands Thicket",null,null,null,null,"Sandstone Ridge Shrubland - treed","Plains Grassland - Lighter-soils ",null,null,"Plains Grassland"]
[null,null,null,null,null,null,null,null,null,null,null,"Shrubby Dry Forest","Sedge Wetland",null,"Valley Slopes Dry Forest","Lowland Herb-rich Forest","Sedgy Riparian Woodland",null,"Shrubby Woodland",null,"Tableland Damp Forest","Shrubby Damp Forest",null,null,"Woorinen Sands Mallee",null,null,null,"Wetland Formation",null,null,null,null,"Sedgy Riverine Forest","Plains Grassland - Low-rainfall ",null,null,"Plains Grassy Wetland"]
[null,null,null,null,null,null,null,null,null,null,null,"Shrubby Foothill Forest","Sedgy Riparian Woodland",null,"Warm Temperate Rainforest","Mangrove Shrubland","Sedgy Swamp Woodland",null,"Stony Rises Woodland",null,"Valley Grassy Forest","Shrubby Dry Forest",null,null,null,null,null,null,null,null,null,null,null,"Semi-arid Chenopod Woodland","Plains Grassy Wetland",null,null,"Plains Grassy Woodland"]
[null,null,null,null,null,null,null,null,null,null,null,"Shrubby Woodland","Shallow Freshwater Marsh",null,"Wet Forest","Plains Grassland - LaTrobe Valley ","Shallow Freshwater Marsh",null,"Swamp Scrub",null,"Valley Heathy Forest","Shrubby Foothill Forest",null,null,null,null,null,null,null,null,null,null,null,"Semi-arid Chenopod Woodland - non-treed","Plains Grassy Woodland",null,null,"Plains Riparian Shrubby Woodland"]
[null,null,null,null,null,null,null,null,null,null,null,"Spring Soak Woodland","Shallow Sands Woodland",null,"Wet Heathland","Plains Grassland - South Gippsland ","Shallow Sands Woodland",null,"Tall Marsh",null,"Warm Temperate Rainforest","Shrubby Gully Forest",null,null,null,null,null,null,null,null,null,null,null,"Semi-arid Woodland","Plains Grassy Woodland - higher rainfall",null,null,"Plains Savannah"]
[null,null,null,null,null,null,null,null,null,null,null,"Stream Bank Shrubland","Shrubby Woodland",null,null,"Plains Grassy Forest","Spray-zone Coastal Shrubland",null,"Valley Grassy Forest",null,"Wet Forest","Shrubby Wet Forest",null,null,null,null,null,null,null,null,null,null,null,"Shallow Sands Woodland","Plains Grassy Woodland - Riverina (syn. EVC 8)",null,null,"Plains Savannah - treed"]
[null,null,null,null,null,null,null,null,null,null,null,"Swamp Scrub","Stony Knoll Shrubland",null,null,"Plains Grassy Wetland","Swamp Scrub",null,"Wet Forest",null,null,"Stream Bank Shrubland",null,null,null,null,null,null,null,null,null,null,null,"Shrubby Dry Forest","Plains Sedgy Wetland",null,null,"Plains Sedgy Wetland"]
[null,null,null,null,null,null,null,null,null,null,null,"Swampy Riparian Woodland","Stony Knoll Shrubland - treed",null,null,"Plains Grassy Woodland","Wet Forest",null,"Wet Heathland",null,null,"Stream Bank Shrubland - treed",null,null,null,null,null,null,null,null,null,null,null,"Shrubby Granitic-outwash Grassy Woodland","Plains Sedgy Woodland",null,null,"Plains Sedgy Woodland"]
[null,null,null,null,null,null,null,null,null,null,null,"Swampy Woodland","Swamp Scrub",null,null,"Plains Swampy Woodland","Wet Heathland",null,null,null,null,"Sub-alpine Grassland",null,null,null,null,null,null,null,null,null,null,null,"Spike-sedge Wetland","Plains Swampy Woodland",null,null,"Plains Swampy Woodland"]
[null,null,null,null,null,null,null,null,null,null,null,"Valley Grassy Forest","Tall Marsh",null,null,"Riparian Forest",null,null,null,null,null,"Sub-alpine Wet Heathland",null,null,null,null,null,null,null,null,null,null,null,"Spring Soak Woodland","Plains Woodland",null,null,"Plains Woodland"]
[null,null,null,null,null,null,null,null,null,null,null,"Valley Heathy Forest","Wet Heathland",null,null,"Riparian Scrub",null,null,null,null,null,"Sub-alpine Woodland",null,null,null,null,null,null,null,null,null,null,null,"Swampy Riparian Woodland","Red Gum Swamp",null,null,"Red Gum Swamp"]
[null,null,null,null,null,null,null,null,null,null,null,"Valley Slopes Dry Forest",null,null,null,"Riparian Shrubland",null,null,null,null,null,"Swamp Scrub",null,null,null,null,null,null,null,null,null,null,null,"Swampy Woodland","Riparian Forest",null,null,"Red Swale Mallee"]
[null,null,null,null,null,null,null,null,null,null,null,"Wet Forest",null,null,null,"Riparian Thicket",null,null,null,null,null,"Swampy Riparian Woodland",null,null,null,null,null,null,null,null,null,null,null,"Tall Marsh","Riparian Scrub",null,null,"Ridged Plains Mallee"]
[null,null,null,null,null,null,null,null,null,null,null,"Wetland Formation",null,null,null,"Riparian Woodland",null,null,null,null,null,"Swampy Woodland",null,null,null,null,null,null,null,null,null,null,null,"Valley Grassy Forest","Riparian Woodland",null,null,"Riparian Scrub"]
[null,null,null,null,null,null,null,null,null,null,null,null,null,null,null,"Riverine Escarpment Scrub",null,null,null,null,null,"Tableland Damp Forest",null,null,null,null,null,null,null,null,null,null,null,"Valley Heathy Forest","Rocky Chenopod Woodland",null,null,"Riparian Shrubland"]
[null,null,null,null,null,null,null,null,null,null,null,null,null,null,null,"Sand Forest",null,null,null,null,null,"Valley Grassy Forest",null,null,null,null,null,null,null,null,null,null,null,"Wetland Formation","Sand Forest",null,null,"Riparian Woodland"]
[null,null,null,null,null,null,null,null,null,null,null,null,null,null,null,"Sand Heathland",null,null,null,null,null,"Valley Heathy Forest",null,null,null,null,null,null,null,null,null,null,null,"Woorinen Mallee","Sand Heathland",null,null,"Rocky Outcrop Shrubland"]
[null,null,null,null,null,null,null,null,null,null,null,null,null,null,null,"Sandy Flood Scrub",null,null,null,null,null,"Valley Slopes Dry Forest",null,null,null,null,null,null,null,null,null,null,null,null,"Sand Heathland - treed",null,null,"Salt Paperbark Woodland"]
[null,null,null,null,null,null,null,null,null,null,null,null,null,null,null,"Sandy Stream Woodland",null,null,null,null,null,"Warm Temperate Rainforest",null,null,null,null,null,null,null,null,null,null,null,null,"Scoria Cone Woodland",null,null,"Samphire Shrubland"]
[null,null,null,null,null,null,null,null,null,null,null,null,null,null,null,"Seasonally Inundated Shrubby Woodland",null,null,null,null,null,"Wet Forest",null,null,null,null,null,null,null,null,null,null,null,null,"Seasonally Inundated Shrubby Woodland",null,null,"Sand Forest"]
[null,null,null,null,null,null,null,null,null,null,null,null,null,null,null,"Sedge Wetland",null,null,null,null,null,"Wet Heathland",null,null,null,null,null,null,null,null,null,null,null,null,"Sedge Wetland",null,null,"Sand Heathland"]
[null,null,null,null,null,null,null,null,null,null,null,null,null,null,null,"Sedgy Swamp Woodland",null,null,null,null,null,"Wetland Formation",null,null,null,null,null,null,null,null,null,null,null,null,"Sedgy Riparian Woodland",null,null,"Sand Ridge Woodland"]
[null,null,null,null,null,null,null,null,null,null,null,null,null,null,null,"Shrubby Damp Forest",null,null,null,null,null,null,null,null,null,null,null,null,null,null,null,null,null,null,"Shallow Freshwater Marsh",null,null,"Sandstone Ridge Shrubland"]
[null,null,null,null,null,null,null,null,null,null,null,null,null,null,null,"Shrubby Dry Forest",null,null,null,null,null,null,null,null,null,null,null,null,null,null,null,null,null,null,"Shrubby Dry Forest",null,null,"Sandy Stream Woodland"]
[null,null,null,null,null,null,null,null,null,null,null,null,null,null,null,"Shrubby Foothill Forest",null,null,null,null,null,null,null,null,null,null,null,null,null,null,null,null,null,null,"Shrubby Foothill Forest",null,null,"Scree-slope Woodland"]
[null,null,null,null,null,null,null,null,null,null,null,null,null,null,null,"Shrubby Gully Forest",null,null,null,null,null,null,null,null,null,null,null,null,null,null,null,null,null,null,"Stony Knoll Shrubland",null,null,"Seasonally Inundated Shrubby Woodland"]
[null,null,null,null,null,null,null,null,null,null,null,null,null,null,null,"Spray-zone Coastal Shrubland",null,null,null,null,null,null,null,null,null,null,null,null,null,null,null,null,null,null,"Stony Knoll Shrubland - treed",null,null,"Sedge Wetland"]
[null,null,null,null,null,null,null,null,null,null,null,null,null,null,null,"Swamp Scrub",null,null,null,null,null,null,null,null,null,null,null,null,null,null,null,null,null,null,"Stony Rises Woodland",null,null,"Sedge-rich Woodland"]
[null,null,null,null,null,null,null,null,null,null,null,null,null,null,null,"Swampy Riparian Woodland",null,null,null,null,null,null,null,null,null,null,null,null,null,null,null,null,null,null,"Stream Bank Shrubland",null,null,"Semi-arid Chenopod Woodland"]
[null,null,null,null,null,null,null,null,null,null,null,null,null,null,null,"Swampy Woodland",null,null,null,null,null,null,null,null,null,null,null,null,null,null,null,null,null,null,"Stream Bank Shrubland - treed",null,null,"Semi-arid Woodland"]
[null,null,null,null,null,null,null,null,null,null,null,null,null,null,null,"Tall Marsh",null,null,null,null,null,null,null,null,null,null,null,null,null,null,null,null,null,null,"Swamp Scrub",null,null,"Shallow Freshwater Marsh"]
[null,null,null,null,null,null,null,null,null,null,null,null,null,null,null,"Valley Grassy Forest",null,null,null,null,null,null,null,null,null,null,null,null,null,null,null,null,null,null,"Swampy Riparian Woodland",null,null,"Shrubby Woodland"]
[null,null,null,null,null,null,null,null,null,null,null,null,null,null,null,"Valley Heathy Forest",null,null,null,null,null,null,null,null,null,null,null,null,null,null,null,null,null,null,"Swampy Woodland",null,null,"Southern Wimmera Riverine Chenopod Woodland"]
[null,null,null,null,null,null,null,null,null,null,null,null,null,null,null,"Warm Temperate Rainforest",null,null,null,null,null,null,null,null,null,null,null,null,null,null,null,null,null,null,"Tall Marsh",null,null,"Swamp Scrub"]
[null,null,null,null,null,null,null,null,null,null,null,null,null,null,null,"Wet Forest",null,null,null,null,null,null,null,null,null,null,null,null,null,null,null,null,null,null,"Valley Grassy Forest",null,null,"Wetland Formation"]
[null,null,null,null,null,null,null,null,null,null,null,null,null,null,null,"Wet Heathland",null,null,null,null,null,null,null,null,null,null,null,null,null,null,null,null,null,null,"Valley Heathy Forest",null,null,"Woorinen Mallee"]
[null,null,null,null,null,null,null,null,null,null,null,null,null,null,null,"Wet Swale Herbland",null,null,null,null,null,null,null,null,null,null,null,null,null,null,null,null,null,null,"Wet Heathland"]
[null,null,null,null,null,null,null,null,null,null,null,null,null,null,null,"Wetland Formation",null,null,null,null,null,null,null,null,null,null,null,null,null,null,null,null,null,null,"Wet Verge Sedgeland"]
[null,null,null,null,null,null,null,null,null,null,null,null,null,null,null,null,null,null,null,null,null,null,null,null,null,null,null,null,null,null,null,null,null,null,"Wetland Formation"]

{"sheet":"Version","index":8,"n_rows":8,"n_cols":3,"rows_kept":8,"cut":false,"hidden":false,"merged":[]}
["Version","Release date","Comments"]
["Version 2.0","January 2018","Gain calculator Version 2.0 released. Aligns with Native vegetation gain scoring manual - Version 2."]
["Version 2.1","March 2018","Updated to allow dropdown menu compatability with Excel 2007."]
["Version 2.2","July 2018","Updated EVC list."]
["Version 2.3","September 2018","Availability of maintenance and improvement gain updated to align with Native vegetation gain scoring manual - Version 2:\n - where overlay restrictions apply\n - when 'Transfer to Crown (non-funded)' is selected as the proposed security arrangement."]
["Version 2.4","October 2018","Availability of security gain updated where 'on-title agreement' is selected for current security."]
["Version 2.5","April 2019","Updated standardiser for Crown land"]
["Version 2.6","June 2019","Updated Crown land proposed security arrangements"]