{"text_format":"1","workbook":"xlsx","n_sheets":5,"sheets":["Read Me","Offset Management Plan","Annual report template","EVC_data","Dropdowns"],"not_rendered":{"charts":0,"images":1,"macros":1,"external_links":0,"defined_names":96,"comments":0,"pivot_tables":0},"unopened":[],"bounds":{"document_bytes":16777216,"sheet_cells":100000,"rows_first":2000,"rows_last":500,"rows_between":2000,"halvings":0,"cell_chars":16384,"cell_head_chars":4096},"cells_cut":0,"cells_raw":0,"read":"whole","date_system":"1900"}

{"sheet":"Read Me","index":0,"n_rows":12,"n_cols":3,"rows_kept":12,"cut":false,"hidden":false,"merged":[]}
["First party general offset management plan and annual report template"]
["Version 1.0"]
["September 2019"]
[]
[null,null,"Introduction\nFirst party offset sites are on land owned by the holder of a permit to remove native vegetation. They are used to meet landowners’ own offset requirements. This First party general offset management plan and annual report template must be read in conjunction with the First party offset guide and Management standards for native vegetation offset sites and can only be used in conjunction with the NVIM native vegetation offset tool. \n\nThe First party offset guide explains how to establish a first party offset site. The NVIM native vegetation offset tool and this First party general offset management plan and annual report template provide a simplified process for permit holders that removes the need for a site assessment undertaken by an assessor, and allows permit holders to complete their own site assessment."]
[]
[]
[]
[]
[null,null,"You need to enable macros for this template to work.\nPress the start button. If nothing happens, macros are probably disabled."]
[]
[null,null,"How to enable macros\n    - Excel 2007 - Click the ‘Office’ button > ‘Excel Options’ > ‘Trust Center’ > ‘Trust Center Settings’ > ‘Macro Settings’ \n    - Excel 2010 and 2013 - Click ‘File’ > ‘Options’ > ‘Trust Center’ > ‘Trust Center Settings’ > ‘Macro Settings’ \n\nIn 'Macro settings', choose one of the following options:\n    - Disable all macros with notification - Macros are disabled, but security alerts appear if there are macros present. Enable macros on a case-by-case basis.\n    - Enable all macros (not recommended, potentially dangerous code can run) - All macros run. This setting makes your computer vulnerable to potentially malicious code."]

{"sheet":"Offset Management Plan","index":1,"n_rows":94,"n_cols":7,"rows_kept":94,"cut":false,"hidden":true,"merged":[[3,0,3,3],[66,0,66,3],[5,2,5,3],[6,2,6,3],[9,2,9,3],[8,2,8,3],[10,2,10,3],[11,2,11,3],[12,2,12,3],[13,2,13,3],[92,2,92,3],[93,2,93,3],[7,2,7,3],[85,2,85,3],[86,2,86,3],[87,2,87,3],[90,2,90,3],[91,2,91,3],[74,0,74,3],[16,0,16,3],[26,0,26,3],[68,0,68,3]]}
[null,"First party general offset"]
[null,"management plan"]
[null,null,null,null,null,null,"Instructions"]
["This offset management plan (OMP) has been designed for permit holders securing a first party general offset site using the NVIM Native vegetation offset tool. The offset is used to meet their permit conditions. This plan must be completed and attached as a schedule to the security agreement. ",null,null,null,null,null,"Blue instruction boxes provide information on how to complete the offset management plan. Grey boxes must be filled out. You can provide extra details in the Comments boxes, or write N/A. When you are finished, print and sign the management plan."]
["A. Offset site details",null,null,null,"Excel magic","Hide?"]
["Offset site reference ID",null,null,null,null,null,"This is the reference ID assigned by authority responsible for the security agreement. "]
["Address of offset site",null,null,null,null,null,"If no reference ID was assigned, write N/A."]
["Property owner"]
["Local Council",null,"<select>"]
["Authority responsible for the security agreement",null,"<select>"]
["Contact phone"]
["Contact email"]
["Native vegetation offset report ID",null,null,null,null,null,"This is the report you downloaded from the NVIM offset tool."]
["Type of vegetation to be protected",null,"<select>"]
[]
["B. Condition of offset site"]
["The following describes the condition of the offset site before implementation of the offset management plan."]
["Condition measurement",null,"Current condition","Comments"]
["1. Amount of site covered by standing trees (dead and alive)",null,"<select>",null,null,null,"Estimate the amount of the site that has trees on it. If the site is half trees, half grassland then choose 30-70% cover from the dropdown menu."]
["2. Protection from stock and other threats",null,"<select>"]
["3. Average weed cover across site",null,"<select>",null,null,null,"Estimate the average weed cover across the whole site. This is likely to be variable across the site. You can provide details about weed patchiness in the Comments box."]
["4. Amount of logs, fallen trees or large branches on the ground",null,"<select>"]
["5. Amount of leaves, twigs, bark, or small branches on the ground",null,"<select>"]
["6. Level of rabbit presence",null,"<select>",null,null,null,"Provide detail in the Comments box if possible. For example, if warrens were recorded, indicate how many warrens were recorded and in which locations."]
[]
["C. Management commitments for all protected vegetation"]
["The management commitments listed below must be undertaken in accordance with the document Management standards for native vegetation offset sites (DELWP 2019) and must be implemented each year (annually) on the offset site over a ten year period. Where a checkbox is available for management commitments 2, 3 and 6, only those management commitments indicated with a ticked checkbox must be implemented. "]
["Management commitments",null,"Timing","Comments"]
["1. Retain all standing trees (dead or alive)"]
["The removal of dead and living standing trees is prohibited.",null,"Ongoing."]
["2. Exclude stock and other threats"]
["Year 1:","Tick"]
["Erect a new fence around the perimeter of the site.",null,"Within 3 months of commencement of agreement.",null,false,null,"Tick one option that explains what you will do with fencing in year 1 to protect your site from stock, cars, etc. in year 1. You can give more detail in the Comments box."]
["Upgrade fencing around the perimeter of the site.",null,"Within 3 months of commencement of agreement.",null,false]
["New fencing or upgrades not necessary.",null,"N/A",null,false,null,"For more information refer to Management standards for native vegetation offset sites (DELWP 2019)."]
["Year 2-10:"]
["Maintain fencing around boundary of the site in good condition.",null,"Ongoing."]
["If a new threat arises, erect or upgrade fencing around the perimeter of the site.",null,"Within 3 months of threat arising."]
["3. Manage weeds","Tick"]
["Managing weeds requires the management of both Catchment and Land Protection Act 1994 (CaLP Act) "]
["and non CaLP Act weeds and includes: a) Ensuring weed cover does not increase beyond the current level, and"]
["b) Monitoring for any new and emerging weeds and eliminate to less than 1% cover."]
["List the weeds that will be managed on the site.",null,null,"\n",null,null,"List all woody weeds, all perennial weeds and all high threat herbaceous and grassy weeds."]
["Felling/ring barking",null,"In <insert month or season>, before plant has flowered or set seed.",null,false,null,"Tick at least one method you will use to manage weeds. You may tick more than one. You may need to add a few different timing requirements for different weeds."]
["Cut and paint with suitable herbicide",null,"In <insert month or season>, before plant has flowered or set seed.",null,false,null,"Check with your local council, nursery, landcare group, or other weed expert to confirm the appropriate time of year to conduct weed control."]
["Drill and fill with suitable herbicide",null,"In <insert month or season>, before plant has flowered or set seed.",null,false,null,"Provide any additional information you think is necessary in the Comments box. Otherwise write N/A."]
["Spot-spraying or wick-wiping with suitable herbicide",null,"In <insert month or season>, when plant is actively growing and before plant has flowered or set seed.",null,false,null,"For more information refer to Management standards for native vegetation offset sites (DELWP 2019)."]
["Slashing and mowing",null,"In <insert month or season>, before plant has flowered or set seed.",null,false]
["Hand weeding",null,"In <insert month or season>, before plant has flowered or set seed.",null,false]
["Other",null,null,null,false,null,"Other weed management methods (e.g. biomass reduction) may be acceptable with agreement from the local Council. Provide details."]
["4. Retain fallen logs and timber"]
["Collecting any fallen logs or timber is prohibited.",null,"Ongoing.",null,null,null,"Includes any logs, fallen trees or large branches on the ground."]
["5. Retain organic litter"]
["All organic litter must remain within the boundaries of the offset site.",null,"Ongoing.",null,null,null,"Includes any leaves, twigs, bark, or small branches on the ground."]
["6. Control rabbits ","Tick"]
["Monitor for rabbits and implement controls if the threat arises.",null,null,null,null,null,"Tick at least one method you will use to control rabbits. You may tick more than one."]
["Burrow fumigation and hand collapse",null,"Late summer.",null,false,null,"Rabbit control is only required if rabbits are present. If no rabbits are present, then select the management action that would be followed should rabbits become "]
["Removal of shelter areas",null,"Late summer.",null,false,null,"a threat on the property. For more information refer to"]
["Baiting",null,"Late summer.",null,false,null,"Management standards for native vegetation offset sites (DELWP 2019)"]
["Other",null,null,null,false,null,"Other methods may be acceptable with agreement from the local Council. "]
["7. Monitor and report"]
["Submit an annual report. The annual report must describe the specific management actions completed each year, and the condition of the offset site for each year of implementation of the offset management plan.",null,"Each year of the ten year management plan and thereafter at the reasonable request of the responsible authority. ",null,null,null,"An annual report must be provided to the responsible authority each year, for a period of ten years. Periodic reports after that ten year period may be requested by the responsible authority. The annual report must describe the specific management actions completed each year, and the condition of the offset site for each year of implementation of the offset management plan. You can use the annual report template in this 'First party general offset management plan and annual report template'."]
["8. Plant five canopy trees (when the agreement will protect scattered trees)",null,null,null,null,{"$f":"IF(OR(VegType=\"Patch of native vegetation\",VegType=\"Revegetation\",VegType=\"Patch of native vegetation and revegetation\"),\"Hide\",\"Display\")","v":"Display"}]
["Plant at least five new trees for every scattered tree protected. \nThe trees must be planted within a 15 metre radius of the scattered tree.\nThe trees must be native canopy tree species as specified in the relevant bioregional EVC\nbenchmark. ",null,"Trees must be planted within three months of commencement of agreement. Trees must be established by the end of year 3 of the 10 year management plan.\n\nIf the planted trees die during the life of the 10 year management plan they must continue to be replaced until at least five recruits / new trees are established.",null,null,{"$f":"IF(OR(VegType=\"Patch of native vegetation\",VegType=\"Revegetation\",VegType=\"Patch of native vegetation and revegetation\"),\"Hide\",\"Display\")","v":"Display"},"Each scattered tree must have an area of land secured around it to provide space for recruitment. The area protected around each scattered tree must be a circle with a diameter of at least 30 metres, with the tree in the centre of the circle. \n\nThis area is shown in the Native vegetation offset report you downloaded from the NVIM offset tool. The five native canopy species must be planted within this 30 metre circle.\n\nFor more information refer to Management standards for native vegetation offset sites (DELWP 2019)."]
[]
["D. Revegetation",null,null,null,null,{"$f":"IF(OR(VegType=\"Patch of native vegetation\",VegType=\"Scattered tree\",VegType=\"Patch of native vegetation and scattered tree\"),\"Hide\",\"Display\")","v":"Display"}]
["Revegetation must be undertaken in accordance with the document Management standards for native vegetation offset sites (DELWP 2019).",null,null,null,null,"Display","For more information refer to Management standards for native vegetation offset sites (DELWP 2019)."]
["Bioregion and EVC",null,null,null,null,"Display"]
["The bioregion, Ecological Vegetation Class (EVC), and vegetation type present on the offset site are described below. This information informs the revegetation species and planting targets.",null,null,null,null,"Display"]
["Bioregion",null,null,{"$f":"IF(_Bio=\"\",\"← Select from dropdown list\",\"\")","v":"← Select from dropdown list"},{"$f":"VLOOKUP(C70,EVC_data!BT2:BU30,2,FALSE)","v":{"$error":"#N/A"}},"Display","This information can be found in Appendix 2 of the Native vegetation offset report"]
["Ecological Vegetation Class",null,null,{"$f":"IF(_EVC=\"\",\"← Select from dropdown list\",\"\")","v":"← Select from dropdown list"},null,"Display","you downloaded from the NVIM offset tool. This includes a link to the bioregional "]
["Vegetation type",null,"<select>",{"$f":"IF(OR(C72=\"\",C72=\"<select>\"),\"← Select from dropdown list\",\"\")","v":"← Select from dropdown list"},null,"Display","EVC benchmarks online."]
[null,null,null,null,null,"Display"]
["Revegetation species and planting targets",null,null,null,"MatchRow:","Display","The bioregional EVC benchmarks provide suggestions of species you can choose for "]
["The species to be planted for each habitat component, and the number of plants that must be planted per hectare, are listed below.\n",null,null,null,{"$f":"MATCH(CONCATENATE(_Bio,_EVC),EVC_data!D1:D1300,0)","v":{"$error":"#N/A"}},"Display","revegetation. Otherwise a local indigenous nursery will be able to give you a more comprehensive list of potential species.  "]
["Habitat component",null,"Species to be planted for each habitat component:","Number of plants that must be planted per hectare:","Benchmark no. of species","Display",{"$f":"IF(OR(_Bio=\"\",_EVC=\"\",C72=\"<select>\",C72=\"\"),\"Planting targets will not display until you choose a Bioregion, EVC and Vegetation type from the dropdown lists above.\",\"\")","v":"Planting targets will not display until you choose a Bioregion, EVC and Vegetation type from the dropdown lists above."}]
["Overstorey / canopy tree species",null,null,{"$f":"\nIF(C72=\"Woodland\",50,\nIF(C72=\"Dry forest\",100,\nIF(C72=\"Riverine/lowland/foothill forest\",150,\nIF(C72=\"Damp/wet forest\",200,\n\"\"))))","v":""},"-","Display","At least one canopy tree species must be chosen."]
["Understorey trees > 5 m tall",{"$f":"IF(OR(E78=0,E78=\"\"),\"N/A\",\"\")","v":""},null,{"$f":"IF(E78=1,10,E78/5*50)","v":10},{"$f":"IFERROR(INDEX(EVC_benchmarks_table,Match_row,12),1)","v":1},"Display","At least six different species must be chosen across all other applicable habitat "]
["Medium shrubs 1-5 m tall ",{"$f":"IF(OR(E79=0,E79=\"\"),\"N/A\",\"\")","v":""},null,{"$f":"IF(E79=1,40,E79/5*200)","v":40},{"$f":"IFERROR(INDEX(EVC_benchmarks_table,Match_row,16),1)","v":1},"Display","components (ensuring each applicable habitat component is represented by at least"]
["Small shrubs < 1 m tall ",{"$f":"IF(OR(E80=0,E80=\"\"),\"N/A\",\"\")","v":""},null,{"$f":"IF(E80=1,100,E80/5*500)","v":100},{"$f":"IFERROR(INDEX(EVC_benchmarks_table,Match_row,18),1)","v":1},"Display","one species)."]
["Large tufted graminoids > 1 m tall",{"$f":"IF(OR(E81<10,E81=\"\"),\"N/A\",\"\")","v":"N/A"},null,{"$f":"IF(E81<10,\"0\",E81/5*500)","v":"0"},{"$f":"IFERROR(INDEX(EVC_benchmarks_table,Match_row,28),1)","v":1},"Display"]
[null,null,null,null,null,"Display"]
[]
["Declaration"]
["Landowner"]
["Name",null,{"$f":"PropertyOwner","v":0}]
["Signature",null,null,null,null,null,"Print this management plan, and then sign here."]
["Date"]
[]
["Statutory authority officer "]
["Name",null,null,null,null,null,"The statutory authority (usually local Council) will also sign the agreement."]
["Title"]
["Signature"]
["Date"]

{"sheet":"Annual report template","index":2,"n_rows":143,"n_cols":5,"rows_kept":143,"cut":false,"hidden":true,"merged":[[142,0,142,2],[137,0,137,2],[13,1,13,2],[14,1,14,2],[15,1,15,2],[5,1,5,2],[2,0,2,2],[10,1,10,2],[12,1,12,2],[11,1,11,2]]}
["First party general offset site"]
["Annual report",null,null,null,"Instructions"]
["An annual report must be provided to the statutory body who signed the security agreement within one year of the commencement date of the security agreement, and prior to each anniversary of that date for each year thereafter, for a period of ten years. Periodic reports after that ten year period may be requested by the statutory body. ",null,null,null,"Blue instruction boxes provide information on how to complete the offset management plan. Grey boxes must be filled out.When you are finished, print and sign the management plan."]
[]
["\nFirst party general offset management plan\nAnnual report",null,null,"Hide / Display"]
["Date of offset approval",null,null,null,"Enter the date that the security agreement was signed by the responsible authority."]
["Reporting year","<select>",null,null,"Enter the reporting year for the annual report you want to create (e.g. year 1 is the first annual "]
[null,null,null,null,"report). If you have enabled macros, only the required reporting year (and previous years)"]
["Offset site details",null,null,null,"will be visible below."]
[]
["Offset site reference ID",{"$f":"OffsetRefID","v":0},null,null,"This will auto-populate using the information you entered in the Offset Management Plan"]
["Offset site address ",{"$f":"Address","v":0}]
["Property owner",{"$f":"PropertyOwner","v":0}]
["Contact phone ",{"$f":"Phone","v":0}]
["Contact email ",{"$f":"Email","v":0}]
["Type of vegetation protected",{"$f":"VegType","v":"<select>"}]
[]
["Condition of offset site - Year 0 ","(Condition","pre-management)"]
[null,"Condition","Comments"]
["Amount of site covered by standing trees (dead and alive)",{"$f":"Cond_1","v":"<select>"},{"$f":"IF(Cond_1_comment=\"\",\"\",Cond_1_comment)","v":""},null,"This will auto-populate using the information you entered in the Offset Management Plan"]
["Protection from stock and other threats",{"$f":"Cond_2","v":"<select>"},{"$f":"IF(Cond_2_comment=\"\",\"\",Cond_2_comment)","v":""}]
["Average weed cover across site",{"$f":"Cond_3","v":"<select>"},{"$f":"IF(Cond_3_comment=\"\",\"\",Cond_3_comment)","v":""}]
["Amount of logs, fallen trees or large branches on the ground",{"$f":"Cond_4","v":"<select>"},{"$f":"IF(Cond_4_comment=\"\",\"\",Cond_4_comment)","v":""}]
["Amount of leaves, twigs, bark, or small branches on the ground",{"$f":"Cond_5","v":"<select>"},{"$f":"IF(Cond_5_comment=\"\",\"\",Cond_5_comment)","v":""}]
["Level of rabbit presence",{"$f":"Cond_6","v":"<select>"},{"$f":"IF(Cond_6_comment=\"\",\"\",Cond_6_comment)","v":""}]
[]
["Condition of offset site - Year 1","Report due:",{"$f":"IF(DateApproval=\"\",\"Enter date of offset approval\",DATE(YEAR(DateApproval)+1,MONTH(DateApproval),DAY(DateApproval)))","v":"Enter date of offset approval"},null,"The report due dates will automatically update based on the date you enter for Date of Offset Approval"]
[null,"Condition","Action taken"]
["Amount of site covered by standing trees (dead and alive)","<select>",null,null,"Provide details about the specific management actions you completed in the past year."]
["Protection from stock and other threats","<select>",null,null,"E.g. Repaired broken wire in fence along eastern boundary."]
["Average weed cover across site","<select>",null,null,"E.g. Found gorse creeping into the northern fence line and spot sprayed all plants (photo provided)."]
["Amount of logs, fallen trees or large branches on the ground","<select>",null,null,"E.g. No action required."]
["Amount of leaves, twigs, bark, or small branches on the ground","<select>",null,null,"E.g. No action required."]
["Level of rabbit presence","<select>",null,null,"E.g. Six warrens  along eastern boundary were collapsed by hand and fumigated (photos provided)."]
["Scattered tree recruits","<select>",null,{"$f":"\nIF(AND(ReportYear>=1,ISNUMBER(SEARCH(\"Scattered\",VegType))=TRUE),\"Display\",\nIF(AND(ReportYear>=1,ISNUMBER(SEARCH(\"Select\",VegType))=TRUE),\"Display\",\n\"Hide\"))","v":"Display"},"E.g. 2 planted trees died and were replaced. All others alive and established."]
["Revegetation","<select>",null,{"$f":"\nIF(AND(ReportYear>=1,ISNUMBER(SEARCH(\"Reveg\",VegType))=TRUE),\"Display\",\nIF(AND(ReportYear>=1,ISNUMBER(SEARCH(\"Select\",VegType))=TRUE),\"Display\",\n\"Hide\"))","v":"Display"},"E.g. Revegetation area generally becoming established. Some understorey plants replaced.\nRevegetation target: A minimum of 5 canopy recruits for every tree protected must be established by the end of year 3."]
[]
["Condition of offset site - Year 2","Report due:",{"$f":"IF(DateApproval=\"\",\"Enter date of offset approval\",DATE(YEAR(DateApproval)+2,MONTH(DateApproval),DAY(DateApproval)))","v":"Enter date of offset approval"}]
[null,"Condition","Action taken",{"$f":"IF(ReportYear>=2,\"Display\",\"Hide\")","v":"Display"}]
["Amount of site covered by standing trees (dead and alive)","<select>",null,"Display"]
["Protection from stock and other threats","<select>",null,"Display"]
["Average weed cover across site","<select>",null,"Display"]
["Amount of logs, fallen trees or large branches on the ground","<select>",null,"Display"]
["Amount of leaves, twigs, bark, or small branches on the ground","<select>",null,"Display"]
["Level of rabbit presence","<select>",null,"Display"]
["Scattered tree recruits","<select>",null,{"$f":"\nIF(AND(ReportYear>=2,ISNUMBER(SEARCH(\"Scattered\",VegType))=TRUE),\"Display\",\nIF(AND(ReportYear>=2,ISNUMBER(SEARCH(\"Select\",VegType))=TRUE),\"Display\",\n\"Hide\"))","v":"Display"}]
["Revegetation","<select>",null,{"$f":"\nIF(AND(ReportYear>=2,ISNUMBER(SEARCH(\"Reveg\",VegType))=TRUE),\"Display\",\nIF(AND(ReportYear>=2,ISNUMBER(SEARCH(\"Select\",VegType))=TRUE),\"Display\",\n\"Hide\"))","v":"Display"},"Revegetation target: A minimum of 5 canopy recruits for every tree protected must be established by the end of year 3."]
[]
["Condition of offset site - Year 3 ","Report due:",{"$f":"IF(DateApproval=\"\",\"Enter date of offset approval\",DATE(YEAR(DateApproval)+3,MONTH(DateApproval),DAY(DateApproval)))","v":"Enter date of offset approval"}]
[null,"Condition","Action taken since last report",{"$f":"IF(ReportYear>=3,\"Display\",\"Hide\")","v":"Display"}]
["Amount of site covered by standing trees (dead and alive)","<select>",null,"Display"]
["Protection from stock and other threats","<select>",null,"Display"]
["Average weed cover across site","<select>",null,"Display"]
["Amount of logs, fallen trees or large branches on the ground","<select>",null,"Display"]
["Amount of leaves, twigs, bark, or small branches on the ground","<select>",null,"Display"]
["Level of rabbit presence","<select>",null,"Display"]
["Scattered tree recruits","<select>",null,{"$f":"\nIF(AND(ReportYear>=3,ISNUMBER(SEARCH(\"Scattered\",VegType))=TRUE),\"Display\",\nIF(AND(ReportYear>=3,ISNUMBER(SEARCH(\"Select\",VegType))=TRUE),\"Display\",\n\"Hide\"))","v":"Display"}]
["Revegetation","<select>",null,{"$f":"\nIF(AND(ReportYear>=3,ISNUMBER(SEARCH(\"Reveg\",VegType))=TRUE),\"Display\",\nIF(AND(ReportYear>=3,ISNUMBER(SEARCH(\"Select\",VegType))=TRUE),\"Display\",\n\"Hide\"))","v":"Display"},"Revegetation target: A minimum of 5 canopy recruits for every tree protected must be established by the end of year 3."]
[]
["Condition of offset site - Year 4 ","Report due:",{"$f":"IF(DateApproval=\"\",\"Enter date of offset approval\",DATE(YEAR(DateApproval)+4,MONTH(DateApproval),DAY(DateApproval)))","v":"Enter date of offset approval"}]
[null,"Condition","Action taken since last report",{"$f":"IF(ReportYear>=4,\"Display\",\"Hide\")","v":"Display"}]
["Amount of site covered by standing trees (dead and alive)","<select>",null,"Display"]
["Protection from stock and other threats","<select>",null,"Display"]
["Average weed cover across site","<select>",null,"Display"]
["Amount of logs, fallen trees or large branches on the ground","<select>",null,"Display"]
["Amount of leaves, twigs, bark, or small branches on the ground","<select>",null,"Display"]
["Level of rabbit presence","<select>",null,"Display"]
["Scattered tree recruits","<select>",null,{"$f":"\nIF(AND(ReportYear>=4,ISNUMBER(SEARCH(\"Scattered\",VegType))=TRUE),\"Display\",\nIF(AND(ReportYear>=4,ISNUMBER(SEARCH(\"Select\",VegType))=TRUE),\"Display\",\n\"Hide\"))","v":"Display"}]
["Revegetation","<select>",null,{"$f":"\nIF(AND(ReportYear>=4,ISNUMBER(SEARCH(\"Reveg\",VegType))=TRUE),\"Display\",\nIF(AND(ReportYear>=4,ISNUMBER(SEARCH(\"Select\",VegType))=TRUE),\"Display\",\n\"Hide\"))","v":"Display"},"Replace unsuccessful recruits if required. At least 5 canopy recruits for every tree protected must be maintained each year to ensure successful revegetation by the end of year 10."]
[]
["Condition of offset site - Year 5","Report due:",{"$f":"IF(DateApproval=\"\",\"Enter date of offset approval\",DATE(YEAR(DateApproval)+5,MONTH(DateApproval),DAY(DateApproval)))","v":"Enter date of offset approval"}]
[null,"Condition","Action taken since last report",{"$f":"IF(ReportYear>=5,\"Display\",\"Hide\")","v":"Display"}]
["Amount of site covered by standing trees (dead and alive)","<select>",null,"Display"]
["Protection from stock and other threats","<select>",null,"Display"]
["Average weed cover across site","<select>",null,"Display"]
["Amount of logs, fallen trees or large branches on the ground","<select>",null,"Display"]
["Amount of leaves, twigs, bark, or small branches on the ground","<select>",null,"Display"]
["Level of rabbit presence","<select>",null,"Display"]
["Scattered tree recruits","<select>",null,{"$f":"\nIF(AND(ReportYear>=5,ISNUMBER(SEARCH(\"Scattered\",VegType))=TRUE),\"Display\",\nIF(AND(ReportYear>=5,ISNUMBER(SEARCH(\"Select\",VegType))=TRUE),\"Display\",\n\"Hide\"))","v":"Display"}]
["Revegetation","<select>",null,{"$f":"\nIF(AND(ReportYear>=5,ISNUMBER(SEARCH(\"Reveg\",VegType))=TRUE),\"Display\",\nIF(AND(ReportYear>=5,ISNUMBER(SEARCH(\"Select\",VegType))=TRUE),\"Display\",\n\"Hide\"))","v":"Display"},"Replace unsuccessful recruits if required. At least 5 canopy recruits for every tree protected must be maintained each year to ensure successful revegetation by the end of year 10."]
[]
["Condition of offset site - Year 6","Report due:",{"$f":"IF(DateApproval=\"\",\"Enter date of offset approval\",DATE(YEAR(DateApproval)+6,MONTH(DateApproval),DAY(DateApproval)))","v":"Enter date of offset approval"}]
[null,"Condition","Action taken since last report",{"$f":"IF(ReportYear>=6,\"Display\",\"Hide\")","v":"Display"}]
["Amount of site covered by standing trees (dead and alive)","<select>",null,"Display"]
["Protection from stock and other threats","<select>",null,"Display"]
["Average weed cover across site","<select>",null,"Display"]
["Amount of logs, fallen trees or large branches on the ground","<select>",null,"Display"]
["Amount of leaves, twigs, bark, or small branches on the ground","<select>",null,"Display"]
["Level of rabbit presence","<select>",null,"Display"]
["Scattered tree recruits","<select>",null,{"$f":"\nIF(AND(ReportYear>=6,ISNUMBER(SEARCH(\"Scattered\",VegType))=TRUE),\"Display\",\nIF(AND(ReportYear>=6,ISNUMBER(SEARCH(\"Select\",VegType))=TRUE),\"Display\",\n\"Hide\"))","v":"Display"}]
["Revegetation","<select>",null,{"$f":"\nIF(AND(ReportYear>=6,ISNUMBER(SEARCH(\"Reveg\",VegType))=TRUE),\"Display\",\nIF(AND(ReportYear>=6,ISNUMBER(SEARCH(\"Select\",VegType))=TRUE),\"Display\",\n\"Hide\"))","v":"Display"},"Replace unsuccessful recruits if required. At least 5 canopy recruits for every tree protected must be maintained each year to ensure successful revegetation by the end of year 10."]
[]
["Condition of offset site - Year 7","Report due:",{"$f":"IF(DateApproval=\"\",\"Enter date of offset approval\",DATE(YEAR(DateApproval)+7,MONTH(DateApproval),DAY(DateApproval)))","v":"Enter date of offset approval"}]
[null,"Condition","Action taken since last report",{"$f":"IF(ReportYear>=7,\"Display\",\"Hide\")","v":"Display"}]
["Amount of site covered by standing trees (dead and alive)","<select>",null,"Display"]
["Protection from stock and other threats","<select>",null,"Display"]
["Average weed cover across site","<select>",null,"Display"]
["Amount of logs, fallen trees or large branches on the ground","<select>",null,"Display"]
["Amount of leaves, twigs, bark, or small branches on the ground","<select>",null,"Display"]
["Level of rabbit presence","<select>",null,"Display"]
["Scattered tree recruits","<select>",null,{"$f":"\nIF(AND(ReportYear>=7,ISNUMBER(SEARCH(\"Scattered\",VegType))=TRUE),\"Display\",\nIF(AND(ReportYear>=7,ISNUMBER(SEARCH(\"Select\",VegType))=TRUE),\"Display\",\n\"Hide\"))","v":"Display"}]
["Revegetation","<select>",null,{"$f":"\nIF(AND(ReportYear>=7,ISNUMBER(SEARCH(\"Reveg\",VegType))=TRUE),\"Display\",\nIF(AND(ReportYear>=7,ISNUMBER(SEARCH(\"Select\",VegType))=TRUE),\"Display\",\n\"Hide\"))","v":"Display"},"Replace unsuccessful recruits if required. At least 5 canopy recruits for every tree protected must be maintained each year to ensure successful revegetation by the end of year 10."]
[]
["Condition of offset site - Year 8 ","Report due:",{"$f":"IF(DateApproval=\"\",\"Enter date of offset approval\",DATE(YEAR(DateApproval)+8,MONTH(DateApproval),DAY(DateApproval)))","v":"Enter date of offset approval"}]
[null,"Condition","Action taken since last report",{"$f":"IF(ReportYear>=8,\"Display\",\"Hide\")","v":"Display"}]
["Amount of site covered by standing trees (dead and alive)","<select>",null,"Display"]
["Protection from stock and other threats","<select>",null,"Display"]
["Average weed cover across site","<select>",null,"Display"]
["Amount of logs, fallen trees or large branches on the ground","<select>",null,"Display"]
["Amount of leaves, twigs, bark, or small branches on the ground","<select>",null,"Display"]
["Level of rabbit presence","<select>",null,"Display"]
["Scattered tree recruits","<select>",null,{"$f":"\nIF(AND(ReportYear>=8,ISNUMBER(SEARCH(\"Scattered\",VegType))=TRUE),\"Display\",\nIF(AND(ReportYear>=8,ISNUMBER(SEARCH(\"Select\",VegType))=TRUE),\"Display\",\n\"Hide\"))","v":"Display"}]
["Revegetation","<select>",null,{"$f":"\nIF(AND(ReportYear>=8,ISNUMBER(SEARCH(\"Reveg\",VegType))=TRUE),\"Display\",\nIF(AND(ReportYear>=8,ISNUMBER(SEARCH(\"Select\",VegType))=TRUE),\"Display\",\n\"Hide\"))","v":"Display"},"Replace unsuccessful recruits if required. At least 5 canopy recruits for every tree protected must be maintained each year to ensure successful revegetation by the end of year 10."]
[]
["Condition of offset site - Year 9 ","Report due:",{"$f":"IF(DateApproval=\"\",\"Enter date of offset approval\",DATE(YEAR(DateApproval)+9,MONTH(DateApproval),DAY(DateApproval)))","v":"Enter date of offset approval"}]
[null,"Condition","Action taken since last report",{"$f":"IF(ReportYear>=9,\"Display\",\"Hide\")","v":"Display"}]
["Amount of site covered by standing trees (dead and alive)","<select>",null,"Display"]
["Protection from stock and other threats","<select>",null,"Display"]
["Average weed cover across site","<select>",null,"Display"]
["Amount of logs, fallen trees or large branches on the ground","<select>",null,"Display"]
["Amount of leaves, twigs, bark, or small branches on the ground","<select>",null,"Display"]
["Level of rabbit presence","<select>",null,"Display"]
["Scattered tree recruits","<select>",null,{"$f":"\nIF(AND(ReportYear>=9,ISNUMBER(SEARCH(\"Scattered\",VegType))=TRUE),\"Display\",\nIF(AND(ReportYear>=9,ISNUMBER(SEARCH(\"Select\",VegType))=TRUE),\"Display\",\n\"Hide\"))","v":"Display"}]
["Revegetation","<select>",null,{"$f":"\nIF(AND(ReportYear>=9,ISNUMBER(SEARCH(\"Reveg\",VegType))=TRUE),\"Display\",\nIF(AND(ReportYear>=9,ISNUMBER(SEARCH(\"Select\",VegType))=TRUE),\"Display\",\n\"Hide\"))","v":"Display"},"Replace unsuccessful recruits if required. At least 5 canopy recruits for every tree protected must be maintained each year to ensure successful revegetation by the end of year 10."]
[]
["Condition of offset site - Year 10 ","Report due:",{"$f":"IF(DateApproval=\"\",\"Enter date of offset approval\",DATE(YEAR(DateApproval)+10,MONTH(DateApproval),DAY(DateApproval)))","v":"Enter date of offset approval"}]
[null,"Condition","Action taken since last report",{"$f":"IF(ReportYear>=10,\"Display\",\"Hide\")","v":"Display"}]
["Amount of site covered by standing trees (dead and alive)","<select>",null,"Display"]
["Protection from stock and other threats","<select>",null,"Display"]
["Average weed cover across site","<select>",null,"Display"]
["Amount of logs, fallen trees or large branches on the ground","<select>",null,"Display"]
["Amount of leaves, twigs, bark, or small branches on the ground","<select>",null,"Display"]
["Level of rabbit presence","<select>",null,"Display"]
["Scattered tree recruits","<select>",null,{"$f":"\nIF(AND(ReportYear>=10,ISNUMBER(SEARCH(\"Scattered\",VegType))=TRUE),\"Display\",\nIF(AND(ReportYear>=10,ISNUMBER(SEARCH(\"Select\",VegType))=TRUE),\"Display\",\n\"Hide\"))","v":"Display"}]
["Revegetation","<select>",null,{"$f":"\nIF(AND(ReportYear>=10,ISNUMBER(SEARCH(\"Reveg\",VegType))=TRUE),\"Display\",\nIF(AND(ReportYear>=10,ISNUMBER(SEARCH(\"Select\",VegType))=TRUE),\"Display\",\n\"Hide\"))","v":"Display"},"Replace unsuccessful recruits if required. At least 5 canopy recruits for every tree protected must be maintained each year to ensure successful revegetation by the end of year 10."]
[]
["Declaration"]
["I hereby declare that the supplied information is accurate and complies with reporting requirements of the security agreement."]
["Name",{"$f":"PropertyOwner","v":0}]
["Signature"]
["Date"]
[]
["The annual report includes photographs of the offset site that show the general condition of the site, and evidence of any works carried out. Photographs showing site condition were taken from the same location each year, at approximately the same time of year, to provide a visual indication of improvements to the offset site over time as a result of the management actions.",null,null,null,"Make sure you take photographs of the offset site from the same place every year and provide them with each annual report. If you undertake any management actions, provide photographs of what you have done. Attach photographs as an appendix to the report."]

{"sheet":"EVC_data","index":3,"n_rows":1318,"n_cols":101,"rows_kept":1318,"cut":false,"hidden":true,"merged":[]}
["BIOREGION","BIOREGCODE","EVCNAME","MatchColumn","BIOEVCCODE","LTDBH","LTCOUNT","TCHEIGHT","TCCOVER","ITCOUNT","ITCOVER","TCOUNT","TCOVER","MTCOUNT","MTCOVER","MSCOUNT","MSCOVER","SSCOUNT","SSCOVER","PSCOUNT","PSCOVER","LHCOUNT","LHCOVER","MHCOUNT","MHCOVER","SHCOUNT","SHCOVER","LTGCOUNT","LTGCOVER","LNGCOUNT","LNGCOVER","MTGCOUNT","MTGCOVER","MNGCOUNT","MNGCOVER","TTGCOUNT","TTGCOVER","HGCOUNT","HGCOVER","GFCOUNT","GFCOVER","TFCOUNT","TFCOVER","EPCOUNT","EPCOVER","SCCOUNT","SCCOVER","BLCOUNT","BLCOVER","S_CCOUNT","S_CCOVER","RECRUITTYP","RECRUITFRQ","BCHMARKLF","WOODYSPEC","HERBSPEC","WOODYCOVER","OLCOVER","LOGSMHA","STANDARDSR","EVC Standardiser","EVC no.","BCS1","BCS2","Type","Grassland \"gain\" scoring","LargeTreesLessThan40cm","BIOEVC","TypeDesc","Vegetation type for gain",null,"Bioregion","BIOREGCODE","Brid","CVU_","DunT","EGL_","EGU_","GipP","GleP","Gold","GGr_","HFE_","HNF_","HSF_","LoM_","MonT","MuF_","MuM_","MSB_","NIS_","OtP_","OtR_","RobP","Strz","VAlp","VRiv","VVP_","WaP_","WPro","Wim_"]
["Bridgewater","Brid","Brackish Aquatic Herbland",{"$f":"CONCATENATE(A2,C2)","v":"BridgewaterBrackish Aquatic Herbland"},"Brid0537",null,0,0,null,null,null,null,null,null,null,null,null,null,null,null,null,null,null,null,null,null,null,null,null,null,null,null,null,null,null,null,null,null,null,null,null,null,null,null,null,null,null,null,null,null,null,null,0,0,null,null,null,0,0,0,{"$error":"#N/A"},{"$error":"#N/A"},{"$error":"#N/A"},{"$error":"#N/A"},{"$error":"#N/A"},{"$error":"#N/A"},{"$error":"#N/A"},{"$error":"#N/A"},{"$error":"#N/A"},{"$error":"#N/A"},null,"Bridgewater","Brid","Damp Sands Herb-rich Woodland","Damp Sands Herb-rich Woodland","Damp Sands Herb-rich Woodland","Coast Banksia Woodland","Damp Sands Herb-rich Woodland","Coast Banksia Woodland","Damp Sands Herb-rich Woodland","Damp Sands Herb-rich Woodland","Damp Sands Herb-rich Woodland","Lowland Forest","Damp Sands Herb-rich Woodland","Coast Banksia Woodland","Heathy Woodland","Riparian Forest","Floodplain Riparian Woodland","Rocky Outcrop Shrubland","Woorinen Sands Mallee","Clay Heathland","Damp Sands Herb-rich Woodland","Damp Sands Herb-rich Woodland","Woorinen Sands Mallee","Coast Banksia Woodland","Riparian Forest","Damp Sands Herb-rich Woodland","Coast Banksia Woodland","Damp Sands Herb-rich Woodland","Coast Banksia Woodland","Damp Sands Herb-rich Woodland"]
["Bridgewater","Brid","Coastal Alkaline Scrub",{"$f":"CONCATENATE(A3,C3)","v":"BridgewaterCoastal Alkaline Scrub"},"Brid0858",0,20,0,null,null,null,null,null,null,null,4,30,null,null,null,null,3,5,2,1,2,10,1,5,null,null,3,5,2,30,null,null,null,null,null,null,null,null,null,null,2,1,0,20,null,null,"Continuous",0,9,4,7,30,40,50,1.1499999999999999,1.1499999999999999,858,"LC","Least Concern",2,0,0,"Brid0858","scrubs/shrublands/mallee with logs","Woody vegetation",null,"Central Victorian Uplands","CVU_","Coastal Saltmarsh","Sand Heathland","Sand Heathland","Damp Sands Herb-rich Woodland","Sand Heathland","Damp Sands Herb-rich Woodland","Coastal Sand Heathland","Riparian Shrubland","Sand Heathland","Riparian Forest","Clay Heathland","Damp Sands Herb-rich Woodland","Low Rises Woodland","Shrubby Dry Forest","Low Rises Woodland","Low Rises Woodland","Semi-arid Woodland","Treed Clay Heathland","Sand Heathland","Wet Heathland","Dunefield Heathland","Sand Heathland","Riparian Shrubland","Riparian Forest","Damp Sands Herb-rich Woodland","Wet Heathland","Damp Sands Herb-rich Woodland","Sand Heathland"]
["Bridgewater","Brid","Coastal Dune Scrub","BridgewaterCoastal Dune Scrub","Brid0160",0,0,0,null,null,null,null,null,null,null,7,50,1,1,null,null,3,5,7,15,3,10,null,null,null,null,2,15,2,5,null,null,null,null,null,null,null,null,null,null,3,5,0,10,null,null,"Episodic",30,9,8,13,51,40,0,1.36,1.36,160,"LC","Least Concern",4,"y",0,"Brid0160","heathlands","Woody vegetation",null,"Dundas Tablelands","DunT","Estuarine Wetland","Treed Sand Heathland","Wet Heathland","Coastal Vine-rich Forest","Treed Sand Heathland","Sand Heathland","Sand Heathland","Heathy Dry Forest","Wet Heathland","Shrubby Dry Forest","Treed Clay Heathland","Clay Heathland","Woorinen Sands Mallee","Grassy Dry Forest","Creekline Grassy Woodland","Woorinen Sands Mallee","Semi-arid Chenopod Woodland","Riparian Forest","Clay Heathland","Estuarine Wetland","Loamy Sands Mallee","Wet Heathland","Heathy Dry Forest","Riparian Shrubland","Sand Heathland","Estuarine Wetland","Coastal Sand Heathland","Brackish Sedgeland"]
["Bridgewater","Brid","Coastal Headland Scrub","BridgewaterCoastal Headland Scrub","Brid0161",0,0,0,null,null,null,null,null,null,null,7,50,null,null,null,null,2,1,4,5,2,5,1,1,null,null,4,10,2,5,null,null,null,null,null,null,null,null,null,null,2,5,0,10,"0","10","Continuous",0,10,7,8,50,40,0,1.36,1.36,161,"Vu","Vulnerable",4,0,0,"Brid0161","heathlands","Woody vegetation",null,"East Gippsland Lowlands","EGL_","Herb-rich Foothill Forest","Clay Heathland","Brackish Sedgeland","Coastal Sand Heathland","Clay Heathland","Clay Heathland","Wet Heathland","Shrubby Dry Forest","Lowland Forest","Rocky Outcrop Shrubland","Lowland Forest","Wet Heathland","Lowan Sands Mallee","Blackthorn Scrub","Wetland Formation","Lowan Sands Mallee","Non-treed Semi-arid Chenopod Woodland","Riparian Shrubland","Wet Heathland","Lowland Forest","Ridged Plains Mallee","Lowland Forest","Shrubby Dry Forest","Heathy Dry Forest","Treed Sand Heathland","Lowland Forest","Sand Heathland","Riparian Shrubland"]
["Bridgewater","Brid","Coastal Saltmarsh","BridgewaterCoastal Saltmarsh","Brid0009",0,0,0,null,null,null,null,null,null,null,1,10,1,5,null,null,null,null,3,15,null,null,null,null,1,5,null,null,1,5,null,null,null,null,null,null,null,null,null,null,null,null,null,null,"0","10","Continuous",0,6,2,3,15,10,0,1.36,1.36,9,"Vu","Vulnerable",5,"y",0,"Brid0009","grasslands","Other grassland vegetation",null,"East Gippsland Uplands","EGU_","Swamp Scrub","Treed Clay Heathland","Lowland Forest","Clay Heathland","Treed Clay Heathland","Wet Heathland","Brackish Sedgeland","Grassy Dry Forest","Riparian Forest","Damp Forest","Riparian Forest","Limestone Box Forest","Heathy Mallee","Rocky Outcrop Shrubland","Woorinen Sands Mallee","Heathy Mallee","Low Chenopod Shrubland","Heathy Dry Forest","Coastal Saltmarsh","Riparian Forest","Semi-arid Woodland","Riparian Forest","Grassy Dry Forest","Shrubby Dry Forest","Wet Heathland","Riparian Forest","Wet Heathland","Grassy Dry Forest"]
["Bridgewater","Brid","Damp Sands Herb-rich Woodland","BridgewaterDamp Sands Herb-rich Woodland","Brid0003",70,15,15,15,0,5,2,10,null,null,4,5,3,5,2,5,3,5,10,15,3,5,2,10,1,15,7,15,3,5,null,null,null,null,1,5,null,null,null,null,2,1,0,10,null,null,"Continuous",0,15,9,16,20,40,150,1,1,3,"Vu","Vulnerable",1,0,0,"Brid0003","Forest/Woodland","Woody vegetation",null,"Gippsland Plain","GipP","Coastal Dune Scrub","Lowland Forest","Riparian Shrubland","Treed Clay Heathland","Wet Heathland","Coastal Saltmarsh","Lowland Forest","Herb-rich Foothill Forest","Riparian Shrubland","Wet Forest","Riparian Shrubland","Lowland Forest","Dunefield Heathland","Damp Forest","Dunefield Heathland","Dunefield Heathland","Riverine Chenopod Woodland","Shrubby Dry Forest","Estuarine Wetland","Shrubby Dry Forest","Semi-arid Chenopod Woodland","Herb-rich Foothill Forest","Herb-rich Foothill Forest","Grassy Dry Forest","Coastal Saltmarsh","Herb-rich Foothill Forest","Coastal Saltmarsh","Rocky Outcrop Shrubland"]
["Bridgewater","Brid","Deep Freshwater Marsh","BridgewaterDeep Freshwater Marsh","Brid0681",null,null,0,null,null,null,null,null,null,null,null,null,null,null,null,null,null,null,null,null,null,null,null,null,null,null,null,null,null,null,null,null,null,null,null,null,null,null,null,null,null,null,null,null,null,null,null,0,0,null,null,null,null,0,1.36,1.36,681,"Vu","Vulnerable",6,0,0,"Brid0681","wetlands","Non-woody wetland vegetation",null,"Glenelg Plain","GleP","Coastal Headland Scrub","Riparian Forest","Heathy Dry Forest","Wet Heathland","Banksia Woodland","Estuarine Wetland","Riparian Forest","Rocky Outcrop Shrubland","Heathy Dry Forest","Cool Temperate Rainforest","Heathy Dry Forest","Riparian Forest","Tea-tree Scrub","Wet Forest","Loamy Sands Mallee","Loamy Sands Mallee","Lignum Swamp","Grassy Dry Forest","Lowland Forest","Grassy Dry Forest","Non-treed Semi-arid Chenopod Woodland","Damp Forest","Blackthorn Scrub","Herb-rich Foothill Forest","Estuarine Wetland","Shrubby Foothill Forest","Estuarine Wetland","Heathy Woodland"]
["Bridgewater","Brid","Estuarine Wetland","BridgewaterEstuarine Wetland","Brid0010",0,0,0,null,null,null,null,null,null,null,null,null,null,null,null,null,null,null,2,50,1,10,1,10,1,5,null,null,3,30,null,null,null,null,null,null,null,null,null,null,null,null,null,null,null,null,"Episodic",5,5,null,3,null,10,0,1.36,1.36,10,"En","Endangered",6,0,0,"Brid0010","wetlands","Non-woody wetland vegetation",null,"Goldfields","Gold","Shallow Freshwater Marsh","Riparian Shrubland","Herb-rich Foothill Forest","Coastal Saltmarsh","Limestone Box Forest","Coastal Lagoon Wetland","Herb-rich Foothill Forest","Valley Grassy Forest","Grassy Dry Forest","Warm Temperate Rainforest","Shrubby Dry Forest","Riparian Shrubland","Loamy Sands Mallee","Cool Temperate Rainforest","Ridged Plains Mallee","Sandstone Ridge Shrubland","Grassy Riverine Forest","Herb-rich Foothill Forest","Riparian Forest","Herb-rich Foothill Forest","Low Chenopod Shrubland","Wet Forest","Rocky Outcrop Shrubland","Rocky Outcrop Shrubland","Lowland Forest","Heathy Woodland","Coastal Lagoon Wetland","Swamp Scrub"]
["Bridgewater","Brid","Freshwater Meadow","BridgewaterFreshwater Meadow","Brid0680",null,null,0,null,null,null,null,null,null,null,null,null,null,null,null,null,null,null,null,null,null,null,null,null,null,null,null,null,null,null,null,null,null,null,null,null,null,null,null,null,null,null,null,null,null,null,null,0,0,null,null,null,null,0,1.36,1.36,680,"En","Endangered",6,0,0,"Brid0680","wetlands","Non-woody wetland vegetation",null,"Greater Grampians","GGr_","Brackish Aquatic Herbland","Heathy Dry Forest","Rocky Outcrop Shrubland","Estuarine Wetland","Lowland Forest","Wet Swale Herbland","Wet Forest","Heathy Woodland","Herb-rich Foothill Forest","Cool Temperate Rainforest/Warm Temperate Rainf","Grassy Dry Forest","Heathy Dry Forest","Sandstone Ridge Shrubland","Cool Temperate Rainforest/Warm Temperate Rainf","Semi-arid Woodland","Treed Sandstone Ridge Shrubland","Lake Bed Herbland","Rocky Outcrop Shrubland","Shrubby Dry Forest","Wet Forest","Riverine Chenopod Woodland","Cool Temperate Rainforest","Damp Forest","Valley Grassy Forest","Riparian Forest","Swamp Scrub","Wet Swale Herbland","Plains Grassy Woodland"]
["Bridgewater","Brid","Herb-rich Foothill Forest","BridgewaterHerb-rich Foothill Forest","Brid0023",70,20,25,40,0,5,2,10,null,null,5,15,1,1,1,1,3,5,10,20,5,5,3,5,1,5,10,20,2,10,null,null,null,null,3,10,null,null,null,null,2,0,0,20,null,null,"Continuous",0,15,8,18,26,40,200,1,1,23,"Vu","Vulnerable",1,0,0,"Brid0023","Forest/Woodland","Woody vegetation",null,"Highlands Far East","HFE_","Freshwater Meadow","Shrubby Dry Forest","Heathy Woodland","Coastal Lagoon Wetland","Riparian Forest","Banksia Woodland","Heathy Woodland","Swamp Scrub","Rocky Outcrop Shrubland","Tableland Damp Forest","Herb-rich Foothill Forest","Shrubby Dry Forest","Treed Sandstone Ridge Shrubland","Tableland Damp Forest","Semi-arid Chenopod Woodland","Red Swale Mallee","Chenopod Mallee","Damp Forest","Herb-rich Foothill Forest","Cool Temperate Rainforest","Lignum Swamp","Warm Temperate Rainforest","Wet Forest","Plains Grassy Woodland","Heathy Dry Forest","Plains Grassy Woodland","Lowland Forest","Floodplain Riparian Woodland"]
["Bridgewater","Brid","Permanent Open Freshwater","BridgewaterPermanent Open Freshwater","Brid0682",null,0,0,null,null,null,null,null,null,null,null,null,null,null,null,null,null,null,null,null,null,null,null,null,null,null,null,null,null,null,null,null,null,null,null,null,null,null,null,null,null,null,null,null,null,null,null,0,0,null,null,null,0,0,0,{"$error":"#N/A"},{"$error":"#N/A"},{"$error":"#N/A"},{"$error":"#N/A"},{"$error":"#N/A"},{"$error":"#N/A"},{"$error":"#N/A"},{"$error":"#N/A"},{"$error":"#N/A"},{"$error":"#N/A"},null,"Highlands Northern Fall","HNF_","Deep Freshwater Marsh","Grassy Dry Forest","Swamp Scrub","Wet Swale Herbland","Riparian Shrubland","Limestone Box Forest","Swamp Scrub","Plains Grassy Woodland","Damp Forest","Montane Dry Woodland","Blackthorn Scrub","Grassy Dry Forest","Red Swale Mallee","Montane Dry Woodland","Samphire Shrubland","Ridged Plains Mallee","Shallow Freshwater Marsh","Wet Forest","Wet Forest","Shrubby Foothill Forest","Grassy Riverine Forest","Shrubby Foothill Forest","Cool Temperate Rainforest","Plains Grassy Woodland","Shrubby Dry Forest","Swampy Riparian Woodland","Riparian Forest","Box Ironbark Forest"]
["Bridgewater","Brid","Permanent Saline","BridgewaterPermanent Saline","Brid0684",null,0,0,null,null,null,null,null,null,null,null,null,null,null,null,null,null,null,null,null,null,null,null,null,null,null,null,null,null,null,null,null,null,null,null,null,null,null,null,null,null,null,null,null,null,null,null,0,0,null,null,null,0,0,0,{"$error":"#N/A"},{"$error":"#N/A"},{"$error":"#N/A"},{"$error":"#N/A"},{"$error":"#N/A"},{"$error":"#N/A"},{"$error":"#N/A"},{"$error":"#N/A"},{"$error":"#N/A"},{"$error":"#N/A"},null,"Highlands Southern Fall","HSF_","Permanent Open Freshwater","Herb-rich Foothill Forest","Plains Grassy Woodland","Brackish Sedgeland","Heathy Dry Forest","Lowland Forest","Plains Grassy Woodland","Floodplain Riparian Woodland","Wet Forest","Montane Grassy Woodland","Rocky Outcrop Shrubland","Herb-rich Foothill Forest","Ridged Plains Mallee","Montane Grassy Woodland","Low Chenopod Shrubland","Semi-arid Woodland","Riverine Grassy Woodland","Montane Dry Woodland","Shrubby Foothill Forest","Heathy Woodland","Lake Bed Herbland","Heathy Woodland","Tableland Damp Forest","Riverina Plains Grassy Woodland (syn. Plain","Grassy Dry Forest","Plains Grassy Wetland","Rocky Outcrop Shrubland","Sedge-rich Woodland"]
["Bridgewater","Brid","Shallow Freshwater Marsh","BridgewaterShallow Freshwater Marsh","Brid0200",null,null,0,null,null,null,null,null,null,null,null,null,null,null,null,null,null,null,null,null,null,null,null,null,null,null,null,null,null,null,null,null,null,null,null,null,null,null,null,null,null,null,null,null,null,null,null,0,0,null,null,null,null,0,1.36,1.36,200,"En","Endangered",6,0,0,"Brid0200","wetlands","Non-woody wetland vegetation",null,"Lowan Mallee","LoM_","Permanent Saline","Blackthorn Scrub","Floodplain Riparian Woodland","Banksia Woodland","Shrubby Dry Forest","Riparian Forest","Floodplain Riparian Woodland","Box Ironbark Forest","Montane Grassy Woodland","Montane Damp Forest","Damp Forest","Blackthorn Scrub","Semi-arid Woodland","Montane Damp Forest","Riverine Chenopod Woodland","Semi-arid Chenopod Woodland","Alluvial Plains Semi-arid Grassland","Montane Damp Forest","Heathy Woodland","Swamp Scrub","Plains Grassland","Swamp Scrub","Montane Dry Woodland","Floodplain Riparian Woodland","Herb-rich Foothill Forest","Sedge Wetland","Damp Forest","Low Rises Woodland"]
["Bridgewater","Brid","Sink-hole Wetland (aggregate)","BridgewaterSink-hole Wetland (aggregate)","Brid0908",null,0,0,null,null,null,null,null,null,null,null,null,null,null,null,null,null,null,null,null,null,null,null,null,null,null,null,null,null,null,null,null,null,null,null,null,null,null,null,null,null,null,null,null,null,null,null,0,0,null,null,null,0,0,0,{"$error":"#N/A"},{"$error":"#N/A"},{"$error":"#N/A"},{"$error":"#N/A"},{"$error":"#N/A"},{"$error":"#N/A"},{"$error":"#N/A"},{"$error":"#N/A"},{"$error":"#N/A"},{"$error":"#N/A"},null,"Monaro Tablelands","MonT","Coastal Alkaline Scrub","Rocky Outcrop Shrubland","Alluvial Terraces Herb-rich Woodland","Limestone Box Forest","Grassy Dry Forest","Riparian Shrubland","Creekline Grassy Woodland","Sedge-rich Woodland","Shrubby Foothill Forest","Montane Wet Forest","Wet Forest","Rocky Outcrop Shrubland","Semi-arid Chenopod Woodland","Montane Wet Forest","Lignum Swamp","Non-treed Semi-arid Chenopod Woodland","Disused Floodway Shrubby Herbland","Valley Grassy Forest","Swamp Scrub","Swampy Riparian Woodland","Chenopod Mallee","Plains Grassy Woodland","Montane Grassy Woodland","Box Ironbark Forest","Shrubby Foothill Forest","Bird Colony Shrubland","Wet Forest","Alluvial Terraces Herb-rich Woodland"]
["Bridgewater","Brid","Spray-zone Coastal Shrubland","BridgewaterSpray-zone Coastal Shrubland","Brid0876",0,0,0,null,null,null,null,null,null,null,1,1,2,10,null,null,null,null,4,10,1,1,null,null,null,null,1,1,null,null,null,null,null,null,null,null,null,null,null,null,null,null,0,10,"0","10","Continuous",0,7,3,5,11,0,0,1.36,1.36,876,"Ra","Rare",5,0,0,"Brid0876","grasslands","Other grassland vegetation",null,"Murray Fans","MuF_","Spray-zone Coastal Shrubland","Damp Forest","Creekline Grassy Woodland","Lowland Forest","Herb-rich Foothill Forest","Shrubby Dry Forest","Hills Herb-rich Woodland","Alluvial Terraces Herb-rich Woodland","Valley Grassy Forest","Montane Riparian Woodland","Cool Temperate Rainforest","Damp Forest","Non-treed Semi-arid Chenopod Woodland","Montane Riparian Woodland","Grassy Riverine Forest","Samphire Shrubland","Lignum Shrubland","Plains Grassy Woodland","Swamp Scrub","Grassy Forest","Shallow Freshwater Marsh","Wetland Formation","Montane Damp Forest","Low Rises Woodland","Valley Grassy Forest","Bird Colony Succulent Herbland","Cool Temperate Rainforest","Creekline Grassy Woodland"]
["Bridgewater","Brid","Swamp Scrub","BridgewaterSwamp Scrub","Brid0053",0,0,0,null,null,null,null,null,null,null,2,10,1,1,null,null,5,5,9,15,3,10,2,15,2,5,4,15,3,15,null,null,null,null,2,5,null,null,null,null,1,5,0,20,null,null,"Continuous",0,12,3,17,11,40,0,1.25,1.1499999999999999,53,"En","Endangered",3,0,0,"Brid0053","scrubs/shrublands/mallee without logs","Woody vegetation",null,"Murray Mallee","MuM_","Sink-hole Wetland (aggregate)","Wet Forest","Hills Herb-rich Woodland","Riparian Forest","Foothill Box Ironbark Forest","Grassy Dry Forest","Plains Grassy Wetland","Creekline Grassy Woodland","Heathy Woodland","Montane Riparian Thicket","Warm Temperate Rainforest","Wet Forest","Samphire Shrubland","Sub-alpine Woodland","Lake Bed Herbland","Low Chenopod Shrubland","Floodplain Grassy Wetland","Floodplain Riparian Woodland","Estuarine Swamp Scrub","Coastal Headland Scrub","Riverine Grassy Woodland","Swampy Riparian Woodland","Montane Wet Forest","Alluvial Terraces Herb-rich Woodland","Heathy Woodland","Coastal Dune Scrub","Warm Temperate Rainforest","Metamorphic Slopes Shrubby Woodland"]
["Central Victorian Uplands","CVU_","Alluvial Terraces Herb-rich Woodland","Central Victorian UplandsAlluvial Terraces Herb-rich Woodland","CVU_0067",70,10,15,15,0,5,2,15,null,null,2,5,null,null,null,null,2,5,9,20,3,15,1,1,null,null,8,10,2,10,null,null,null,null,null,null,null,null,null,null,null,null,0,10,"0","10","Continuous",0,11,4,14,20,10,150,1,1,67,"En","Endangered",1,0,0,"CVU_0067","Forest/Woodland","Woody vegetation",null,"Murray Scroll Belt","MSB_",null,"Montane Grassy Woodland","Plains Grassy Wetland","Riparian Shrubland","Blackthorn Scrub","Herb-rich Foothill Forest","Limestone Pomaderris Shrubland","Metamorphic Slopes Shrubby Woodland","Swamp Scrub","Valley Grassy Forest","Tableland Damp Forest","Cool Temperate Rainforest","Riverine Chenopod Woodland","Valley Grassy Forest","Plains Grassy Wetland","Riverine Chenopod Woodland","Floodway Pond Herbland","Box Ironbark Forest","Plains Grassy Woodland","Coastal Tussock Grassland","Plains Woodland","Grassy Forest","Montane Riparian Woodland","Creekline Grassy Woodland","Swamp Scrub","Coastal Headland Scrub","Shrubby Foothill Forest","Hillcrest Herb-rich Woodland"]
["Central Victorian Uplands","CVU_","Aquatic Grassy Wetland","Central Victorian UplandsAquatic Grassy Wetland","CVU_0306",null,0,0,null,null,null,null,null,null,null,null,null,null,null,null,null,null,null,null,null,null,null,null,null,null,null,null,null,null,null,null,null,null,null,null,null,null,null,null,null,null,null,null,null,null,null,null,0,0,null,null,null,0,0,0,{"$error":"#N/A"},{"$error":"#N/A"},{"$error":"#N/A"},{"$error":"#N/A"},{"$error":"#N/A"},{"$error":"#N/A"},{"$error":"#N/A"},{"$error":"#N/A"},{"$error":"#N/A"},{"$error":"#N/A"},null,"Northern Inland Slopes","NIS_",null,"Shrubby Foothill Forest","Plains Grassland","Heathy Dry Forest","Rocky Outcrop Shrubland","Damp Forest","Sedge Wetland","Hillcrest Herb-rich Woodland","Plains Grassy Woodland",null,"Montane Dry Woodland","Warm Temperate Rainforest","Lake Bed Herbland",null,"Plains Grassland","Lignum Swamp","Intermittent Swampy Woodland","Alluvial Terraces Herb-rich Woodland","Floodplain Riparian Woodland","Damp Heath Scrub","Alluvial Plains Semi-arid Grassland","Plains Grassy Forest","Treed Montane Riparian Woodland","Granitic Hills Woodland","Plains Grassy Woodland","Coastal Tussock Grassland","Heathy Woodland","Hills Herb-rich Woodland"]
["Central Victorian Uplands","CVU_","Blackthorn Scrub","Central Victorian UplandsBlackthorn Scrub","CVU_0027",null,0,0,null,null,null,null,null,null,null,null,null,null,null,null,null,null,null,null,null,null,null,null,null,null,null,null,null,null,null,null,null,null,null,null,null,null,null,null,null,null,null,null,null,null,null,null,0,0,null,null,null,0,0,1.25,1.25,27,"Ra","Rare",3,0,0,"CVU_0027","scrubs/shrublands/mallee without logs","Woody vegetation",null,"Otway Plain","OtP_",null,"Valley Grassy Forest","Sand Forest","Shrubby Dry Forest","Damp Forest","Wet Forest","Bird Colony Succulent Herbland","Hills Herb-rich Woodland","Alluvial Terraces Herb-rich Woodland",null,"Montane Grassy Woodland","Cool Temperate Rainforest/Warm Temperate Rainf","Plains Grassland",null,"Chenopod Mallee","Grassy Riverine Forest","Riverine Swampy Woodland","Creekline Grassy Woodland","Creekline Grassy Woodland","Grassy Woodland","Lignum Shrubland","Coastal Headland Scrub","Montane Riparian Thicket","Wetland Formation","Plains Grassy Woodland","Damp Heath Scrub","Swamp Scrub","Wetland Formation"]
["Central Victorian Uplands","CVU_","Box Ironbark Forest","Central Victorian UplandsBox Ironbark Forest","CVU_0061",70,15,20,30,0,5,1,5,null,null,6,25,2,5,1,1,2,1,5,10,1,1,1,5,null,null,7,15,null,null,null,null,null,null,null,null,null,null,null,null,null,null,0,10,"0","10","Continuous",0,12,9,8,35,20,200,1,1,61,"Vu","Vulnerable",1,0,0,"CVU_0061","Forest/Woodland","Woody vegetation",null,"Otway Ranges","OtR_",null,"Heathy Woodland","Sedge Wetland","Grassy Dry Forest","Wet Forest","Warm Temperate Rainforest","Coastal Dune Scrub","Granitic Hills Woodland","Creekline Grassy Woodland",null,"Montane Damp Forest","Dry Rainforest","Chenopod Mallee",null,"Grassy Woodland","Lake Bed Herbland","Shrubby Riverine Woodland","Granitic Hills Woodland","Wetland Formation","Sedgy Riparian Woodland","Floodplain Grassy Wetland","Coastal Tussock Grassland","Sub-alpine Shrubland","Spring Soak Woodland","Riverina Plains Grassy Woodland (syn. EVC 8","Grassy Woodland","Granitic Hills Woodland","Lowan Sands Mallee"]
["Central Victorian Uplands","CVU_","Clay Heathland","Central Victorian UplandsClay Heathland","CVU_0007",0,0,0,null,null,null,null,null,null,null,9,30,6,10,3,5,null,null,8,10,null,null,4,10,1,5,7,10,2,5,null,null,null,null,null,null,null,null,null,null,null,null,0,10,"0","10","Episodic",30,10,15,8,40,20,0,1.36,1.36,7,"Vu","Vulnerable",4,0,0,"CVU_0007","heathlands","Woody vegetation",null,"Robinvale Plains","RobP",null,"Swamp Scrub","Grassy Woodland","Herb-rich Foothill Forest","Cool Temperate Rainforest","Dry Rainforest","Coastal Headland Scrub","Wetland Formation","Hills Herb-rich Woodland",null,"Montane Wet Forest","Tableland Damp Forest","Seasonally Inundated Shrubby Woodland",null,"Shallow Freshwater Marsh","Plains Grassland","Spike-sedge Wetland","Wetland Formation","Swampy Riparian Woodland","Shrubby Wet Forest","Floodway Pond Herbland","Grassy Woodland","Sub-alpine Woodland","Riverine Escarpment Scrub","Plains Grassy Woodland","Coast Gully Thicket","Wetland Formation","Heathy Mallee"]
["Central Victorian Uplands","CVU_","Creekline Grassy Woodland","Central Victorian UplandsCreekline Grassy Woodland","CVU_0068",80,15,15,15,0,5,1,5,null,null,4,10,3,5,null,null,2,5,9,15,3,5,3,15,1,5,15,30,3,5,null,null,null,null,null,null,null,null,null,null,null,null,0,10,null,null,"Continuous",0,12,8,14,20,40,300,1,1,68,"En","Endangered",1,0,0,"CVU_0068","Forest/Woodland","Woody vegetation",null,"Strzelecki Ranges","Strz",null,"Plains Grassy Woodland","Heathy Herb-rich Woodland","Blackthorn Scrub","Warm Temperate Rainforest","Shrubby Foothill Forest","Creekline Herb-rich Woodland","Swampy Riparian Woodland","Plains Grassy Wetland",null,"Montane Riparian Woodland","Montane Dry Woodland","Cane Grass Wetland",null,"Sand Ridge Woodland","Chenopod Mallee","Sub-saline Depression Shrubland","Spring Soak Woodland","Lignum Swamp","Wet Sands Thicket","Intermittent Swampy Woodland","Riparian Scrub","Shrubby Foothill Forest","Swampy Riparian Woodland","Floodplain Riparian Woodland","Sedgy Riparian Woodland","Sedge Wetland","Dunefield Heathland"]
["Central Victorian Uplands","CVU_","Creekline Herb-rich Woodland","Central Victorian UplandsCreekline Herb-rich Woodland","CVU_0164",70,10,15,15,0,5,2,5,null,null,3,15,1,5,1,1,1,0,6,20,1,5,1,20,1,5,2,5,1,5,null,null,null,null,2,0,null,null,null,null,null,null,0,20,null,null,"Continuous",0,14,6,8,25,20,100,1,1,164,"Vu","Vulnerable",1,0,0,"CVU_0164","Forest/Woodland","Woody vegetation",null,"Victorian Alps","VAlp",null,"Floodplain Riparian Woodland","Riparian Scrub","Rocky Outcrop Shrubland","Dry Rainforest","Valley Grassy Forest","Heathy Herb-rich Woodland","Scrub-pine Woodland","Sand Forest",null,"Montane Riparian Thicket","Montane Grassy Woodland","Red Gum Swamp",null,"Red Gum Swamp","Shallow Freshwater Marsh","Lignum Swampy Woodland","Riverine Escarpment Scrub","Plains Grassy Wetland","Floodplain Reedbed","Sedgy Riverine Forest","Wet Sands Thicket","Granitic Hills Woodland","Sandstone Ridge Shrubland","Box Ironbark Forest","Shallow Freshwater Marsh","Mangrove Shrubland","Sandstone Ridge Shrubland"]
["Central Victorian Uplands","CVU_","Damp Forest","Central Victorian UplandsDamp Forest","CVU_0029",90,20,30,40,0,5,3,15,null,null,3,10,null,null,1,5,1,1,11,20,2,5,3,10,1,5,3,10,1,5,null,null,null,null,4,20,"1","5",null,null,1,5,0,20,null,null,"Continuous",0,15,6,14,25,50,300,1,1,29,"LC","Least Concern",1,0,0,"CVU_0029","Forest/Woodland","Woody vegetation",null,"Victorian Riverina","VRiv",null,"Box Ironbark Forest","Rocky Outcrop Herbland","Damp Forest","Tableland Damp Forest","Heathy Woodland","Riparian Scrub","Sandstone Ridge Shrubland","Sedge Wetland",null,"Sub-alpine Woodland","Montane Damp Forest","Riverine Grassy Woodland",null,"Riverine Grassy Woodland","Riverine Grassy Woodland","Woorinen Mallee","Swampy Riparian Woodland","Grassy Forest","Scoria Cone Woodland","Shrubby Riverine Woodland","Damp Heathy Woodland","Riverine Escarpment Scrub","Treed Sandstone Ridge Shrubland","Rocky Chenopod Woodland","Shrubby Wet Forest","Bird Colony Shrubland","Red Swale Mallee"]
["Central Victorian Uplands","CVU_","Damp Sands Herb-rich Woodland","Central Victorian UplandsDamp Sands Herb-rich Woodland","CVU_0003",70,15,15,15,0,5,2,10,null,null,3,10,3,5,null,null,null,null,16,20,7,15,1,10,null,null,10,15,2,10,null,null,null,null,1,10,null,null,null,null,null,null,0,10,null,null,"Continuous",0,11,8,23,25,40,150,1,1,3,"En","Endangered",1,0,0,"CVU_0003","Forest/Woodland","Woody vegetation",null,"Victorian Volcanic Plain","VVP_",null,"Rocky Chenopod Woodland","Seasonally Inundated Shrubby Woodland","Wet Forest","Montane Dry Woodland","Swamp Scrub","Seasonally Inundated Shrubby Woodland","Semi-arid Woodland","Damp Heath Scrub",null,"Shrubby Foothill Forest","Montane Wet Forest","Riparian Woodland",null,"Riparian Woodland","Riparian Woodland",null,"Sandstone Ridge Shrubland","Plains Grassland",null,"Spike-sedge Wetland","Swampy Woodland","Swampy Riparian Woodland","Ridged Plains Mallee","Alluvial Terraces Herb-rich Woodland","Stony Rises Woodland","Coastal Headland Scrub","Ridged Plains Mallee"]
["Central Victorian Uplands","CVU_","Escarpment Shrubland","Central Victorian UplandsEscarpment Shrubland","CVU_0895",0,0,0,null,null,null,null,null,null,null,3,10,2,5,null,null,3,5,4,10,5,5,1,5,1,5,9,25,3,5,null,null,null,null,1,5,null,null,null,null,1,5,0,10,"0","10","Continuous",0,13,5,12,15,20,50,1.1499999999999999,1,895,"En","Endangered",1,0,0,"CVU_0895","Forest/Woodland","Woody vegetation",null,"Warrnambool Plain","WaP_",null,"Alluvial Terraces Herb-rich Woodland","Sedgy Riparian Woodland","Warm Temperate Rainforest","Montane Grassy Woodland","Plains Grassy Woodland","Sedgy Riparian Woodland","Lignum Swamp","Grassy Woodland",null,"Valley Grassy Forest","Montane Riparian Woodland","Salt Paperbark Woodland",null,"Lunette Woodland","Salt Paperbark Woodland",null,"Treed Sandstone Ridge Shrubland","Mangrove Shrubland",null,"Sub-saline Depression Shrubland",null,"Alpine Coniferous Shrubland","Semi-arid Woodland","Creekline Grassy Woodland","Basalt Shrubby Woodland","Coastal Tussock Grassland","Semi-arid Woodland"]
["Central Victorian Uplands","CVU_","Floodplain Riparian Woodland","Central Victorian UplandsFloodplain Riparian Woodland","CVU_0056",80,15,20,15,0,5,2,10,null,null,6,15,1,1,null,null,4,10,4,10,1,1,3,10,2,10,3,10,3,10,null,null,null,null,1,5,null,null,null,null,1,5,0,10,null,null,"Episodic",10,14,9,9,26,40,300,1,1,56,"En","Endangered",1,0,0,"CVU_0056","Forest/Woodland","Woody vegetation",null,"Wilsons Promontory","WPro",null,"Creekline Grassy Woodland","Shallow Freshwater Marsh","Dry Rainforest","Montane Damp Forest","Floodplain Riparian Woodland","Shallow Freshwater Marsh","Plains Grassy Wetland","Montane Wet Heathland",null,"Heathy Woodland","Montane Riparian Thicket","Damp Heathland",null,"Aquatic Herbland","Plains Woodland",null,"Samphire Shrubland","Bird Colony Shrubland",null,"Tall Marsh",null,"Dry Valley Forest","Semi-arid Chenopod Woodland","Hills Herb-rich Woodland","Plains Sedgy Wetland","Riparian Scrub","Semi-arid Chenopod Woodland"]
["Central Victorian Uplands","CVU_","Granitic Grassy Woodland","Central Victorian UplandsGranitic Grassy Woodland","CVU_0175_62",70,15,15,15,0,5,2,10,null,null,2,15,1,1,1,1,null,null,8,20,3,10,1,1,null,null,8,40,1,5,null,null,null,null,1,5,null,null,null,null,null,null,0,10,null,null,"Continuous",0,12,5,11,26,20,150,1,{"$error":"#N/A"},{"$error":"#N/A"},{"$error":"#N/A"},{"$error":"#N/A"},{"$error":"#N/A"},{"$error":"#N/A"},{"$error":"#N/A"},{"$error":"#N/A"},{"$error":"#N/A"},{"$error":"#N/A"},null,"Wimmera","Wim_",null,"Hillcrest Herb-rich Woodland","Heathland Thicket","Valley Grassy Forest","Montane Wet Forest","Riparian Thicket","Plains Sedgy Woodland","Valley Heathy Forest","Riparian Scrub",null,"Plains Grassy Woodland","Sub-alpine Woodland","Plains Woodland",null,"Plains Woodland","Lignum Shrubland",null,"Riverine Chenopod Woodland","Coastal Dune Scrub",null,"Lignum Swampy Woodland",null,"Alpine Fen","Non-treed Semi-arid Chenopod Woodland","Granitic Hills Woodland","Plains Swampy Woodland","Montane Rocky Shrubland","Non-treed Semi-arid Chenopod Woodland"]
["Central Victorian Uplands","CVU_","Granitic Hills Woodland","Central Victorian UplandsGranitic Hills Woodland","CVU_0072",60,15,10,15,0,5,2,10,null,null,5,5,null,null,null,null,4,10,9,15,2,5,null,null,null,null,11,20,2,1,null,null,null,null,2,5,null,null,null,null,2,1,0,10,"0","10","Continuous",0,12,7,15,15,20,150,1,1,72,"D","Depleted",1,0,0,"CVU_0072","Forest/Woodland","Woody vegetation",null,null,null,null,"Hills Herb-rich Woodland","Floodplain Thicket","Heathy Woodland","Montane Riparian Woodland","Box Ironbark Forest","Red Gum Swamp","Plains Grassland","Montane Rocky Shrubland",null,"Floodplain Riparian Woodland","Shrubby Foothill Forest","Intermittent Swampy Woodland",null,"Rushy Riverine Swamp","Floodplain Grassy Wetland",null,"Plains Grassy Wetland","Coastal Headland Scrub",null,"Woorinen Mallee",null,"Grassy Woodland","Samphire Shrubland","Wetland Formation","Aquatic Herbland","Wet Rocky Outcrop Scrub","Samphire Shrubland"]
["Central Victorian Uplands","CVU_","Grassy Dry Forest","Central Victorian UplandsGrassy Dry Forest","CVU_0022",70,20,20,30,0,5,1,5,null,null,3,10,3,5,1,1,3,5,7,20,2,5,1,5,null,null,7,30,1,1,null,null,null,null,1,1,null,null,null,null,1,1,0,10,"0","10","Continuous",0,15,7,12,20,20,200,1,1,22,"D","Depleted",1,0,0,"CVU_0022","Forest/Woodland","Woody vegetation",null,null,null,null,"Granitic Hills Woodland","Shrubby Woodland","Swamp Scrub","Montane Riparian Thicket","Creekline Grassy Woodland","Aquatic Sedgeland","Creekline Herb-rich Woodland","Rocky Outcrop Herbland",null,"Riparian Thicket","Valley Grassy Forest","Lignum Swampy Woodland",null,"Lignum Shrubland","Floodway Pond Herbland",null,"Plains Grassland","Coastal Tussock Grassland",null,"Semi-arid Parilla Woodland",null,"Montane Rocky Shrubland","Riverine Chenopod Woodland","Swampy Riparian Woodland","Freshwater Meadow","Coastal Alkaline Scrub","Low Chenopod Shrubland"]
["Central Victorian Uplands","CVU_","Grassy Forest","Central Victorian UplandsGrassy Forest","CVU_0128",70,20,20,30,0,5,2,10,null,null,3,10,4,5,2,1,3,5,10,15,null,null,1,5,null,null,9,30,null,null,null,null,null,null,1,0,null,null,null,null,2,1,0,10,null,null,"Continuous",0,12,9,13,25,20,200,1,1,128,"Vu","Vulnerable",1,0,0,"CVU_0128","Forest/Woodland","Woody vegetation",null,null,null,null,"Wetland Formation","Plains Sedgy Woodland","Estuarine Swamp Scrub","Sub-alpine Shrubland","Granitic Hills Woodland","Calcareous Wet Herbland","Grassy Woodland","Seasonally Inundated Shrubby Woodland",null,"Creekline Grassy Woodland","Heathy Woodland","Woorinen Mallee",null,"Floodplain Grassy Wetland","Intermittent Swampy Woodland",null,"Grassy Woodland","Damp Heath Scrub",null,null,null,"Shrubby Wet Forest","Lignum Swamp","Lignum Swamp","Deep Freshwater Marsh","Blocked Coastal Stream Swamp","Riverine Chenopod Woodland"]
["Central Victorian Uplands","CVU_","Grassy Woodland","Central Victorian UplandsGrassy Woodland","CVU_0175",null,null,null,null,null,null,null,null,null,null,null,null,null,null,null,null,null,null,null,null,null,null,null,null,null,null,null,null,null,null,null,null,null,null,null,null,null,null,null,null,null,null,null,null,null,null,null,null,0,null,null,null,null,0,1,1,175,"En","Endangered",1,0,0,"CVU_0175","Forest/Woodland","Woody vegetation",null,null,null,null,"Spring Soak Woodland","Dry Creekline Woodland","Plains Grassy Woodland","Sub-alpine Woodland","Wetland Formation","Creekline Sedgy Woodland","Low Rises Grassy Woodland","Sedgy Riparian Woodland",null,"Granitic Hills Woodland","Swamp Scrub","Plains Savannah",null,"Floodway Pond Herbland","Sedgy Riverine Forest",null,"Low Rises Grassy Woodland","Grassy Woodland",null,null,null,"Sub-alpine Grassland","Grassy Riverine Forest","Grassy Riverine Forest","Semi-permanent Saline","Spray-zone Coastal Shrubland","Southern Wimmera Riverine Chenopod Woodland"]
["Central Victorian Uplands","CVU_","Grassy Woodland","Central Victorian UplandsGrassy Woodland","CVU_0175_61",70,15,15,15,0,5,1,5,null,null,2,15,1,1,1,1,null,null,8,20,3,10,null,null,null,null,8,40,1,1,null,null,null,null,null,null,null,null,null,null,null,null,0,10,null,null,"Continuous",0,10,4,11,21,20,150,1,{"$error":"#N/A"},{"$error":"#N/A"},{"$error":"#N/A"},{"$error":"#N/A"},{"$error":"#N/A"},{"$error":"#N/A"},{"$error":"#N/A"},{"$error":"#N/A"},{"$error":"#N/A"},{"$error":"#N/A"},null,null,null,null,"Riverine Escarpment Scrub","Red Gum Swamp","Riverine Escarpment Scrub","Shrubby Foothill Forest","Riverine Escarpment Scrub","Riparian Woodland","Granitic Grassy Woodland","Shallow Freshwater Marsh",null,"Riverine Escarpment Scrub","Plains Grassy Woodland","Treed Plains Savannah",null,"Intermittent Swampy Woodland","Shrubby Riverine Woodland",null,"Rainshadow Grassy Woodland","Seasonally Inundated Sub-saline Herbland",null,null,null,"Sub-alpine Riparian Shrubland","Lake Bed Herbland","Plains Grassy Wetland","Permanent Saline","Estuarine Flats Grassland","Northern Wimmera Riverine Chenopod Woodland"]
["Central Victorian Uplands","CVU_","Heathy Dry Forest","Central Victorian UplandsHeathy Dry Forest","CVU_0020",60,20,20,30,0,5,null,null,null,null,6,30,5,20,1,1,null,null,3,5,null,null,1,5,null,null,4,20,null,null,null,null,null,null,null,null,null,null,null,null,null,null,0,10,"0","10","Episodic",20,9,11,3,50,20,200,1,1,20,"LC","Least Concern",1,0,0,"CVU_0020","Forest/Woodland","Woody vegetation",null,null,null,null,"Swampy Riparian Woodland","Creekline Sedgy Woodland","Plains Grassy Wetland","Valley Grassy Forest","Swampy Riparian Woodland","Basalt Shrubby Woodland","Sedgy Riparian Woodland","Stony Rises Woodland",null,"Swampy Riparian Woodland","Floodplain Riparian Woodland","Chenopod Grassland",null,"Riverine Swamp Forest","Tall Marsh",null,"Shrubby Granitic-outwash Grassy Woodland","Sedgy Riparian Woodland",null,null,null,"Sub-alpine Wet Heathland","Plains Grassy Wetland","Valley Heathy Forest","Basalt Creekline Shrubby Woodland",null,"Lignum Swamp"]
["Central Victorian Uplands","CVU_","Heathy Woodland","Central Victorian UplandsHeathy Woodland","CVU_0048",60,15,10,15,0,5,null,null,null,null,7,40,6,20,1,1,null,null,4,5,null,null,2,10,1,5,4,10,null,null,null,null,null,null,1,1,null,null,"1","0",null,null,0,10,"0","10","Episodic",20,12,13,4,60,40,150,1,1,48,"D","Depleted",1,0,0,"CVU_0048","Forest/Woodland","Woody vegetation",null,null,null,null,"Plains Grassy Wetland","Riparian Woodland","Limestone Pomaderris Shrubland","Riverine Escarpment Scrub","Plains Grassy Wetland","Plains Sedgy Wetland","Sand Ridge Woodland","Herb-rich Heathy Forest",null,"Lake Bed Herbland","Riparian Thicket","Shallow Sands Woodland",null,"Riverine Swampy Woodland","Lignum Swampy Woodland",null,"Cane Grass Wetland","Shallow Freshwater Marsh",null,null,null,"Alpine Valley Bog","Valley Heathy Forest","Grassy Forest","Tall Marsh",null,"Plains Grassy Wetland"]
["Central Victorian Uplands","CVU_","Herb-rich Foothill Forest","Central Victorian UplandsHerb-rich Foothill Forest","CVU_0023",70,20,25,40,0,5,2,10,null,null,3,5,2,1,1,1,4,5,11,25,3,5,2,5,1,5,6,20,2,5,null,null,null,null,2,10,null,null,null,null,3,5,0,20,null,null,"Continuous",0,15,7,18,16,40,200,1,1,23,"D","Depleted",1,0,0,"CVU_0023","Forest/Woodland","Woody vegetation",null,null,null,null,"Valley Heathy Forest","Basalt Shrubby Woodland","Gallery Rainforest","Swampy Riparian Woodland","Valley Heathy Forest","Plains Swampy Woodland","Shrubby Woodland","Heathland Thicket",null,"Valley Heathy Forest","Box Ironbark Forest","Parilla Mallee",null,"Sedgy Riverine Forest","Woorinen Mallee",null,"Red Gum Swamp","Shrubby Wet Forest",null,null,null,"Shrubby Damp Forest","Plains Grassland","Plains Grassland","Scoria Cone Woodland",null,"Plains Grassland"]
["Central Victorian Uplands","CVU_","Hillcrest Herb-rich Woodland","Central Victorian UplandsHillcrest Herb-rich Woodland","CVU_0070",70,15,10,15,0,5,2,5,null,null,2,5,1,1,1,1,4,10,14,20,2,5,1,0,null,null,9,20,3,5,"3","5",null,null,1,5,null,null,null,null,2,1,0,10,null,null,"Continuous",0,15,5,20,11,20,150,1,1,70,"D","Depleted",1,0,0,"CVU_0070","Forest/Woodland","Woody vegetation",null,null,null,null,"Grassy Forest","Plains Sedgy Wetland","Sandy Flood Scrub","Valley Heathy Forest","Grassy Forest","Lunette Woodland","Red Gum Swamp","Floodplain Thicket",null,"Dry Valley Forest","Creekline Grassy Woodland",null,null,"Shrubby Riverine Woodland","Plains Savannah",null,"Riverine Grassy Woodland","Stony Rises Woodland",null,null,null,"Montane Herb-rich Woodland","Chenopod Mallee","Heavier-soils Plains Grassland",null,null,"Sand Forest"]
["Central Victorian Uplands","CVU_","Hills Herb-rich Woodland","Central Victorian UplandsHills Herb-rich Woodland","CVU_0071",70,15,15,15,0,5,1,5,null,null,4,10,2,1,1,1,1,5,4,5,null,null,1,1,null,null,8,25,3,5,null,null,null,null,null,null,null,null,null,null,null,null,0,10,"0","10","Continuous",0,12,7,5,16,20,150,1,1,71,"Vu","Vulnerable",1,0,0,"CVU_0071","Forest/Woodland","Woody vegetation",null,null,null,null,"Plains Grassland","Stony Knoll Shrubland","Plains Grassy Forest","Limestone Pomaderris Shrubland","Plains Grassland","Aquatic Herbland","Riverine Grassy Woodland","Sedge-rich Wetland",null,"Grassy Woodland","Wetland Formation",null,null,"Spike-sedge Wetland","Treed Plains Savannah",null,"Plains Woodland","Wet Sands Thicket",null,null,null,"Alpine Grassland","Grassy Woodland","Lighter-soils Plains Grassland",null,null,"Sedge Wetland"]
["Central Victorian Uplands","CVU_","Lowland Forest","Central Victorian UplandsLowland Forest","CVU_0016",70,20,20,30,0,5,2,10,null,null,6,20,5,15,2,5,2,5,7,20,1,1,2,5,1,10,6,20,2,1,null,null,null,null,null,null,null,null,null,null,null,null,0,10,null,null,"Continuous",0,13,13,10,45,40,200,1,1,16,"LC","Least Concern",1,0,0,"CVU_0016","Forest/Woodland","Woody vegetation",null,null,null,null,"Sand Forest","Treed Stony Knoll Shrubland","Coastal Dune Scrub","Treed Limestone Pomaderris Shrubland","LaTrobe Valley Plains Grassland","Brackish Wetland","Riparian Woodland","Shrubby Woodland",null,"Perched Boggy Shrubland","Riverine Escarpment Scrub",null,null,"Tall Marsh","Semi-arid Parilla Woodland",null,"Riverine Swampy Woodland","Berm Grassy Shrubland",null,null,null,"Alpine Damp Grassland","Low Rises Grassy Woodland","Low-rainfall Plains Grassland",null,null,"Creekline Herb-rich Woodland"]
["Central Victorian Uplands","CVU_","Montane Grassy Woodland","Central Victorian UplandsMontane Grassy Woodland","CVU_0037",50,15,10,20,0,5,1,5,null,null,6,20,3,10,2,5,2,5,15,20,3,10,2,5,null,null,7,20,1,1,null,null,null,null,1,1,null,null,null,null,1,0,0,10,"0","10","Continuous",0,15,10,20,35,20,150,1,1,37,"Vu","Vulnerable",1,0,0,"CVU_0037","Forest/Woodland","Woody vegetation",null,null,null,null,"Sedge Wetland","Plains Swampy Woodland","Dry Valley Forest","Gallery Rainforest","South Gippsland Plains Grassland","Freshwater Lignum Shrubland","Drainage-line Woodland","Plains Sedgy Woodland",null,"Riparian Scrub","Swampy Riparian Woodland",null,null,"Lignum Swampy Woodland","Chenopod Grassland",null,"Lignum Swampy Woodland","Plains Sedgy Wetland",null,null,null,"Sub-alpine Dry Shrubland","Shrubby Granitic-outwash Grassy Woodland","Sand Forest",null,null,"Grassy Woodland"]
["Central Victorian Uplands","CVU_","Mountain Valley Riparian Woodland","Central Victorian UplandsMountain Valley Riparian Woodland","CVU_1085",null,0,0,null,null,null,null,null,null,null,null,null,null,null,null,null,null,null,null,null,null,null,null,null,null,null,null,null,null,null,null,null,null,null,null,null,null,null,null,null,null,null,null,null,null,null,null,0,0,null,null,null,0,0,1,1,1085,"Vu","Vulnerable",1,0,0,"CVU_1085","Forest/Woodland","Woody vegetation",null,null,null,null,"Creekline Herb-rich Woodland","Lunette Woodland","Grassy Woodland","Dry Valley Forest","Limestone Pomaderris Shrubland","Limestone Ridge Woodland","Lateritic Woodland","Claypan Ephemeral Wetland",null,"Shrubby Wet Forest","Plains Grassy Wetland",null,null,"Woorinen Mallee","Shallow Sands Woodland",null,"Plains Savannah","Tall Marsh",null,null,null,"Alpine Grassy Heathland","Sand Ridge Woodland","Sedge Wetland",null,null,"Heathy Herb-rich Woodland"]
["Central Victorian Uplands","CVU_","Plains Grassland","Central Victorian UplandsPlains Grassland","CVU_0132",0,0,0,null,null,null,null,null,null,null,null,null,1,1,null,null,3,10,10,20,3,5,1,5,null,null,13,50,4,10,null,null,null,null,null,null,null,null,null,null,null,null,0,10,"0","10","Episodic",5,9,1,16,1,10,0,1.36,1.36,132,"En","Endangered",5,"y",0,"CVU_0132","grasslands","Other grassland vegetation",null,null,null,null,"Grassy Woodland","Aquatic Herbland","Rainshadow Grassy Woodland","Grassy Woodland","Treed Limestone Pomaderris Shrubland","Coastal Mallee Scrub","Plains Woodland","Dry Creekline Woodland",null,"Sub-alpine Grassland","Valley Heathy Forest",null,null,"Plains Savannah","Parilla Mallee",null,"Treed Plains Savannah","Saline Aquatic Meadow",null,null,null,"Snowpatch Grassland","Cane Grass Wetland","Mangrove Shrubland",null,null,"Riparian Scrub"]
["Central Victorian Uplands","CVU_","Plains Grassy Wetland","Central Victorian UplandsPlains Grassy Wetland","CVU_0125",0,0,0,null,null,null,null,null,null,null,null,null,null,null,null,null,5,5,6,10,3,10,3,15,1,5,8,30,2,10,null,null,null,null,null,null,null,null,null,null,null,null,0,10,null,null,"Episodic",5,8,null,14,null,20,0,1.36,1.36,125,"En","Endangered",6,"y",0,"CVU_0125","wetlands","Non-woody wetland vegetation",null,null,null,null,"Grassy Woodland","Creekline Tussock Grassland","Limestone Grassy Woodland","Rainshadow Grassy Woodland","Sand Forest","Limestone Woodland","Riverine Swampy Woodland","Red Gum Swamp",null,"Montane Grassy Shrubland","Grassy Forest",null,null,"Treed Plains Savannah",null,null,"Shallow Sands Woodland","Stream Bank Shrubland",null,null,null,"Late-lying Snowpatch Herbland","Red Gum Swamp","Coastal Dune Scrub",null,null,"Seasonally Inundated Shrubby Woodland"]
["Central Victorian Uplands","CVU_","Plains Grassy Woodland","Central Victorian UplandsPlains Grassy Woodland","CVU_0055",80,15,15,15,0,5,3,10,null,null,3,5,4,10,2,5,null,null,9,20,4,5,2,10,1,5,6,25,2,5,null,null,null,null,1,1,null,null,null,null,null,null,0,10,null,null,"Continuous",0,13,10,13,25,10,100,1,1,55,"En","Endangered",1,0,0,"CVU_0055","Forest/Woodland","Woody vegetation",null,null,null,null,"Granitic Grassy Woodland","Freshwater Lignum Shrubland","Valley Slopes Dry Forest","Limestone Grassy Woodland","Gallery Rainforest","Sandy Stream Woodland","Stream Bank Shrubland","Creekline Sedgy Woodland",null,"Treed Montane Grassy Shrubland","Plains Grassland",null,null,"Chenopod Grassland",null,null,"Swampy Woodland","Coastal Alkaline Scrub",null,null,null,null,"Riverine Grassy Woodland","Coastal Headland Scrub",null,null,"Shallow Freshwater Marsh"]
["Central Victorian Uplands","CVU_","Plains Sedgy Wetland","Central Victorian UplandsPlains Sedgy Wetland","CVU_0647",0,0,0,null,null,null,null,null,null,null,null,null,null,null,null,null,2,5,5,40,5,10,2,5,1,5,4,25,2,5,null,null,null,null,null,null,null,null,null,null,null,null,null,null,null,null,"Episodic",5,7,null,12,null,10,50,1.36,1.36,647,"En","Endangered",6,0,0,"CVU_0647","wetlands","Non-woody wetland vegetation",null,null,null,null,"Valley Slopes Dry Forest","Dune Soak Woodland","Riparian Scrub","Valley Slopes Dry Forest","Sedge Wetland","Freshwater Meadow","Scoria Cone Woodland","Riparian Woodland",null,"Sub-alpine Wet Heathland","Plains Grassy Forest",null,null,"Shallow Sands Woodland",null,null,"Mountain Valley Riparian Woodland","Floodplain Reedbed",null,null,null,null,"Riparian Woodland","Coastal Tussock Grassland",null,null,"Sand Ridge Woodland"]
["Central Victorian Uplands","CVU_","Plains Woodland","Central Victorian UplandsPlains Woodland","CVU_0803",70,15,15,15,0,5,null,null,null,null,2,5,2,5,1,1,1,1,20,20,4,10,1,1,1,1,16,45,3,5,null,null,null,null,null,null,null,null,null,null,null,null,0,10,"0","10","Continuous",0,13,4,25,10,10,100,1,1,803,"En","Endangered",1,0,0,"CVU_0803","Forest/Woodland","Woody vegetation",null,null,null,null,"Riparian Scrub","Sandy Stream Woodland","Aquatic Sedgeland","Shrubby Wet Forest","Mangrove Shrubland","Deep Freshwater Marsh",null,"Basalt Shrubby Woodland",null,"Montane Swamp","Creekline Herb-rich Woodland",null,null,"Riverine Ephemeral Wetland",null,null,null,"Coastal Dune Grassland",null,null,null,null,"Lunette Woodland","Creekline Herb-rich Woodland",null,null,"Shrubby Woodland"]
["Central Victorian Uplands","CVU_","Red Gum Swamp","Central Victorian UplandsRed Gum Swamp","CVU_0292",80,10,15,15,0,5,null,null,null,null,null,null,null,null,null,null,2,10,7,25,3,15,2,15,null,null,6,20,2,15,null,null,null,null,null,null,null,null,null,null,null,null,null,null,null,null,"Episodic",5,7,null,12,null,10,100,1,1,292,"En","Endangered",1,0,0,"CVU_0292","Forest/Woodland","Woody vegetation",null,null,null,null,"Seasonally Inundated Shrubby Woodland","Freshwater Meadow","Shrubby Damp Forest","Sub-alpine Grassland","Sandy Flood Scrub","Permanent Open Freshwater",null,"Plains Sedgy Wetland",null,"Montane Herb-rich Woodland","Dry Valley Forest",null,null,"Riverine Grassland",null,null,null,"Plains Brackish Sedge Wetland",null,null,null,null,"Plains Woodland","Damp Heath Scrub",null,null,"Plains Sedgy Woodland"]
["Central Victorian Uplands","CVU_","Riparian Forest","Central Victorian UplandsRiparian Forest","CVU_0018",80,20,30,40,0,5,3,15,null,null,5,20,null,null,1,1,2,5,11,20,2,5,4,15,2,5,4,10,2,5,null,null,null,null,4,15,"1","5",null,null,2,5,0,20,null,null,"Continuous",0,15,8,15,35,50,300,1,1,18,"Vu","Vulnerable",1,0,0,"CVU_0018","Forest/Woodland","Woody vegetation",null,null,null,null,"Sedgy Riparian Woodland","Lateritic Woodland","Brackish Herbland","Shrubby Damp Forest","Plains Grassy Forest","Permanent Saline",null,"Aquatic Herbland",null,"Montane Grassland","Grassy Woodland",null,null,null,null,null,null,"Cane Grass-Lignum Halophytic Herbland",null,null,null,null,"Rushy Riverine Swamp","Grassy Woodland",null,null,"Dry Creekline Woodland"]
["Central Victorian Uplands","CVU_","Riparian Scrub","Central Victorian UplandsRiparian Scrub","CVU_0191",0,0,0,null,null,null,null,null,null,null,3,20,null,null,null,null,4,10,8,10,4,5,3,20,2,5,5,10,3,10,null,null,null,null,null,null,null,null,null,null,1,5,0,20,null,null,"Continuous",0,10,3,16,20,40,0,1.25,1.25,191,"En","Endangered",3,0,0,"CVU_0191","scrubs/shrublands/mallee without logs","Woody vegetation",null,null,null,null,"Shrubby Woodland","Basalt Creekline Shrubby Woodland","Tall Marsh","Montane Swamp","Bird Colony Succulent Herbland","Lateritic Woodland",null,"Freshwater Meadow",null,"Limestone Montane Grassland","Valley Slopes Dry Forest",null,null,null,null,null,null,"Plains Freshwater Sedge Wetland",null,null,null,null,"Floodway Pond Herbland","Non-Eucalypt Grassy Woodland",null,null,"Cane Grass Wetland"]
["Central Victorian Uplands","CVU_","Riparian Shrubland","Central Victorian UplandsRiparian Shrubland","CVU_0019",0,0,0,null,null,null,null,null,null,null,9,30,null,null,null,null,null,null,2,5,null,null,1,10,null,null,4,5,1,1,null,null,null,null,4,10,"2","1",null,null,2,5,0,20,null,null,"Continuous",0,9,9,2,30,40,50,1.25,1.25,19,"En","Endangered",3,0,0,"CVU_0019","scrubs/shrublands/mallee without logs","Woody vegetation",null,null,null,null,"Red Gum Swamp","Damp Heathland","Floodplain Reedbed","Montane Herb-rich Woodland","Coastal Dune Scrub","Sedgy Swamp Woodland",null,"Semi-permanent Saline",null,"Montane Grassland","Riparian Scrub",null,null,null,null,null,null,"Estuarine Reedbed",null,null,null,null,"Intermittent Swampy Woodland","Riparian Scrub",null,null,"Red Gum Swamp"]
["Central Victorian Uplands","CVU_","Riparian Woodland","Central Victorian UplandsRiparian Woodland","CVU_0641",80,15,15,20,0,5,2,15,null,null,3,10,1,1,null,null,4,15,5,10,1,5,3,10,1,5,4,20,2,5,null,null,null,null,null,null,null,null,null,null,1,5,0,10,null,null,"Continuous",0,13,6,10,26,30,200,1,1,641,"En","Endangered",1,0,0,"CVU_0641","Forest/Woodland","Woody vegetation",null,null,null,null,"Aquatic Grassy Wetland","Damp Heathy Woodland","Lowland Herb-rich Forest","Lowland Herb-rich Forest","Coastal Headland Scrub","Damp Heathland",null,"Lateritic Woodland",null,"Swampy Woodland","Montane Rocky Shrubland",null,null,null,null,null,null,null,null,null,null,null,"Riverine Swamp Forest","Seasonally Inundated Shrubby Woodland",null,null,"Creekline Sedgy Woodland"]
["Central Victorian Uplands","CVU_","Riverine Escarpment Scrub","Central Victorian UplandsRiverine Escarpment Scrub","CVU_0082",0,0,0,null,0,5,null,null,null,null,8,30,2,1,1,1,2,5,12,20,3,5,4,15,null,null,3,10,2,5,null,null,null,null,3,10,null,null,null,null,1,5,0,10,null,null,"Continuous",0,13,10,17,31,40,50,1.25,1.25,82,"En","Endangered",3,0,0,"CVU_0082","scrubs/shrublands/mallee without logs","Woody vegetation",null,null,null,null,"Riparian Woodland","Plains Woodland",null,null,"Coastal Tussock Grassland","Damp Heathy Woodland",null,"Damp Heathland",null,"Sub-alpine Dry Shrubland","Shrubby Wet Forest",null,null,null,null,null,null,null,null,null,null,null,"Riverine Swampy Woodland","Sedgy Riparian Woodland",null,null,"Riparian Woodland"]
["Central Victorian Uplands","CVU_","Rocky Chenopod Woodland","Central Victorian UplandsRocky Chenopod Woodland","CVU_0064",60,10,8,10,null,null,1,5,null,null,5,10,2,1,null,null,null,null,4,5,3,5,null,null,null,null,3,10,null,null,null,null,null,null,null,null,null,null,null,null,1,1,0,10,"0","20","Continuous",0,9,8,7,16,10,100,1,1,64,"Vu","Vulnerable",1,0,0,"CVU_0064","Forest/Woodland","Woody vegetation",null,null,null,null,"Plains Sedgy Wetland","Tall Marsh",null,null,"Creekline Herb-rich Woodland","Plains Woodland",null,"Plains Woodland",null,null,"Sub-alpine Grassland",null,null,null,null,null,null,null,null,null,null,null,"Sedgy Riverine Forest","Shallow Freshwater Marsh",null,null,"Plains Sedgy Wetland"]
["Central Victorian Uplands","CVU_","Rocky Outcrop Shrubland","Central Victorian UplandsRocky Outcrop Shrubland","CVU_0028",0,0,0,null,null,null,null,null,null,null,7,25,2,5,null,null,2,5,5,5,2,1,2,5,null,null,4,10,null,null,null,null,null,null,2,5,null,null,null,null,null,null,0,20,"0","10","Continuous",0,10,9,9,30,40,0,1.36,1.36,28,"LC","Least Concern",4,0,0,"CVU_0028","heathlands","Woody vegetation",null,null,null,null,"Plains Woodland","Saline Aquatic Meadow",null,null,"Dry Valley Forest","Coastal Alkaline Scrub",null,"Tall Marsh",null,null,"Sub-alpine Wet Heathland",null,null,null,null,null,null,null,null,null,null,null,"Spike-sedge Wetland","Stony Rises Woodland",null,null,"Plains Swampy Woodland"]
["Central Victorian Uplands","CVU_","Sand Forest","Central Victorian UplandsSand Forest","CVU_0134",70,15,20,30,0,5,1,5,null,null,3,5,1,5,2,5,null,null,2,5,null,null,1,1,null,null,7,15,2,1,null,null,null,null,1,50,null,null,null,null,null,null,0,10,null,null,"Continuous",0,11,5,2,15,40,150,1,1,134,"En","Endangered",1,0,0,"CVU_0134","Forest/Woodland","Woody vegetation",null,null,null,null,"Stream Bank Shrubland","Shallow Sands Woodland",null,null,"Grassy Woodland","Spray-zone Coastal Shrubland",null,"Shallow Sands Woodland",null,null,"Shrubby Damp Forest",null,null,null,null,null,null,null,null,null,null,null,"Tall Marsh","Plains Sedgy Woodland",null,null,"Lunette Woodland"]
["Central Victorian Uplands","CVU_","Sand Heathland","Central Victorian UplandsSand Heathland","CVU_0006",0,0,0,null,null,null,null,null,null,null,6,30,8,20,3,5,null,null,3,5,2,5,2,10,1,5,6,15,1,1,null,null,null,null,1,1,null,null,null,null,3,5,0,10,"0","10","Episodic",30,13,14,5,50,20,150,1.36,1.36,6,"LC","Least Concern",4,0,0,"CVU_0006","heathlands","Woody vegetation",null,null,null,null,"Shallow Sands Woodland","Escarpment Shrubland",null,null,"Riparian Scrub","Shallow Sands Woodland",null,null,null,null,"Montane Herb-rich Woodland",null,null,null,null,null,null,null,null,null,null,null,"Lignum Swampy Woodland","Cane Grass Wetland",null,null,"Aquatic Herbland"]
["Central Victorian Uplands","CVU_","Scoria Cone Woodland","Central Victorian UplandsScoria Cone Woodland","CVU_0894",70,15,15,15,0,5,1,5,null,null,2,10,null,null,null,null,3,5,6,10,3,5,1,15,null,null,4,15,1,5,null,null,null,null,2,20,null,null,null,null,null,null,0,10,"0","10","Continuous",0,12,3,12,15,20,100,1,1,894,"En","Endangered",1,0,0,"CVU_0894","Forest/Woodland","Woody vegetation",null,null,null,null,"Scoria Cone Woodland","Treed Escarpment Shrubland",null,null,"Seasonally Inundated Shrubby Woodland","Escarpment Shrubland",null,null,null,null,"Riparian Woodland",null,null,null,null,null,null,null,null,null,null,null,"Woorinen Mallee","Red Gum Swamp",null,null,"Lignum Cane Grass Swamp"]
["Central Victorian Uplands","CVU_","Seasonally Inundated Shrubby Woodland","Central Victorian UplandsSeasonally Inundated Shrubby Woodland","CVU_0195",70,15,15,15,0,5,null,null,null,null,7,30,3,10,1,1,2,5,3,10,1,1,null,null,null,null,5,15,3,10,null,null,null,null,null,null,null,null,null,null,null,null,0,10,"0","10","Continuous",0,11,10,6,40,30,150,1,1,195,"D","Depleted",1,0,0,"CVU_0195","Forest/Woodland","Woody vegetation",null,null,null,null,"Escarpment Shrubland",null,null,null,"Aquatic Sedgeland","Treed Escarpment Shrubland",null,null,null,null,"Aquatic Herbland",null,null,null,null,null,null,null,null,null,null,null,"Plains Savannah","Berm Grassy Shrubland",null,null,"Brackish Wetland"]
["Central Victorian Uplands","CVU_","Sedge Wetland","Central Victorian UplandsSedge Wetland","CVU_0136",0,0,0,null,null,null,null,null,null,null,null,null,null,null,null,null,2,5,null,null,null,null,1,1,2,40,1,5,1,5,null,null,null,null,null,null,null,null,null,null,null,null,null,null,null,null,"Episodic",5,5,null,2,null,0,0,1.36,1.36,136,"Vu","Vulnerable",6,0,0,"CVU_0136","wetlands","Non-woody wetland vegetation",null,null,null,null,"Treed Escarpment Shrubland",null,null,null,"Calcareous Swale Grassland",null,null,null,null,null,"Damp Heathland",null,null,null,null,null,null,null,null,null,null,null,"Treed Plains Savannah","Riparian Woodland",null,null,"Freshwater Lignum Shrubland"]
["Central Victorian Uplands","CVU_","Sedgy Riparian Woodland","Central Victorian UplandsSedgy Riparian Woodland","CVU_0198",70,15,15,20,0,5,1,10,null,null,4,20,2,5,null,null,1,1,7,10,2,5,3,30,2,10,7,10,2,15,null,null,null,null,1,5,null,null,null,null,null,null,0,10,null,null,"Continuous",0,13,7,10,35,30,200,1,1,198,"D","Depleted",1,0,0,"CVU_0198","Forest/Woodland","Woody vegetation",null,null,null,null,"Swampy Woodland",null,null,null,"Berm Grassy Shrubland",null,null,null,null,null,"Damp Heathy Woodland",null,null,null,null,null,null,null,null,null,null,null,"Chenopod Grassland","Basalt Shrubby Woodland",null,null,"Plains Riparian Shrubby Woodland"]
["Central Victorian Uplands","CVU_","Shallow Sands Woodland","Central Victorian UplandsShallow Sands Woodland","CVU_0882",70,15,15,15,0,5,1,5,null,null,5,20,6,15,3,5,3,5,19,20,4,5,2,5,null,null,13,20,4,5,null,null,null,null,null,null,null,null,null,null,null,null,0,10,"0","10","Continuous",0,13,12,26,40,20,150,1,1,882,"Vu","Vulnerable",1,0,0,"CVU_0882","Forest/Woodland","Woody vegetation",null,null,null,null,"Mountain Valley Riparian Woodland",null,null,null,"Shrubby Damp Forest",null,null,null,null,null,"Stream Bank Shrubland",null,null,null,null,null,null,null,null,null,null,null,"Shallow Sands Woodland","Cinder Cone Woodland",null,null,"Black Box Lignum Woodland"]
["Central Victorian Uplands","CVU_","Shrubby Dry Forest","Central Victorian UplandsShrubby Dry Forest","CVU_0021",70,20,25,30,0,5,1,5,null,null,4,20,3,10,1,1,1,1,2,5,null,null,1,15,null,null,2,10,null,null,null,null,null,null,null,null,null,null,null,null,null,null,0,10,"0","10","Episodic",20,11,8,3,35,20,200,1,1,21,"LC","Least Concern",1,0,0,"CVU_0021","Forest/Woodland","Woody vegetation",null,null,null,null,null,null,null,null,"Brackish Aquatic Herbland",null,null,null,null,null,"Treed Stream Bank Shrubland",null,null,null,null,null,null,null,null,null,null,null,"Plains Saltmarsh","Plains Sedgy Wetland",null,null,"Dune Soak Woodland"]
["Central Victorian Uplands","CVU_","Shrubby Foothill Forest","Central Victorian UplandsShrubby Foothill Forest","CVU_0045",70,20,25,40,0,5,1,5,null,null,5,20,3,10,2,5,1,1,7,15,null,null,2,5,1,15,5,20,1,5,null,null,null,null,2,10,null,null,null,null,1,1,0,10,"0","10","Episodic",30,15,9,8,35,40,200,1,1,45,"LC","Least Concern",1,0,0,"CVU_0045","Forest/Woodland","Woody vegetation",null,null,null,null,null,null,null,null,"Brackish Herbland",null,null,null,null,null,"Lowland Herb-rich Forest",null,null,null,null,null,null,null,null,null,null,null,"Swampy Woodland","Stony Knoll Shrubland",null,null,"Sandy Stream Woodland"]
["Central Victorian Uplands","CVU_","Shrubby Woodland","Central Victorian UplandsShrubby Woodland","CVU_0282",80,15,15,20,0,5,1,5,null,null,2,30,3,15,null,null,null,null,2,1,null,null,1,5,null,null,1,1,null,null,null,null,null,null,null,null,null,null,null,null,null,null,0,10,null,null,"Continuous",0,8,6,2,50,20,150,1,1,282,"Ra","Rare",1,0,0,"CVU_0282","Forest/Woodland","Woody vegetation",null,null,null,null,null,null,null,null,"Calcareous Wet Herbland",null,null,null,null,null,"Escarpment Shrubland",null,null,null,null,null,null,null,null,null,null,null,"Mountain Valley Riparian Woodland","Treed Stony Knoll Shrubland",null,null,"Salt Paperbark Woodland"]
["Central Victorian Uplands","CVU_","Spring Soak Woodland","Central Victorian UplandsSpring Soak Woodland","CVU_0080",50,5,10,15,0,5,1,5,null,null,3,10,3,5,null,null,2,5,10,25,null,null,1,1,1,5,15,25,2,5,null,null,null,null,1,5,null,null,null,null,null,null,0,20,null,null,"Continuous",0,12,7,12,20,20,50,1,1,80,"En","Endangered",1,0,0,"CVU_0080","Forest/Woodland","Woody vegetation",null,null,null,null,null,null,null,null,"Riparian Woodland",null,null,null,null,null,"Treed Escarpment Shrubland",null,null,null,null,null,null,null,null,null,null,null,null,"Plains Swampy Woodland",null,null,"Inland Saltmarsh"]
["Central Victorian Uplands","CVU_","Stream Bank Shrubland",{"$f":"CONCATENATE(A67,C67)","v":"Central Victorian UplandsStream Bank Shrubland"},"CVU_0851",80,15,20,10,0,5,1,10,null,null,10,40,null,null,null,null,4,5,9,20,2,5,3,15,null,null,3,10,2,10,null,null,null,null,1,1,null,null,null,null,2,5,0,10,null,null,"Continuous",0,12,11,15,50,20,100,1,1,851,"Vu","Vulnerable",1,0,0,"CVU_0851","Forest/Woodland","Woody vegetation",null,null,null,null,null,null,null,null,"Plains Swampy Woodland",null,null,null,null,null,"Gully Woodland",null,null,null,null,null,null,null,null,null,null,null,null,"Lunette Woodland",null,null,"Drainage-line Woodland"]
["Central Victorian Uplands","CVU_","Swamp Scrub","Central Victorian UplandsSwamp Scrub","CVU_0053",0,0,0,null,null,null,null,null,null,null,null,null,null,null,null,null,5,10,13,30,2,5,9,15,1,1,7,15,null,null,null,null,null,null,null,null,null,null,null,null,null,null,0,20,null,null,"Continuous",0,7,null,20,null,20,50,1.25,1.1499999999999999,53,"En","Endangered",3,0,0,"CVU_0053","scrubs/shrublands/mallee without logs","Woody vegetation",null,null,null,null,null,null,null,null,"Aquatic Herbland",null,null,null,null,null,"Swampy Woodland",null,null,null,null,null,null,null,null,null,null,null,null,"Aquatic Herbland",null,null,"Freshwater Meadow"]
["Central Victorian Uplands","CVU_","Swampy Riparian Woodland","Central Victorian UplandsSwampy Riparian Woodland","CVU_0083",70,10,15,20,0,5,3,10,null,null,3,5,1,1,null,null,3,5,7,15,2,5,5,10,3,15,9,15,5,15,null,null,null,null,4,10,null,null,null,null,null,null,0,20,null,null,"Continuous",0,13,7,12,16,20,200,1,1,83,"En","Endangered",1,0,0,"CVU_0083","Forest/Woodland","Woody vegetation",null,null,null,null,null,null,null,null,"Brackish Wetland",null,null,null,null,null,"Shrubby Gully Forest",null,null,null,null,null,null,null,null,null,null,null,null,"Creekline Tussock Grassland",null,null,"Deep Freshwater Marsh"]
["Central Victorian Uplands","CVU_","Swampy Woodland","Central Victorian UplandsSwampy Woodland","CVU_0937",60,15,15,15,0,5,1,5,null,null,4,20,2,5,1,1,2,10,5,10,2,5,2,10,1,10,3,10,2,5,null,null,null,null,2,10,null,null,null,null,2,0,0,20,null,null,"Continuous",0,15,7,9,30,20,150,1,1,937,"En","Endangered",1,0,0,"CVU_0937","Forest/Woodland","Woody vegetation",null,null,null,null,null,null,null,null,"Sandy Stream Woodland",null,null,null,null,null,null,null,null,null,null,null,null,null,null,null,null,null,null,"Lignum Cane Grass Swamp",null,null,"Permanent Open Freshwater"]
["Central Victorian Uplands","CVU_","Treed Clay Heathland","Central Victorian UplandsTreed Clay Heathland","CVU_0007_61",40,10,8,10,null,null,null,null,null,null,9,30,6,10,3,5,null,null,8,10,null,null,4,10,1,5,7,10,2,5,null,null,null,null,null,null,null,null,null,null,null,null,0,10,"0","10","Episodic",30,10,15,8,40,20,50,1,{"$error":"#N/A"},{"$error":"#N/A"},{"$error":"#N/A"},{"$error":"#N/A"},{"$error":"#N/A"},{"$error":"#N/A"},{"$error":"#N/A"},{"$error":"#N/A"},{"$error":"#N/A"},{"$error":"#N/A"},null,null,null,null,null,null,null,null,"Deep Freshwater Marsh",null,null,null,null,null,null,null,null,null,null,null,null,null,null,null,null,null,null,"Brackish Wetland",null,null,"Semi-permanent Saline"]
["Central Victorian Uplands","CVU_","Treed Escarpment Shrubland","Central Victorian UplandsTreed Escarpment Shrubland","CVU_0895_61",70,15,0,0,0,5,3,10,null,null,3,10,2,5,null,null,3,5,4,10,5,5,1,5,1,5,9,25,3,5,null,null,null,null,1,5,null,null,null,null,1,5,0,10,"0","10","Continuous",0,15,8,12,25,20,150,1,{"$error":"#N/A"},{"$error":"#N/A"},{"$error":"#N/A"},{"$error":"#N/A"},{"$error":"#N/A"},{"$error":"#N/A"},{"$error":"#N/A"},{"$error":"#N/A"},{"$error":"#N/A"},{"$error":"#N/A"},null,null,null,null,null,null,null,null,"Sedgy Swamp Woodland",null,null,null,null,null,null,null,null,null,null,null,null,null,null,null,null,null,null,"Freshwater Lignum Shrubland",null,null,"Permanent Saline"]
["Central Victorian Uplands","CVU_","Treed Sand Heathland","Central Victorian UplandsTreed Sand Heathland","CVU_0006_61",50,15,5,10,0,5,null,null,null,null,6,30,8,20,3,5,null,null,3,5,2,5,2,10,1,5,6,15,1,1,null,null,null,null,1,1,null,null,null,null,3,5,0,10,"0","10","Episodic",30,14,14,5,50,20,150,1,{"$error":"#N/A"},{"$error":"#N/A"},{"$error":"#N/A"},{"$error":"#N/A"},{"$error":"#N/A"},{"$error":"#N/A"},{"$error":"#N/A"},{"$error":"#N/A"},{"$error":"#N/A"},{"$error":"#N/A"},null,null,null,null,null,null,null,null,"Damp Heathland",null,null,null,null,null,null,null,null,null,null,null,null,null,null,null,null,null,null,"Freshwater Meadow",null,null,"Lateritic Woodland"]
["Central Victorian Uplands","CVU_","Valley Grassy Forest","Central Victorian UplandsValley Grassy Forest","CVU_0047",70,20,25,20,0,5,2,10,null,null,3,10,4,5,2,1,2,1,8,15,2,5,2,10,1,1,7,20,1,5,null,null,null,null,1,5,null,null,null,null,1,1,0,20,null,null,"Continuous",0,15,9,12,25,20,200,1,1,47,"Vu","Vulnerable",1,0,0,"CVU_0047","Forest/Woodland","Woody vegetation",null,null,null,null,null,null,null,null,"Forest Bog",null,null,null,null,null,null,null,null,null,null,null,null,null,null,null,null,null,null,"Deep Freshwater Marsh",null,null,"Scree-slope Woodland"]
["Central Victorian Uplands","CVU_","Valley Heathy Forest","Central Victorian UplandsValley Heathy Forest","CVU_0127",70,20,15,30,0,5,2,10,null,null,7,15,5,5,2,1,null,null,6,10,3,5,3,5,2,20,6,15,1,1,null,null,null,null,1,1,null,null,null,null,3,5,0,10,null,null,"Episodic",30,14,14,9,30,40,200,1,1,127,"Vu","Vulnerable",1,0,0,"CVU_0127","Forest/Woodland","Woody vegetation",null,null,null,null,null,null,null,null,"Forest Creekline Sedge Swamp",null,null,null,null,null,null,null,null,null,null,null,null,null,null,null,null,null,null,"Permanent Open Freshwater",null,null,"Damp Heathland"]
["Central Victorian Uplands","CVU_","Valley Slopes Dry Forest","Central Victorian UplandsValley Slopes Dry Forest","CVU_0177",70,20,20,30,0,5,4,15,null,null,6,20,1,5,null,null,5,10,8,15,3,5,2,5,null,null,6,15,2,5,null,null,null,null,3,5,null,null,null,null,2,5,0,10,"0","10","Continuous",0,14,11,16,40,40,200,1,1,177,"LC","Least Concern",1,0,0,"CVU_0177","Forest/Woodland","Woody vegetation",null,null,null,null,null,null,null,null,"Damp Heathy Woodland",null,null,null,null,null,null,null,null,null,null,null,null,null,null,null,null,null,null,"Permanent Saline",null,null,"Plains Woodland"]
["Central Victorian Uplands","CVU_","Wet Forest","Central Victorian UplandsWet Forest","CVU_0030",90,20,30,40,0,5,4,30,null,null,6,20,1,1,null,null,2,1,5,10,2,1,1,1,1,10,1,5,null,null,null,null,null,null,4,20,"2","10",null,null,2,5,0,20,null,null,"Continuous",0,14,11,9,51,50,300,1,1,30,"LC","Least Concern",1,0,0,"CVU_0030","Forest/Woodland","Woody vegetation",null,null,null,null,null,null,null,null,"Rushy Riverine Swamp",null,null,null,null,null,null,null,null,null,null,null,null,null,null,null,null,null,null,"Basalt Creekline Shrubby Woodland",null,null,"Intermittent Swampy Woodland"]
["Central Victorian Uplands","CVU_","Wetland Formation","Central Victorian UplandsWetland Formation","CVU_0074",null,null,0,null,null,null,null,null,null,null,null,null,null,null,null,null,null,null,null,null,null,null,null,null,null,null,null,null,null,null,null,null,null,null,null,null,null,null,null,null,null,null,null,null,null,null,null,0,0,null,null,null,null,0,1.36,1.36,74,"En","Endangered",6,0,0,"CVU_0074","wetlands","Non-woody wetland vegetation",null,null,null,null,null,null,null,null,"Tall Marsh",null,null,null,null,null,null,null,null,null,null,null,null,null,null,null,null,null,null,"Damp Heathland",null,null,"Lignum Swampy Woodland"]
["Dundas Tablelands","DunT","Alluvial Terraces Herb-rich Woodland","Dundas TablelandsAlluvial Terraces Herb-rich Woodland","DunT0067",70,10,15,10,0,5,1,5,null,null,2,1,2,1,null,null,2,5,10,20,4,10,null,null,null,null,10,20,4,5,"3","0",null,null,null,null,null,null,null,null,null,null,0,10,"0","10","Continuous",0,12,5,16,7,10,150,1,1,67,"En","Endangered",1,0,0,"DunT0067","Forest/Woodland","Woody vegetation",null,null,null,null,null,null,null,null,"Saline Aquatic Meadow",null,null,null,null,null,null,null,null,null,null,null,null,null,null,null,null,null,null,"Damp Heathy Woodland",null,null,"Woorinen Mallee"]
["Dundas Tablelands","DunT","Aquatic Herbland","Dundas TablelandsAquatic Herbland","DunT0653",0,0,0,null,null,null,null,null,null,null,null,null,null,null,null,null,2,10,5,40,2,10,null,null,1,5,4,10,2,15,null,null,null,null,null,null,null,null,null,null,null,null,null,null,null,null,"Episodic",5,6,null,9,null,10,0,1.36,1.36,653,"En","Endangered",6,0,0,"DunT0653","wetlands","Non-woody wetland vegetation",null,null,null,null,null,null,null,null,"Coastal Alkaline Scrub",null,null,null,null,null,null,null,null,null,null,null,null,null,null,null,null,null,null,"Plains Woodland",null,null,"Plains Savannah"]
["Dundas Tablelands","DunT","Basalt Creekline Shrubby Woodland","Dundas TablelandsBasalt Creekline Shrubby Woodland","DunT0705",70,10,10,10,0,5,1,10,null,null,4,15,null,null,null,null,2,5,8,15,5,10,2,15,null,null,7,20,2,10,null,null,null,null,null,null,null,null,null,null,null,null,0,10,null,null,"Continuous",0,10,5,15,25,20,200,1,1,705,"En","Endangered",1,0,0,"DunT0705","Forest/Woodland","Woody vegetation",null,null,null,null,null,null,null,null,"Floodplain Reedbed",null,null,null,null,null,null,null,null,null,null,null,null,null,null,null,null,null,null,"Tall Marsh",null,null,"Treed Plains Savannah"]
["Dundas Tablelands","DunT","Basalt Shrubby Woodland","Dundas TablelandsBasalt Shrubby Woodland","DunT0642",null,null,0,null,null,null,null,null,null,null,null,null,null,null,null,null,null,null,null,null,null,null,null,null,null,null,null,null,null,null,null,null,null,null,null,null,null,null,null,null,null,null,null,null,null,null,null,0,0,null,null,null,null,0,1,1,642,"En","Endangered",1,0,0,"DunT0642","Forest/Woodland","Woody vegetation",null,null,null,null,null,null,null,null,"Blocked Coastal Stream Swamp",null,null,null,null,null,null,null,null,null,null,null,null,null,null,null,null,null,null,"Stream Bank Shrubland",null,null,"Chenopod Grassland"]
["Dundas Tablelands","DunT","Brackish Sedgeland","Dundas TablelandsBrackish Sedgeland","DunT0013",0,0,0,null,null,null,null,null,null,null,null,null,null,null,null,null,1,5,5,10,5,5,1,5,null,null,4,10,3,50,"3","5",null,null,null,null,null,null,null,null,null,null,null,null,null,null,"Episodic",5,7,null,11,null,10,0,1.36,1.36,13,"En","Endangered",6,0,0,"DunT0013","wetlands","Non-woody wetland vegetation",null,null,null,null,null,null,null,null,"Spray-zone Coastal Shrubland",null,null,null,null,null,null,null,null,null,null,null,null,null,null,null,null,null,null,"Treed Stream Bank Shrubland",null,null,"Shallow Sands Woodland"]
["Dundas Tablelands","DunT","Creekline Grassy Woodland","Dundas TablelandsCreekline Grassy Woodland","DunT0068",80,15,15,15,0,5,2,15,null,null,5,10,1,1,null,null,2,5,6,10,3,5,2,10,1,5,10,20,3,10,null,null,null,null,null,null,null,null,null,null,3,10,0,10,null,null,"Continuous",0,13,8,11,26,40,200,1,1,68,"En","Endangered",1,0,0,"DunT0068","Forest/Woodland","Woody vegetation",null,null,null,null,null,null,null,null,"Lowland Herb-rich Forest",null,null,null,null,null,null,null,null,null,null,null,null,null,null,null,null,null,null,"Coastal Alkaline Scrub",null,null,"Higher Rainfall Shallow Sands Woodland"]
["Dundas Tablelands","DunT","Creekline Sedgy Woodland","Dundas TablelandsCreekline Sedgy Woodland","DunT0640",80,15,15,15,0,5,2,10,null,null,2,5,2,1,null,null,2,5,5,10,1,1,3,15,1,5,6,20,null,null,null,null,null,null,null,null,null,null,null,null,null,null,0,10,null,null,"Continuous",0,11,6,8,16,40,200,1,1,640,"En","Endangered",1,0,0,"DunT0640","Forest/Woodland","Woody vegetation",null,null,null,null,null,null,null,null,"Coastal Dune Grassland",null,null,null,null,null,null,null,null,null,null,null,null,null,null,null,null,null,null,"Scoria Cone Woodland",null,null,"Lower Rainfall Shallow Sands Woodland"]
["Dundas Tablelands","DunT","Creekline Tussock Grassland","Dundas TablelandsCreekline Tussock Grassland","DunT0654",0,0,0,null,null,null,null,null,null,null,null,null,null,null,null,null,4,5,8,10,11,10,3,40,null,null,10,10,4,10,null,null,null,null,null,null,null,null,null,null,null,null,0,20,null,null,"Episodic",10,7,null,23,null,10,0,1.36,1.36,654,"En","Endangered",5,"y",0,"DunT0654","grasslands","Other grassland vegetation",null,null,null,null,null,null,null,null,"Escarpment Shrubland",null,null,null,null,null,null,null,null,null,null,null,null,null,null,null,null,null,null,"Escarpment Shrubland",null,null,"Escarpment Shrubland"]
["Dundas Tablelands","DunT","Damp Heathland","Dundas TablelandsDamp Heathland","DunT0710",0,0,0,null,null,null,null,null,null,null,6,30,5,20,2,5,null,null,6,10,2,1,1,5,1,1,4,10,3,15,null,null,null,null,null,null,null,null,null,null,2,5,0,10,"0","10","Episodic",30,12,11,8,50,20,0,1.36,1.36,710,"Vu","Vulnerable",4,0,0,"DunT0710","heathlands","Woody vegetation",null,null,null,null,null,null,null,null,"Treed Escarpment Shrubland",null,null,null,null,null,null,null,null,null,null,null,null,null,null,null,null,null,null,"Treed Escarpment Shrubland",null,null,"Treed Escarpment Shrubland"]
["Dundas Tablelands","DunT","Damp Heathy Woodland","Dundas TablelandsDamp Heathy Woodland","DunT0793",60,10,10,10,0,5,3,5,null,null,6,40,2,10,2,1,null,null,6,10,4,5,3,5,2,5,11,20,3,15,null,null,null,null,null,null,null,null,null,null,null,null,0,10,null,null,"Episodic",30,12,11,10,55,20,100,1,1,793,"Vu","Vulnerable",1,0,0,"DunT0793","Forest/Woodland","Woody vegetation",null,null,null,null,null,null,null,null,"Gully Woodland",null,null,null,null,null,null,null,null,null,null,null,null,null,null,null,null,null,null,"Estuarine Flats Grassland",null,null,"Parilla Mallee"]
["Dundas Tablelands","DunT","Damp Sands Herb-rich Woodland","Dundas TablelandsDamp Sands Herb-rich Woodland","DunT0003",70,15,15,20,0,5,2,10,null,null,4,15,4,10,3,5,3,5,10,15,1,5,3,5,1,5,12,20,3,5,"2","0",null,null,1,10,null,null,null,null,null,null,0,10,null,null,"Continuous",0,15,10,14,35,40,150,1,1,3,"Vu","Vulnerable",1,0,0,"DunT0003","Forest/Woodland","Woody vegetation",null,null,null,null,null,null,null,null,"Estuarine Flats Grassland",null,null,null,null,null,null,null,null,null,null,null,null,null,null,null,null,null,null,"Wet Verge Sedgeland"]
["Dundas Tablelands","DunT","Dry Creekline Woodland","Dundas TablelandsDry Creekline Woodland","DunT0285",70,15,15,20,0,5,null,null,null,null,4,20,null,null,null,null,1,1,5,10,null,null,1,5,null,null,5,20,2,5,"2","1",null,null,null,null,null,null,null,null,null,null,0,20,null,null,"Continuous",0,9,4,6,20,20,200,1,1,285,"En","Endangered",1,0,0,"DunT0285","Forest/Woodland","Woody vegetation",null,null,null,null,null,null,null,null,"Brackish Grassland",null,null,null,null,null,null,null,null,null,null,null,null,null,null,null,null,null,null,"Brackish Grassland"]
["Dundas Tablelands","DunT","Dune Soak Woodland","Dundas TablelandsDune Soak Woodland","DunT0673",70,15,15,20,0,5,2,10,null,null,8,20,5,10,2,1,3,5,5,10,null,null,1,1,2,5,8,20,6,20,null,null,null,null,1,1,null,null,null,null,1,1,0,10,null,null,"Continuous",0,14,15,8,40,20,150,1,1,673,"En","Endangered",1,0,0,"DunT0673","Forest/Woodland","Woody vegetation",null,null,null,null,null,null,null,null,"Swampy Woodland",null,null,null,null,null,null,null,null,null,null,null,null,null,null,null,null,null,null,"Swampy Woodland"]
["Dundas Tablelands","DunT","Escarpment Shrubland","Dundas TablelandsEscarpment Shrubland","DunT0895",0,0,0,null,null,null,null,null,null,null,3,10,2,5,null,null,3,5,4,10,5,5,1,5,1,5,9,25,3,5,null,null,null,null,1,5,null,null,null,null,1,5,0,10,"0","20","Continuous",0,13,5,12,15,20,50,1.1499999999999999,1,895,"En","Endangered",1,0,0,"DunT0895","Forest/Woodland","Woody vegetation",null,null,null,null,null,null,null,null,"Shrubby Gully Forest"]
["Dundas Tablelands","DunT","Floodplain Riparian Woodland","Dundas TablelandsFloodplain Riparian Woodland","DunT0056",80,15,20,20,0,5,1,5,null,null,3,10,null,null,null,null,5,10,4,10,3,10,3,15,1,10,5,15,3,10,null,null,null,null,null,null,null,null,null,null,1,5,0,10,null,null,"Episodic",5,12,4,12,15,40,300,1,1,56,"Vu","Vulnerable",1,0,0,"DunT0056","Forest/Woodland","Woody vegetation",null,null,null,null,null,null,null,null,"Estuarine Scrub"]
["Dundas Tablelands","DunT","Floodplain Thicket","Dundas TablelandsFloodplain Thicket","DunT0280",80,10,15,10,0,5,1,5,null,null,8,50,null,null,null,null,1,5,2,1,1,1,4,15,null,null,2,5,3,15,null,null,null,null,null,null,null,null,null,null,null,null,0,20,null,null,"Episodic",5,10,9,4,55,20,100,1,1,280,"Vu","Vulnerable",1,0,0,"DunT0280","Forest/Woodland","Woody vegetation"]
["Dundas Tablelands","DunT","Freshwater Lignum Shrubland","Dundas TablelandsFreshwater Lignum Shrubland","DunT0657",null,0,0,null,null,null,null,null,null,null,null,null,null,null,null,null,null,null,null,null,null,null,null,null,null,null,null,null,null,null,null,null,null,null,null,null,null,null,null,null,null,null,null,null,null,null,"Episodic",5,0,null,null,null,0,50,1.36,1.36,657,"En","Endangered",6,0,0,"DunT0657","wetlands","Non-woody wetland vegetation"]
["Dundas Tablelands","DunT","Freshwater Meadow","Dundas TablelandsFreshwater Meadow","DunT0680",null,null,0,null,null,null,null,null,null,null,null,null,null,null,null,null,null,null,null,null,null,null,null,null,null,null,null,null,null,null,null,null,null,null,null,null,null,null,null,null,null,null,null,null,null,null,null,5,0,null,null,null,null,0,1.36,1.36,680,"En","Endangered",6,0,0,"DunT0680","wetlands","Non-woody wetland vegetation"]
["Dundas Tablelands","DunT","Grassy Woodland","Dundas TablelandsGrassy Woodland","DunT0175",70,15,15,15,0,5,2,10,null,null,2,10,2,1,2,5,2,5,8,20,3,5,1,1,null,null,8,40,1,5,null,null,null,null,null,null,null,null,null,null,1,1,0,10,null,null,"Continuous",0,13,6,13,21,20,150,1,1,175,"En","Endangered",1,0,0,"DunT0175","Forest/Woodland","Woody vegetation"]
["Dundas Tablelands","DunT","Heathland Thicket","Dundas TablelandsHeathland Thicket","DunT0279",0,0,0,null,null,null,null,null,null,null,8,50,4,10,1,1,2,5,3,5,null,null,1,5,null,null,4,10,2,5,null,null,null,null,null,null,null,null,null,null,2,1,0,10,null,null,"Episodic",30,10,12,5,60,20,0,1.36,1.36,279,"LC","Least Concern",4,0,0,"DunT0279","heathlands","Woody vegetation"]
["Dundas Tablelands","DunT","Heathy Dry Forest","Dundas TablelandsHeathy Dry Forest","DunT0020",60,20,20,30,0,5,1,5,null,null,13,30,13,20,4,5,1,1,5,5,3,5,1,1,null,null,7,15,1,5,null,null,null,null,1,5,null,null,null,null,2,1,0,10,"0","10","Episodic",20,15,27,9,55,20,200,1,1,20,"LC","Least Concern",1,0,0,"DunT0020","Forest/Woodland","Woody vegetation"]
["Dundas Tablelands","DunT","Heathy Herb-rich Woodland","Dundas TablelandsHeathy Herb-rich Woodland","DunT0179",70,15,15,20,0,5,2,15,null,null,6,25,7,15,3,5,1,1,7,10,null,null,2,5,null,null,8,15,3,10,"2","1",null,null,1,15,null,null,"1","0",3,5,0,10,null,null,"Continuous",0,15,15,8,55,20,150,1,1,179,"D","Depleted",1,0,0,"DunT0179","Forest/Woodland","Woody vegetation"]
["Dundas Tablelands","DunT","Heathy Woodland","Dundas TablelandsHeathy Woodland","DunT0048",60,15,10,15,0,5,1,5,null,null,10,35,10,25,4,10,1,1,5,10,5,5,2,5,null,null,10,15,3,5,null,null,null,null,null,null,null,null,null,null,1,1,0,10,"0","10","Episodic",20,14,21,11,65,40,150,1,1,48,"LC","Least Concern",1,0,0,"DunT0048","Forest/Woodland","Woody vegetation"]
["Dundas Tablelands","DunT","Herb-rich Foothill Forest","Dundas TablelandsHerb-rich Foothill Forest","DunT0023",null,0,0,null,null,null,null,null,null,null,null,null,null,null,null,null,null,null,null,null,null,null,null,null,null,null,null,null,null,null,null,null,null,null,null,null,null,null,null,null,null,null,null,null,null,null,null,0,0,null,null,null,0,0,1,1,23,"D","Depleted",1,0,0,"DunT0023","Forest/Woodland","Woody vegetation"]
["Dundas Tablelands","DunT","Hills Herb-rich Woodland","Dundas TablelandsHills Herb-rich Woodland","DunT0071",null,0,0,null,0,5,null,null,null,null,null,null,null,null,null,null,null,null,null,null,null,null,null,null,null,null,null,null,null,null,null,null,null,null,null,null,null,null,null,null,null,null,0,10,"0","10",null,0,3,null,null,null,0,0,1,1,71,"Vu","Vulnerable",1,0,0,"DunT0071","Forest/Woodland","Woody vegetation"]
["Dundas Tablelands","DunT","Lateritic Woodland","Dundas TablelandsLateritic Woodland","DunT0704",70,15,15,15,0,5,1,5,null,null,11,25,11,20,4,5,2,5,14,10,4,5,3,10,null,null,15,20,4,10,"4","1",null,null,null,null,null,null,null,null,3,5,0,10,"0","10","Continuous",0,15,23,20,50,20,150,1,1,704,"D","Depleted",1,0,0,"DunT0704","Forest/Woodland","Woody vegetation"]
["Dundas Tablelands","DunT","Lowland Forest","Dundas TablelandsLowland Forest","DunT0016",70,20,20,30,0,5,2,10,null,null,11,25,9,15,3,5,null,null,12,20,null,null,4,10,1,5,9,20,1,5,null,null,null,null,1,5,null,null,null,null,null,null,0,10,null,null,"Continuous",0,12,22,12,50,40,200,1,1,16,"LC","Least Concern",1,0,0,"DunT0016","Forest/Woodland","Woody vegetation"]
["Dundas Tablelands","DunT","Lunette Woodland","Dundas TablelandsLunette Woodland","DunT0652",80,8,15,10,0,5,1,5,null,null,3,10,2,1,1,1,3,5,8,15,3,5,2,5,null,null,12,45,2,5,null,null,null,null,null,null,null,null,null,null,null,null,0,10,"0","10","Continuous",0,13,6,14,16,10,100,1,1,652,"En","Endangered",1,0,0,"DunT0652","Forest/Woodland","Woody vegetation"]
["Dundas Tablelands","DunT","Plains Grassland","Dundas TablelandsPlains Grassland","DunT0132",0,0,0,null,null,null,null,null,null,null,null,null,1,1,null,null,3,5,10,15,3,5,1,5,null,null,13,40,4,10,null,null,null,null,null,null,null,null,null,null,null,null,0,10,"0","10","Episodic",5,9,1,16,1,10,0,1.36,1.36,132,"En","Endangered",5,"y",0,"DunT0132","grasslands","Other grassland vegetation"]
["Dundas Tablelands","DunT","Plains Grassy Wetland","Dundas TablelandsPlains Grassy Wetland","DunT0125",0,0,0,null,null,null,null,null,null,null,null,null,null,null,null,null,6,10,11,20,4,10,2,10,null,null,11,30,2,10,"2","1",null,null,null,null,null,null,null,null,null,null,0,10,null,null,"Episodic",5,8,null,21,null,10,50,1.36,1.36,125,"En","Endangered",6,"y",0,"DunT0125","wetlands","Non-woody wetland vegetation"]
["Dundas Tablelands","DunT","Plains Grassy Woodland","Dundas TablelandsPlains Grassy Woodland","DunT0055",80,15,15,15,0,5,null,null,null,null,1,5,2,5,1,1,1,1,18,25,4,10,1,1,null,null,15,40,4,5,null,null,null,null,null,null,null,null,null,null,null,null,0,10,null,null,"Continuous",0,11,3,23,10,10,100,1,1,55,"En","Endangered",1,0,0,"DunT0055","Forest/Woodland","Woody vegetation"]
["Dundas Tablelands","DunT","Plains Sedgy Wetland","Dundas TablelandsPlains Sedgy Wetland","DunT0647",0,0,0,null,null,null,null,null,null,null,null,null,null,null,null,null,2,5,4,20,2,5,null,null,1,25,4,10,1,5,null,null,null,null,null,null,null,null,null,null,null,null,null,null,null,null,"Episodic",5,6,null,8,null,10,50,1.36,1.36,647,"En","Endangered",6,0,0,"DunT0647","wetlands","Non-woody wetland vegetation"]
["Dundas Tablelands","DunT","Plains Sedgy Woodland","Dundas TablelandsPlains Sedgy Woodland","DunT0283",70,15,15,10,0,5,null,null,null,null,2,5,2,1,null,null,4,15,10,20,2,5,2,1,1,1,13,30,4,20,null,null,null,null,null,null,null,null,null,null,null,null,0,10,null,null,"Continuous",0,11,4,16,6,10,150,1,1,283,"D","Depleted",1,0,0,"DunT0283","Forest/Woodland","Woody vegetation"]
["Dundas Tablelands","DunT","Plains Swampy Woodland","Dundas TablelandsPlains Swampy Woodland","DunT0651",80,10,15,10,0,5,1,5,null,null,4,15,null,null,null,null,3,5,8,20,5,5,3,30,1,1,7,10,2,5,null,null,null,null,null,null,null,null,null,null,null,null,0,20,null,null,"Continuous",0,11,5,16,20,10,100,1,1,651,"En","Endangered",1,0,0,"DunT0651","Forest/Woodland","Woody vegetation"]
["Dundas Tablelands","DunT","Plains Woodland","Dundas TablelandsPlains Woodland","DunT0803",70,15,15,15,0,5,null,null,null,null,2,5,2,5,1,1,1,1,20,25,4,10,1,5,1,1,16,30,3,5,null,null,null,null,null,null,null,null,null,null,null,null,0,10,null,null,"Continuous",0,12,4,25,10,20,100,1,1,803,"En","Endangered",1,0,0,"DunT0803","Forest/Woodland","Woody vegetation"]
["Dundas Tablelands","DunT","Red Gum Swamp","Dundas TablelandsRed Gum Swamp","DunT0292",80,10,15,15,0,5,null,null,null,null,null,null,null,null,null,null,2,10,7,25,2,1,2,15,null,null,6,20,2,15,null,null,null,null,null,null,null,null,null,null,null,null,null,null,"0","10","Episodic",5,8,null,11,null,10,100,1,1,292,"En","Endangered",1,0,0,"DunT0292","Forest/Woodland","Woody vegetation"]
["Dundas Tablelands","DunT","Riparian Scrub","Dundas TablelandsRiparian Scrub","DunT0191",0,0,0,null,null,null,null,null,null,null,2,10,null,null,null,null,4,10,10,15,4,5,3,20,2,5,10,20,3,10,null,null,null,null,null,null,null,null,null,null,null,null,0,20,null,null,"Continuous",0,9,2,18,10,40,0,1.25,1.25,191,"En","Endangered",3,0,0,"DunT0191","scrubs/shrublands/mallee without logs","Woody vegetation"]
["Dundas Tablelands","DunT","Riparian Shrubland","Dundas TablelandsRiparian Shrubland","DunT0019",0,0,0,null,null,null,null,null,null,null,6,40,null,null,null,null,2,5,6,10,2,5,3,10,null,null,3,10,2,1,null,null,null,null,2,5,null,null,null,null,2,5,0,10,null,null,"Episodic",5,10,6,10,40,20,100,1.25,1.25,19,"Vu","Vulnerable",3,0,0,"DunT0019","scrubs/shrublands/mallee without logs","Woody vegetation"]
["Dundas Tablelands","DunT","Riparian Woodland","Dundas TablelandsRiparian Woodland","DunT0641",80,15,15,20,0,5,2,15,null,null,3,10,1,1,null,null,4,15,5,10,1,5,3,10,1,5,4,20,2,5,null,null,null,null,null,null,null,null,null,null,1,5,0,10,null,null,"Continuous",0,13,6,10,26,30,200,1,1,641,"En","Endangered",1,0,0,"DunT0641","Forest/Woodland","Woody vegetation"]
["Dundas Tablelands","DunT","Rocky Outcrop Herbland","Dundas TablelandsRocky Outcrop Herbland","DunT0193",0,0,0,null,null,null,2,10,null,null,4,10,4,5,2,1,1,1,3,5,null,null,2,5,null,null,3,5,2,5,null,null,null,null,1,1,null,null,null,null,1,1,0,40,null,null,"Continuous",0,12,10,4,25,10,0,1.36,1.36,193,"LC","Least Concern",5,"y",0,"DunT0193","grasslands","Other grassland vegetation"]
["Dundas Tablelands","DunT","Rocky Outcrop Shrubland","Dundas TablelandsRocky Outcrop Shrubland","DunT0028",0,0,0,null,null,null,null,null,null,null,11,45,4,10,1,1,2,1,3,5,null,null,2,5,null,null,5,10,null,null,null,null,null,null,null,null,null,null,null,null,null,null,0,20,"0","10","Continuous",0,9,15,5,55,40,0,1.36,1.36,28,"LC","Least Concern",4,0,0,"DunT0028","heathlands","Woody vegetation"]
["Dundas Tablelands","DunT","Saline Aquatic Meadow","Dundas TablelandsSaline Aquatic Meadow","DunT0842",null,0,0,null,null,null,null,null,null,null,null,null,null,null,null,null,null,null,null,null,null,null,null,null,null,null,null,null,null,null,null,null,null,null,null,null,null,null,null,null,null,null,null,null,null,null,null,0,0,null,null,null,0,0,0,{"$error":"#N/A"},{"$error":"#N/A"},{"$error":"#N/A"},{"$error":"#N/A"},{"$error":"#N/A"},{"$error":"#N/A"},{"$error":"#N/A"},{"$error":"#N/A"},{"$error":"#N/A"},{"$error":"#N/A"}]
["Dundas Tablelands","DunT","Sand Forest","Dundas TablelandsSand Forest","DunT0134",70,15,20,30,0,5,1,5,null,null,3,5,1,5,2,5,null,null,2,5,null,null,1,1,null,null,7,15,2,1,null,null,null,null,1,50,null,null,null,null,null,null,0,10,null,null,"Continuous",0,11,5,2,15,40,150,1,1,134,"En","Endangered",1,0,0,"DunT0134","Forest/Woodland","Woody vegetation"]
["Dundas Tablelands","DunT","Sand Heathland","Dundas TablelandsSand Heathland","DunT0006",0,0,0,null,null,null,null,null,null,null,7,30,8,20,3,5,null,null,5,10,1,1,1,1,null,null,4,10,3,20,null,null,null,null,null,null,null,null,null,null,2,5,0,10,"0","10","Episodic",30,11,15,6,50,20,0,1.36,1.36,6,"Vu","Vulnerable",4,0,0,"DunT0006","heathlands","Woody vegetation"]
["Dundas Tablelands","DunT","Sandy Stream Woodland","Dundas TablelandsSandy Stream Woodland","DunT0674",80,10,15,10,0,5,2,15,null,null,5,15,null,null,null,null,null,null,6,10,3,5,2,10,2,20,10,30,3,5,null,null,null,null,null,null,null,null,null,null,null,null,0,10,null,null,"Continuous",0,10,7,9,30,40,200,1,1,674,"En","Endangered",1,0,0,"DunT0674","Forest/Woodland","Woody vegetation"]
["Dundas Tablelands","DunT","Seasonally Inundated Shrubby Woodland","Dundas TablelandsSeasonally Inundated Shrubby Woodland","DunT0195",70,15,15,15,0,5,null,null,null,null,7,30,3,10,1,1,2,5,3,10,1,1,null,null,null,null,5,15,3,10,null,null,null,null,null,null,null,null,null,null,null,null,0,10,"0","10","Continuous",0,11,10,6,40,30,150,1,1,195,"D","Depleted",1,0,0,"DunT0195","Forest/Woodland","Woody vegetation"]
["Dundas Tablelands","DunT","Sedge Wetland","Dundas TablelandsSedge Wetland","DunT0136",0,0,0,null,null,null,null,null,null,null,1,1,null,null,null,null,4,10,10,20,3,10,3,5,null,null,11,30,3,10,"2","5",null,null,null,null,null,null,null,null,null,null,0,10,"0","10","Episodic",5,10,1,17,1,10,0,1.36,1.36,136,"En","Endangered",6,0,0,"DunT0136","wetlands","Non-woody wetland vegetation"]
["Dundas Tablelands","DunT","Sedgy Riparian Woodland","Dundas TablelandsSedgy Riparian Woodland","DunT0198",70,15,15,20,0,5,1,10,null,null,5,20,null,null,null,null,null,null,3,10,null,null,5,30,null,null,2,5,2,5,null,null,null,null,2,10,null,null,null,null,null,null,0,20,null,null,"Continuous",0,9,6,3,30,20,200,1,1,198,"En","Endangered",1,0,0,"DunT0198","Forest/Woodland","Woody vegetation"]
["Dundas Tablelands","DunT","Shallow Freshwater Marsh","Dundas TablelandsShallow Freshwater Marsh","DunT0200",null,null,0,null,null,null,null,null,null,null,null,null,null,null,null,null,null,null,null,null,null,null,null,null,null,null,null,null,null,null,null,null,null,null,null,null,null,null,null,null,null,null,null,null,null,null,null,0,0,null,null,null,null,0,1.36,1.36,200,"Vu","Vulnerable",6,0,0,"DunT0200","wetlands","Non-woody wetland vegetation"]
["Dundas Tablelands","DunT","Shallow Sands Woodland","Dundas TablelandsShallow Sands Woodland","DunT0882",70,15,15,15,0,5,2,15,null,null,3,5,4,10,2,5,3,5,17,20,3,5,2,5,null,null,11,25,4,10,"2","0",null,null,null,null,null,null,null,null,1,0,0,10,"0","10","Continuous",0,15,9,23,30,20,150,1,1,882,"Vu","Vulnerable",1,0,0,"DunT0882","Forest/Woodland","Woody vegetation"]
["Dundas Tablelands","DunT","Shrubby Woodland","Dundas TablelandsShrubby Woodland","DunT0282",70,15,15,20,0,5,2,10,null,null,6,40,3,5,1,1,2,1,5,5,2,5,2,10,1,5,4,10,2,10,null,null,null,null,1,1,null,null,null,null,null,null,0,10,null,null,"Continuous",0,14,11,9,55,20,150,1,1,282,"Vu","Vulnerable",1,0,0,"DunT0282","Forest/Woodland","Woody vegetation"]
["Dundas Tablelands","DunT","Stony Knoll Shrubland","Dundas TablelandsStony Knoll Shrubland","DunT0649",0,0,0,null,null,null,null,null,null,null,3,10,null,null,1,1,2,1,11,10,4,5,null,null,null,null,10,25,2,5,"2","5",null,null,2,5,null,null,null,null,1,0,0,10,"0","10","Continuous",0,11,3,17,10,20,0,1.36,1,649,"Vu","Vulnerable",1,0,0,"DunT0649","Forest/Woodland","Woody vegetation"]
["Dundas Tablelands","DunT","Swamp Scrub",{"$f":"CONCATENATE(A131,C131)","v":"Dundas TablelandsSwamp Scrub"},"DunT0053",0,0,0,null,null,null,null,null,null,null,2,10,1,1,null,null,5,5,9,15,3,10,2,15,2,5,4,15,3,15,null,null,null,null,2,5,null,null,null,null,1,5,0,20,null,null,"Continuous",0,12,3,17,11,40,0,1.25,1.1499999999999999,53,"En","Endangered",3,0,0,"DunT0053","scrubs/shrublands/mallee without logs","Woody vegetation"]
["Dundas Tablelands","DunT","Tall Marsh","Dundas TablelandsTall Marsh","DunT0821",0,0,0,null,null,null,null,null,null,null,null,null,null,null,null,null,3,10,2,5,6,10,1,5,2,40,null,null,1,1,null,null,null,null,null,null,null,null,null,null,null,null,null,null,null,null,"Episodic",5,6,null,11,null,10,0,1.36,{"$error":"#N/A"},{"$error":"#N/A"},{"$error":"#N/A"},{"$error":"#N/A"},{"$error":"#N/A"},{"$error":"#N/A"},{"$error":"#N/A"},{"$error":"#N/A"},{"$error":"#N/A"},{"$error":"#N/A"}]
["Dundas Tablelands","DunT","Treed Escarpment Shrubland","Dundas TablelandsTreed Escarpment Shrubland","DunT0895_61",70,15,0,0,0,5,3,10,null,null,3,10,2,5,null,null,3,5,4,10,5,5,1,5,1,5,9,25,3,5,null,null,null,null,1,5,null,null,null,null,1,5,0,10,"0","20","Continuous",0,15,8,12,25,20,150,1,{"$error":"#N/A"},{"$error":"#N/A"},{"$error":"#N/A"},{"$error":"#N/A"},{"$error":"#N/A"},{"$error":"#N/A"},{"$error":"#N/A"},{"$error":"#N/A"},{"$error":"#N/A"},{"$error":"#N/A"}]
["Dundas Tablelands","DunT","Treed Stony Knoll Shrubland","Dundas TablelandsTreed Stony Knoll Shrubland","DunT0649_61",0,0,8,15,null,null,null,null,null,null,3,10,null,null,1,1,2,1,11,10,4,5,null,null,null,null,10,25,2,5,"2","5",null,null,2,5,null,null,null,null,1,0,0,10,"0","10","Continuous",0,11,3,17,10,20,50,1.1499999999999999,{"$error":"#N/A"},{"$error":"#N/A"},{"$error":"#N/A"},{"$error":"#N/A"},{"$error":"#N/A"},{"$error":"#N/A"},{"$error":"#N/A"},{"$error":"#N/A"},{"$error":"#N/A"},{"$error":"#N/A"}]
["Dundas Tablelands","DunT","Wet Heathland","Dundas TablelandsWet Heathland","DunT0008",0,0,0,null,null,null,null,null,null,null,7,40,4,5,1,1,2,5,1,5,2,1,2,20,1,5,4,15,3,10,null,null,null,null,1,1,null,null,null,null,1,5,0,20,null,null,"Episodic",30,13,11,5,45,20,0,1.36,1.36,8,"D","Depleted",4,0,0,"DunT0008","heathlands","Woody vegetation"]
["East Gippsland Lowlands","EGL_","Aquatic Sedgeland","East Gippsland LowlandsAquatic Sedgeland","EGL_0308",null,0,0,null,null,null,null,null,null,null,null,null,null,null,null,null,null,null,null,null,null,null,null,null,null,null,null,null,null,null,null,null,null,null,null,null,null,null,null,null,null,null,null,null,null,null,null,0,0,null,null,null,0,0,0,{"$error":"#N/A"},{"$error":"#N/A"},{"$error":"#N/A"},{"$error":"#N/A"},{"$error":"#N/A"},{"$error":"#N/A"},{"$error":"#N/A"},{"$error":"#N/A"},{"$error":"#N/A"},{"$error":"#N/A"}]
["East Gippsland Lowlands","EGL_","Banksia Woodland","East Gippsland LowlandsBanksia Woodland","EGL_0014",50,15,10,15,0,5,1,5,null,null,10,25,7,15,null,null,1,1,5,10,1,1,3,10,1,5,5,10,2,5,null,null,null,null,2,10,null,null,null,null,3,1,0,10,null,null,"Episodic",30,14,18,7,45,40,150,1,1,14,"LC","Least Concern",1,0,0,"EGL_0014","Forest/Woodland","Woody vegetation"]
["East Gippsland Lowlands","EGL_","Blackthorn Scrub","East Gippsland LowlandsBlackthorn Scrub","EGL_0027",0,0,0,null,null,null,null,null,null,null,8,40,1,1,null,null,2,1,3,5,null,null,1,1,null,null,3,5,1,1,null,null,null,null,1,1,null,null,null,null,3,5,0,10,null,null,"Continuous",0,10,9,5,41,40,100,1.25,1.25,27,"Ra","Rare",3,0,0,"EGL_0027","scrubs/shrublands/mallee without logs","Woody vegetation"]
["East Gippsland Lowlands","EGL_","Brackish Herbland","East Gippsland LowlandsBrackish Herbland","EGL_0538",null,0,0,null,null,null,null,null,null,null,null,null,null,null,null,null,null,null,null,null,null,null,null,null,null,null,null,null,null,null,null,null,null,null,null,null,null,null,null,null,null,null,null,null,null,null,null,0,0,null,null,null,0,0,0,{"$error":"#N/A"},{"$error":"#N/A"},{"$error":"#N/A"},{"$error":"#N/A"},{"$error":"#N/A"},{"$error":"#N/A"},{"$error":"#N/A"},{"$error":"#N/A"},{"$error":"#N/A"},{"$error":"#N/A"}]
["East Gippsland Lowlands","EGL_","Brackish Sedgeland","East Gippsland LowlandsBrackish Sedgeland","EGL_0013",0,0,0,null,null,null,null,null,null,null,null,null,null,null,null,null,1,1,2,5,2,1,null,null,null,null,null,null,2,55,null,null,null,null,null,null,null,null,null,null,null,null,null,null,null,null,"Continuous",0,4,null,5,null,0,0,1.36,1.36,13,"Vu","Vulnerable",6,0,0,"EGL_0013","wetlands","Non-woody wetland vegetation"]
["East Gippsland Lowlands","EGL_","Clay Heathland","East Gippsland LowlandsClay Heathland","EGL_0007",0,0,0,null,null,null,null,null,null,null,6,30,7,20,2,1,2,1,8,10,2,1,3,5,null,null,4,5,4,5,null,null,null,null,2,1,null,null,null,null,null,null,0,10,"0","10","Episodic",30,12,13,12,50,20,0,1.36,1.36,7,"Vu","Vulnerable",4,0,0,"EGL_0007","heathlands","Woody vegetation"]
["East Gippsland Lowlands","EGL_","Coast Banksia Woodland","East Gippsland LowlandsCoast Banksia Woodland","EGL_0002",70,10,15,15,0,5,2,10,null,null,5,15,3,5,1,1,2,1,4,10,null,null,2,5,null,null,3,5,null,null,null,null,null,null,1,5,null,null,null,null,2,5,0,20,null,null,"Episodic",30,12,10,6,30,40,100,1,1,2,"LC","Least Concern",1,0,0,"EGL_0002","Forest/Woodland","Woody vegetation"]
["East Gippsland Lowlands","EGL_","Coastal Dune Scrub","East Gippsland LowlandsCoastal Dune Scrub","EGL_0160",null,0,0,null,null,null,null,null,null,null,null,null,null,null,null,null,null,null,null,null,null,null,null,null,null,null,null,null,null,null,null,null,null,null,null,null,null,null,null,null,null,null,null,null,null,null,null,0,0,null,null,null,0,0,0,{"$error":"#N/A"},{"$error":"#N/A"},{"$error":"#N/A"},{"$error":"#N/A"},{"$error":"#N/A"},{"$error":"#N/A"},{"$error":"#N/A"},{"$error":"#N/A"},{"$error":"#N/A"},{"$error":"#N/A"}]
["East Gippsland Lowlands","EGL_","Coastal Lagoon Wetland","East Gippsland LowlandsCoastal Lagoon Wetland","EGL_0011",0,0,0,null,null,null,null,null,null,null,5,15,2,1,null,null,1,1,2,5,1,1,2,10,2,15,1,1,2,5,null,null,null,null,1,5,null,null,null,null,1,1,0,10,null,null,"Continuous",0,12,7,4,16,20,0,1.36,1.36,11,"Vu","Vulnerable",6,0,0,"EGL_0011","wetlands","Non-woody wetland vegetation"]
["East Gippsland Lowlands","EGL_","Coastal Saltmarsh","East Gippsland LowlandsCoastal Saltmarsh","EGL_0009",0,0,0,null,null,null,null,null,null,null,3,10,2,1,1,1,null,null,4,20,1,5,1,1,2,10,2,5,1,15,null,null,null,null,null,null,null,null,null,null,1,1,null,null,"0","10","Continuous",0,11,5,5,11,10,0,1.36,1.36,9,"D","Depleted",5,"y",0,"EGL_0009","grasslands","Other grassland vegetation"]
["East Gippsland Lowlands","EGL_","Coastal Sand Heathland","East Gippsland LowlandsCoastal Sand Heathland","EGL_0005",0,0,0,null,null,null,null,null,null,null,8,40,6,15,null,null,1,1,5,10,null,null,3,5,null,null,4,5,4,15,null,null,null,null,2,5,null,null,null,null,1,1,0,10,null,null,"Episodic",30,10,14,6,55,20,0,1.36,1.36,5,"Ra","Rare",4,0,0,"EGL_0005","heathlands","Woody vegetation"]
["East Gippsland Lowlands","EGL_","Coastal Vine-rich Forest","East Gippsland LowlandsCoastal Vine-rich Forest","EGL_0004",80,20,25,40,0,5,2,10,null,null,7,25,3,10,null,null,null,null,4,10,1,1,3,10,1,1,3,5,null,null,null,null,null,null,2,10,"1","1",null,null,5,10,0,20,null,null,"Continuous",0,13,12,5,45,50,200,1,1,4,"Vu","Vulnerable",1,0,0,"EGL_0004","Forest/Woodland","Woody vegetation"]
["East Gippsland Lowlands","EGL_","Damp Forest","East Gippsland LowlandsDamp Forest","EGL_0029",90,20,30,40,0,5,3,20,null,null,8,25,3,5,1,1,1,1,6,10,null,null,2,5,1,5,4,5,1,1,null,null,null,null,3,15,"1","5",null,null,4,5,0,20,null,null,"Continuous",0,15,14,7,50,50,300,1,1,29,"LC","Least Concern",1,0,0,"EGL_0029","Forest/Woodland","Woody vegetation"]
["East Gippsland Lowlands","EGL_","Damp Sands Herb-rich Woodland","East Gippsland LowlandsDamp Sands Herb-rich Woodland","EGL_0003",70,15,15,15,0,5,1,5,null,null,5,25,3,5,1,1,2,5,8,15,5,10,2,10,1,1,4,10,2,10,null,null,null,null,1,15,null,null,null,null,2,0,0,10,null,null,"Continuous",0,15,9,15,35,40,150,1,1,3,"Vu","Vulnerable",1,0,0,"EGL_0003","Forest/Woodland","Woody vegetation"]
["East Gippsland Lowlands","EGL_","Dry Rainforest","East Gippsland LowlandsDry Rainforest","EGL_0034",60,10,15,50,0,5,3,20,null,null,9,20,null,null,null,null,5,5,12,15,5,5,2,5,null,null,3,5,3,5,null,null,null,null,5,10,null,null,"2","1",6,10,0,20,null,null,"Continuous",0,13,12,22,40,50,100,1,1,34,"En","Endangered",1,0,0,"EGL_0034","Forest/Woodland","Woody vegetation"]
["East Gippsland Lowlands","EGL_","Dry Valley Forest","East Gippsland LowlandsDry Valley Forest","EGL_0169",70,20,20,30,0,5,4,15,null,null,4,40,null,null,null,null,null,null,9,10,4,5,1,5,null,null,1,10,2,10,null,null,null,null,3,10,null,null,null,null,3,5,0,10,null,null,"Continuous",0,11,8,13,55,40,200,1,1,169,"Vu","Vulnerable",1,0,0,"EGL_0169","Forest/Woodland","Woody vegetation"]
["East Gippsland Lowlands","EGL_","Estuarine Swamp Scrub","East Gippsland LowlandsEstuarine Swamp Scrub","EGL_0053_62",0,0,0,null,null,null,null,null,null,null,2,10,null,null,null,null,null,null,3,20,2,5,null,null,null,null,2,10,2,15,null,null,null,null,null,null,null,null,null,null,null,null,null,null,null,null,"Continuous",0,5,2,5,10,20,0,1.25,{"$error":"#N/A"},{"$error":"#N/A"},{"$error":"#N/A"},{"$error":"#N/A"},{"$error":"#N/A"},{"$error":"#N/A"},{"$error":"#N/A"},{"$error":"#N/A"},{"$error":"#N/A"},{"$error":"#N/A"}]
["East Gippsland Lowlands","EGL_","Estuarine Wetland","East Gippsland LowlandsEstuarine Wetland","EGL_0010",0,0,0,null,null,null,null,null,null,null,1,10,2,5,null,null,2,5,6,15,2,10,2,10,1,5,2,5,3,20,null,null,null,null,1,5,null,null,null,null,1,1,null,null,null,null,"Episodic",5,11,3,10,15,10,0,1.36,1.36,10,"Vu","Vulnerable",6,0,0,"EGL_0010","wetlands","Non-woody wetland vegetation"]
["East Gippsland Lowlands","EGL_","Floodplain Reedbed","East Gippsland LowlandsFloodplain Reedbed","EGL_0863",0,0,0,null,null,null,null,null,null,null,1,5,null,null,null,null,2,10,2,5,2,5,null,null,2,30,1,5,null,null,null,null,null,null,null,null,null,null,null,null,1,1,null,null,null,null,"Episodic",5,7,1,6,5,10,0,1.36,1.36,863,"En","Endangered",6,0,0,"EGL_0863","wetlands","Non-woody wetland vegetation"]
["East Gippsland Lowlands","EGL_","Gallery Rainforest","East Gippsland LowlandsGallery Rainforest","EGL_0135",70,20,20,50,0,5,4,20,null,null,12,30,2,5,1,1,1,1,6,10,2,1,4,15,1,1,4,5,2,5,null,null,null,null,6,20,"1","1","2","5",8,10,0,20,null,null,"Continuous",0,17,18,9,55,40,200,1,1,135,"En","Endangered",1,0,0,"EGL_0135","Forest/Woodland","Woody vegetation"]
["East Gippsland Lowlands","EGL_","Grassy Dry Forest","East Gippsland LowlandsGrassy Dry Forest","EGL_0022",60,20,20,30,0,5,1,5,null,null,7,25,3,5,1,5,3,5,11,20,2,5,1,1,1,5,6,20,1,1,null,null,null,null,2,5,null,null,null,null,3,5,0,10,"0","10","Continuous",0,16,11,16,35,20,200,1,1,22,"LC","Least Concern",1,0,0,"EGL_0022","Forest/Woodland","Woody vegetation"]
["East Gippsland Lowlands","EGL_","Grassy Woodland","East Gippsland LowlandsGrassy Woodland","EGL_0175",null,null,null,null,null,null,null,null,null,null,null,null,null,null,null,null,null,null,null,null,null,null,null,null,null,null,null,null,null,null,null,null,null,null,null,null,null,null,null,null,null,null,null,null,null,null,null,null,0,null,null,null,null,0,1,1,175,"D","Depleted",1,0,0,"EGL_0175","Forest/Woodland","Woody vegetation"]
["East Gippsland Lowlands","EGL_","Heathy Dry Forest","East Gippsland LowlandsHeathy Dry Forest","EGL_0020",60,20,20,30,0,5,null,null,null,null,9,30,5,10,2,5,3,5,8,10,1,1,1,1,null,null,5,20,null,null,null,null,null,null,null,null,null,null,"1","0",2,1,0,10,"0","10","Episodic",20,13,14,12,40,20,200,1,1,20,"LC","Least Concern",1,0,0,"EGL_0020","Forest/Woodland","Woody vegetation"]
["East Gippsland Lowlands","EGL_","Heathy Woodland","East Gippsland LowlandsHeathy Woodland","EGL_0048",50,15,10,10,0,5,null,null,null,null,5,30,5,20,null,null,null,null,2,5,2,5,1,5,1,1,1,1,2,5,null,null,null,null,1,5,null,null,null,null,null,null,0,10,"0","10","Episodic",20,12,10,4,50,40,150,1,1,48,"D","Depleted",1,0,0,"EGL_0048","Forest/Woodland","Woody vegetation"]
["East Gippsland Lowlands","EGL_","Herb-rich Foothill Forest","East Gippsland LowlandsHerb-rich Foothill Forest","EGL_0023",70,20,25,40,0,5,2,10,null,null,4,10,3,5,1,5,4,5,13,20,3,5,2,1,null,null,7,30,2,5,null,null,null,null,2,10,null,null,null,null,2,5,0,20,null,null,"Continuous",0,14,9,20,25,40,200,1,1,23,"LC","Least Concern",1,0,0,"EGL_0023","Forest/Woodland","Woody vegetation"]
["East Gippsland Lowlands","EGL_","Limestone Box Forest","East Gippsland LowlandsLimestone Box Forest","EGL_0015",70,20,20,30,0,5,3,15,null,null,5,15,1,1,null,null,2,1,8,10,3,5,2,5,2,5,4,5,3,5,null,null,null,null,3,15,null,null,null,null,6,10,0,10,null,null,"Continuous",0,14,9,13,31,20,150,1,1,15,"Vu","Vulnerable",1,0,0,"EGL_0015","Forest/Woodland","Woody vegetation"]
["East Gippsland Lowlands","EGL_","Limestone Grassy Woodland","East Gippsland LowlandsLimestone Grassy Woodland","EGL_0175_62",70,15,15,15,0,5,3,10,null,null,3,15,2,5,null,null,4,5,8,15,3,10,1,5,null,null,5,25,1,5,null,null,null,null,2,5,null,null,null,null,3,5,0,10,null,null,"Continuous",0,13,8,15,30,20,150,1,{"$error":"#N/A"},{"$error":"#N/A"},{"$error":"#N/A"},{"$error":"#N/A"},{"$error":"#N/A"},{"$error":"#N/A"},{"$error":"#N/A"},{"$error":"#N/A"},{"$error":"#N/A"},{"$error":"#N/A"}]
["East Gippsland Lowlands","EGL_","Limestone Pomaderris Shrubland","East Gippsland LowlandsLimestone Pomaderris Shrubland","EGL_0133",0,0,0,null,null,null,2,10,null,null,7,45,2,1,null,null,5,5,10,15,3,5,2,5,null,null,7,20,null,null,null,null,null,null,null,null,null,null,null,null,3,5,0,10,"0","10","Continuous",0,11,11,18,56,40,0,1.25,1,133,"En","Endangered",1,0,0,"EGL_0133","Forest/Woodland","Woody vegetation"]
["East Gippsland Lowlands","EGL_","Lowland Forest","East Gippsland LowlandsLowland Forest","EGL_0016",70,20,25,30,0,5,2,10,null,null,10,30,6,15,2,5,1,1,6,10,null,null,2,10,1,5,6,10,2,5,null,null,null,null,3,10,null,null,null,null,3,5,0,10,null,null,"Continuous",0,14,18,7,55,40,200,1,1,16,"LC","Least Concern",1,0,0,"EGL_0016","Forest/Woodland","Woody vegetation"]
["East Gippsland Lowlands","EGL_","Lowland Herb-rich Forest","East Gippsland LowlandsLowland Herb-rich Forest","EGL_0877",70,20,20,30,0,5,3,10,null,null,4,20,1,1,1,5,2,5,13,30,4,5,1,15,null,null,5,5,2,10,null,null,null,null,null,null,null,null,null,null,null,null,0,10,null,null,"Continuous",0,12,8,19,31,40,200,1,1,877,"D","Depleted",1,0,0,"EGL_0877","Forest/Woodland","Woody vegetation"]
["East Gippsland Lowlands","EGL_","Plains Grassy Forest","East Gippsland LowlandsPlains Grassy Forest","EGL_0151",70,20,20,30,0,5,3,15,null,null,6,20,3,5,2,5,3,5,6,10,2,5,2,10,1,5,4,15,2,1,null,null,null,null,2,10,null,null,null,null,null,null,0,10,null,null,"Continuous",0,14,12,11,40,20,200,1,1,151,"En","Endangered",1,0,0,"EGL_0151","Forest/Woodland","Woody vegetation"]
["East Gippsland Lowlands","EGL_","Plains Grassy Wetland","East Gippsland LowlandsPlains Grassy Wetland","EGL_0125",null,null,0,null,null,null,null,null,null,null,null,null,null,null,null,null,null,null,null,null,null,null,null,null,null,null,null,null,null,null,null,null,null,null,null,null,null,null,null,null,null,null,null,null,null,null,null,0,0,null,null,null,null,0,1.36,1.36,125,"En","Endangered",6,"y",0,"EGL_0125","wetlands","Non-woody wetland vegetation"]
["East Gippsland Lowlands","EGL_","Plains Grassy Woodland","East Gippsland LowlandsPlains Grassy Woodland","EGL_0055",80,10,15,20,0,5,1,5,null,null,2,10,1,1,1,1,1,5,10,20,3,5,2,5,1,10,9,35,2,10,null,null,null,null,null,null,null,null,null,null,null,null,0,10,null,null,"Continuous",0,13,4,14,16,10,100,1,1,55,"En","Endangered",1,0,0,"EGL_0055","Forest/Woodland","Woody vegetation"]
["East Gippsland Lowlands","EGL_","Rainshadow Grassy Woodland","East Gippsland LowlandsRainshadow Grassy Woodland","EGL_0175_61",70,15,15,15,0,5,4,15,null,null,4,15,2,5,null,null,4,5,8,15,3,5,1,1,null,null,5,20,1,5,null,null,null,null,2,5,null,null,null,null,3,5,0,10,null,null,"Continuous",0,13,10,15,35,20,150,1,{"$error":"#N/A"},{"$error":"#N/A"},{"$error":"#N/A"},{"$error":"#N/A"},{"$error":"#N/A"},{"$error":"#N/A"},{"$error":"#N/A"},{"$error":"#N/A"},{"$error":"#N/A"},{"$error":"#N/A"}]
["East Gippsland Lowlands","EGL_","Riparian Forest","East Gippsland LowlandsRiparian Forest","EGL_0018",80,20,30,40,0,5,4,15,null,null,13,25,2,5,1,1,2,1,7,10,2,1,4,10,1,5,4,5,2,5,null,null,null,null,5,15,"1","5","1","0",7,15,0,20,null,null,"Continuous",0,17,19,11,45,50,300,1,1,18,"D","Depleted",1,0,0,"EGL_0018","Forest/Woodland","Woody vegetation"]
["East Gippsland Lowlands","EGL_","Riparian Scrub","East Gippsland LowlandsRiparian Scrub","EGL_0191",0,0,0,null,null,null,null,null,null,null,3,10,1,1,null,null,null,null,1,1,1,1,1,10,1,5,1,1,3,15,null,null,null,null,1,5,null,null,null,null,2,15,0,20,null,null,"Continuous",0,11,4,2,11,40,0,1.25,1.25,191,"LC","Least Concern",3,0,0,"EGL_0191","scrubs/shrublands/mallee without logs","Woody vegetation"]
["East Gippsland Lowlands","EGL_","Riparian Shrubland","East Gippsland LowlandsRiparian Shrubland","EGL_0019",0,0,0,null,null,null,null,null,null,null,6,25,null,null,null,null,6,5,9,10,3,5,3,5,null,null,2,10,2,1,null,null,null,null,2,1,null,null,null,null,2,1,0,20,null,null,"Episodic",5,10,6,18,25,20,100,1.25,1.25,19,"Ra","Rare",3,0,0,"EGL_0019","scrubs/shrublands/mallee without logs","Woody vegetation"]
["East Gippsland Lowlands","EGL_","Riverine Escarpment Scrub","East Gippsland LowlandsRiverine Escarpment Scrub","EGL_0082",0,0,0,null,0,5,null,null,null,null,7,20,1,1,null,null,3,5,10,10,2,5,2,5,null,null,4,15,2,10,null,null,null,null,2,5,null,null,null,null,4,10,0,10,null,null,"Continuous",0,12,8,15,21,40,50,1.25,1.25,82,"Ra","Rare",3,0,0,"EGL_0082","scrubs/shrublands/mallee without logs","Woody vegetation"]
["East Gippsland Lowlands","EGL_","Rocky Outcrop Shrubland","East Gippsland LowlandsRocky Outcrop Shrubland","EGL_0028",0,0,0,null,null,null,null,null,null,null,8,45,2,10,1,1,2,5,2,5,null,null,1,5,null,null,5,10,null,null,null,null,null,null,null,null,null,null,null,null,1,1,0,20,"0","10","Continuous",0,10,10,4,55,40,0,1.36,1.36,28,"Ra","Rare",4,0,0,"EGL_0028","heathlands","Woody vegetation"]
["East Gippsland Lowlands","EGL_","Sandy Flood Scrub","East Gippsland LowlandsSandy Flood Scrub","EGL_0141",0,0,0,null,null,null,null,null,null,null,3,15,1,1,null,null,null,null,2,5,1,1,3,15,1,10,1,1,2,5,null,null,null,null,1,5,null,null,null,null,null,null,0,20,null,null,"Episodic",5,10,4,3,16,10,50,1.25,1.25,141,"En","Endangered",3,0,0,"EGL_0141","scrubs/shrublands/mallee without logs","Woody vegetation"]
["East Gippsland Lowlands","EGL_","Shrubby Damp Forest","East Gippsland LowlandsShrubby Damp Forest","EGL_0316",90,20,30,40,0,5,3,20,null,null,8,30,2,5,null,null,4,10,9,20,2,5,2,10,1,1,4,10,1,1,null,null,null,null,2,15,"1","1",null,null,2,5,0,20,null,null,"Continuous",0,15,13,15,55,50,300,1,1,316,"LC","Least Concern",1,0,0,"EGL_0316","Forest/Woodland","Woody vegetation"]
["East Gippsland Lowlands","EGL_","Shrubby Dry Forest","East Gippsland LowlandsShrubby Dry Forest","EGL_0021",70,20,25,30,0,5,1,10,null,null,6,30,2,5,null,null,null,null,5,5,null,null,1,1,2,10,3,10,1,1,null,null,null,null,2,5,null,null,null,null,3,5,0,10,"0","10","Episodic",20,13,9,5,45,20,200,1,1,21,"LC","Least Concern",1,0,0,"EGL_0021","Forest/Woodland","Woody vegetation"]
["East Gippsland Lowlands","EGL_","Swamp Scrub","East Gippsland LowlandsSwamp Scrub","EGL_0053",0,0,0,null,null,null,null,null,null,null,2,10,2,1,null,null,2,5,3,15,2,5,2,10,3,10,2,5,2,15,null,null,null,null,1,5,null,null,null,null,1,1,0,20,null,null,"Continuous",0,12,4,7,11,40,0,1.25,1.1499999999999999,53,"En","Endangered",3,0,0,"EGL_0053","scrubs/shrublands/mallee without logs","Woody vegetation"]
["East Gippsland Lowlands","EGL_","Tall Marsh","East Gippsland LowlandsTall Marsh","EGL_0821",null,0,0,null,null,null,null,null,null,null,null,null,null,null,null,null,null,null,null,null,null,null,null,null,null,null,null,null,null,null,null,null,null,null,null,null,null,null,null,null,null,null,null,null,null,null,null,0,0,null,null,null,0,0,0,{"$error":"#N/A"},{"$error":"#N/A"},{"$error":"#N/A"},{"$error":"#N/A"},{"$error":"#N/A"},{"$error":"#N/A"},{"$error":"#N/A"},{"$error":"#N/A"},{"$error":"#N/A"},{"$error":"#N/A"}]
["East Gippsland Lowlands","EGL_","Treed Clay Heathland","East Gippsland LowlandsTreed Clay Heathland","EGL_0007_61",40,10,8,10,null,null,null,null,null,null,6,30,7,20,2,1,2,1,8,10,2,1,3,5,null,null,4,5,4,5,null,null,null,null,2,1,null,null,null,null,null,null,0,10,"0","10","Episodic",30,12,13,12,50,20,50,1,{"$error":"#N/A"},{"$error":"#N/A"},{"$error":"#N/A"},{"$error":"#N/A"},{"$error":"#N/A"},{"$error":"#N/A"},{"$error":"#N/A"},{"$error":"#N/A"},{"$error":"#N/A"},{"$error":"#N/A"}]
["East Gippsland Lowlands","EGL_","Valley Grassy Forest","East Gippsland LowlandsValley Grassy Forest","EGL_0047",70,20,25,20,0,5,3,10,null,null,9,20,3,5,1,1,3,5,17,20,4,5,2,5,2,5,7,20,4,15,null,null,null,null,3,5,"1","0","1","0",6,5,0,20,null,null,"Continuous",0,17,15,24,35,20,200,1,1,47,"D","Depleted",1,0,0,"EGL_0047","Forest/Woodland","Woody vegetation"]
["East Gippsland Lowlands","EGL_","Valley Slopes Dry Forest","East Gippsland LowlandsValley Slopes Dry Forest","EGL_0177",70,20,20,30,0,5,2,15,null,null,5,20,null,null,1,5,1,5,3,10,1,5,null,null,null,null,3,10,1,5,null,null,null,null,null,null,null,null,null,null,2,5,0,10,null,null,"Continuous",0,11,7,5,35,40,200,1,1,177,"Ra","Rare",1,0,0,"EGL_0177","Forest/Woodland","Woody vegetation"]
["East Gippsland Lowlands","EGL_","Warm Temperate Rainforest","East Gippsland LowlandsWarm Temperate Rainforest","EGL_0032",70,20,25,50,0,5,3,20,null,null,7,15,null,null,null,null,3,5,5,10,2,5,2,5,1,1,2,1,2,1,null,null,null,null,8,30,"1","15","3","1",9,15,0,20,null,null,"Continuous",0,15,10,10,35,50,200,1,1,32,"Ra","Rare",1,0,0,"EGL_0032","Forest/Woodland","Woody vegetation"]
["East Gippsland Lowlands","EGL_","Wet Forest","East Gippsland LowlandsWet Forest","EGL_0030",90,20,30,40,0,5,3,20,null,null,6,15,null,null,null,null,1,1,6,15,2,1,2,5,1,1,3,15,1,10,null,null,null,null,4,20,"1","15",null,null,3,5,0,20,null,null,"Continuous",0,14,18,18,70,50,300,1,1,30,"LC","Least Concern",1,0,0,"EGL_0030","Forest/Woodland","Woody vegetation"]
["East Gippsland Lowlands","EGL_","Wet Heathland","East Gippsland LowlandsWet Heathland","EGL_0008",0,0,0,null,null,null,null,null,null,null,7,40,4,5,1,1,1,1,4,5,null,null,2,15,null,null,3,5,5,10,null,null,null,null,1,1,null,null,null,null,1,1,0,20,null,null,"Episodic",30,11,11,5,45,20,0,1.36,1.36,8,"LC","Least Concern",4,0,0,"EGL_0008","heathlands","Woody vegetation"]
["East Gippsland Lowlands","EGL_","Wet Swale Herbland","East Gippsland LowlandsWet Swale Herbland","EGL_0012",0,0,0,null,null,null,null,null,null,null,null,null,1,1,null,null,1,1,7,15,3,5,2,5,1,1,4,10,4,25,null,null,null,null,1,5,null,null,null,null,2,1,null,null,null,null,"Episodic",5,10,1,11,1,10,0,1.36,1.36,12,"Vu","Vulnerable",6,0,0,"EGL_0012","wetlands","Non-woody wetland vegetation"]
["East Gippsland Uplands","EGU_","Banksia Woodland","East Gippsland UplandsBanksia Woodland","EGU_0014",50,15,10,15,0,5,1,5,null,null,10,25,7,15,null,null,1,1,5,10,1,1,3,10,1,5,5,10,2,5,null,null,null,null,2,10,null,null,null,null,3,1,0,10,null,null,"Episodic",30,14,18,7,45,40,150,1,1,14,"LC","Least Concern",1,0,0,"EGU_0014","Forest/Woodland","Woody vegetation"]
["East Gippsland Uplands","EGU_","Blackthorn Scrub","East Gippsland UplandsBlackthorn Scrub","EGU_0027",0,0,0,null,null,null,null,null,null,null,8,40,1,1,null,null,2,1,3,5,null,null,1,1,null,null,3,5,1,1,null,null,null,null,1,1,null,null,null,null,3,5,0,10,null,null,"Continuous",0,10,9,5,41,40,100,1.25,1.25,27,"Ra","Rare",3,0,0,"EGU_0027","scrubs/shrublands/mallee without logs","Woody vegetation"]
["East Gippsland Uplands","EGU_","Clay Heathland","East Gippsland UplandsClay Heathland","EGU_0007",0,0,0,null,null,null,null,null,null,null,9,30,6,10,3,5,null,null,8,10,2,1,5,10,1,5,7,10,2,5,null,null,null,null,null,null,null,null,null,null,null,null,0,10,"0","10","Episodic",30,11,15,10,40,20,0,1.36,1.36,7,"Vu","Vulnerable",4,0,0,"EGU_0007","heathlands","Woody vegetation"]
["East Gippsland Uplands","EGU_","Cool Temperate Rainforest","East Gippsland UplandsCool Temperate Rainforest","EGU_0031",70,20,25,50,0,5,2,15,null,null,4,10,null,null,null,null,null,null,3,10,null,null,1,1,null,null,1,1,1,1,null,null,null,null,6,25,"2","25","2","5",2,1,0,20,null,null,"Continuous",0,12,6,3,25,50,200,1,1,31,"Ra","Rare",1,0,0,"EGU_0031","Forest/Woodland","Woody vegetation"]
["East Gippsland Uplands","EGU_","Damp Forest","East Gippsland UplandsDamp Forest","EGU_0029",90,20,30,40,0,5,3,15,null,null,10,25,2,5,null,null,2,1,6,15,1,1,2,5,1,5,4,10,1,1,null,null,null,null,4,20,"1","5",null,null,4,10,0,20,null,null,"Continuous",0,15,15,9,45,50,300,1,1,29,"LC","Least Concern",1,0,0,"EGU_0029","Forest/Woodland","Woody vegetation"]
["East Gippsland Uplands","EGU_","Damp Sands Herb-rich Woodland","East Gippsland UplandsDamp Sands Herb-rich Woodland","EGU_0003",70,15,15,20,0,5,2,10,null,null,4,20,null,null,1,1,2,5,6,15,5,10,1,1,null,null,7,20,1,5,null,null,null,null,1,10,null,null,null,null,2,5,0,10,null,null,"Continuous",0,13,6,13,30,40,150,1,1,3,"Vu","Vulnerable",1,0,0,"EGU_0003","Forest/Woodland","Woody vegetation"]
["East Gippsland Uplands","EGU_","Dry Rainforest","East Gippsland UplandsDry Rainforest","EGU_0034",70,10,15,40,0,5,2,10,null,null,5,10,null,null,null,null,3,5,4,10,null,null,null,null,null,null,null,null,1,1,null,null,null,null,5,20,"2","30","2","1",3,5,0,20,null,null,"Continuous",0,11,7,7,20,40,100,1,1,34,"En","Endangered",1,0,0,"EGU_0034","Forest/Woodland","Woody vegetation"]
["East Gippsland Uplands","EGU_","Dry Valley Forest","East Gippsland UplandsDry Valley Forest","EGU_0169",70,20,20,30,0,5,3,15,null,null,6,30,1,1,null,null,4,5,10,15,4,5,1,1,2,5,2,10,2,5,null,null,null,null,3,5,null,null,null,null,2,5,0,20,null,null,"Continuous",0,14,10,18,46,40,200,1,1,169,"Vu","Vulnerable",1,0,0,"EGU_0169","Forest/Woodland","Woody vegetation"]
["East Gippsland Uplands","EGU_","Foothill Box Ironbark Forest",{"$f":"CONCATENATE(A195,C195)","v":"East Gippsland UplandsFoothill Box Ironbark Forest"},"EGU_0024",60,15,20,30,0,5,2,10,null,null,4,20,null,null,null,null,2,1,2,1,2,1,1,1,null,null,3,5,null,null,null,null,null,null,null,null,null,null,"1","1",3,5,0,10,"0","10","Continuous",0,12,6,6,30,20,200,1,1,24,"Vu","Vulnerable",1,0,0,"EGU_0024","Forest/Woodland","Woody vegetation"]
["East Gippsland Uplands","EGU_","Gallery Rainforest","East Gippsland UplandsGallery Rainforest","EGU_0135",70,20,20,50,0,5,2,15,null,null,12,25,null,null,null,null,3,1,11,15,3,5,3,5,2,5,6,10,3,5,null,null,null,null,8,20,"2","5","2","1",8,10,0,20,null,null,"Continuous",0,15,14,17,40,50,200,1,1,135,"En","Endangered",1,0,0,"EGU_0135","Forest/Woodland","Woody vegetation"]
["East Gippsland Uplands","EGU_","Grassy Dry Forest","East Gippsland UplandsGrassy Dry Forest","EGU_0022",60,20,20,30,0,5,1,10,null,null,7,20,3,5,1,5,3,1,11,20,2,1,2,5,1,5,6,25,2,5,null,null,null,null,2,5,null,null,null,null,3,5,0,10,"0","10","Continuous",0,16,11,16,35,20,200,1,1,22,"LC","Least Concern",1,0,0,"EGU_0022","Forest/Woodland","Woody vegetation"]
["East Gippsland Uplands","EGU_","Grassy Woodland","East Gippsland UplandsGrassy Woodland","EGU_0175",null,null,null,null,null,null,null,null,null,null,null,null,null,null,null,null,null,null,null,null,null,null,null,null,null,null,null,null,null,null,null,null,null,null,null,null,null,null,null,null,null,null,null,null,null,null,null,null,0,null,null,null,null,0,1,1,175,"D","Depleted",1,0,0,"EGU_0175","Forest/Woodland","Woody vegetation"]
["East Gippsland Uplands","EGU_","Heathy Dry Forest","East Gippsland UplandsHeathy Dry Forest","EGU_0020",60,20,20,30,0,5,2,10,null,null,8,30,5,10,2,5,3,5,8,10,1,1,1,1,null,null,5,20,null,null,null,null,null,null,null,null,null,null,null,null,2,1,0,10,"0","10","Episodic",20,13,15,12,50,20,200,1,1,20,"LC","Least Concern",1,0,0,"EGU_0020","Forest/Woodland","Woody vegetation"]
["East Gippsland Uplands","EGU_","Herb-rich Foothill Forest","East Gippsland UplandsHerb-rich Foothill Forest","EGU_0023",70,20,25,40,0,5,2,10,null,null,4,10,3,5,1,5,4,5,13,20,3,5,2,1,null,null,7,30,2,5,null,null,null,null,2,10,null,null,null,null,2,5,0,20,null,null,"Continuous",0,14,9,20,25,40,200,1,1,23,"LC","Least Concern",1,0,0,"EGU_0023","Forest/Woodland","Woody vegetation"]
["East Gippsland Uplands","EGU_","Limestone Box Forest","East Gippsland UplandsLimestone Box Forest","EGU_0015",70,20,20,30,0,5,3,15,null,null,5,15,1,1,null,null,2,1,8,10,3,5,2,5,2,5,4,5,3,5,null,null,null,null,3,15,null,null,null,null,6,10,0,10,null,null,"Continuous",0,14,9,13,31,40,150,1,1,15,"Vu","Vulnerable",1,0,0,"EGU_0015","Forest/Woodland","Woody vegetation"]
["East Gippsland Uplands","EGU_","Limestone Grassy Woodland","East Gippsland UplandsLimestone Grassy Woodland","EGU_0175_62",70,15,15,15,4,5,3,10,null,null,3,15,2,5,null,null,4,5,8,15,3,10,1,5,null,null,5,25,1,5,null,null,null,null,2,5,null,null,null,null,3,5,0,10,null,null,"Continuous",0,13,8,15,30,20,150,1,{"$error":"#N/A"},{"$error":"#N/A"},{"$error":"#N/A"},{"$error":"#N/A"},{"$error":"#N/A"},{"$error":"#N/A"},{"$error":"#N/A"},{"$error":"#N/A"},{"$error":"#N/A"},{"$error":"#N/A"}]
["East Gippsland Uplands","EGU_","Limestone Pomaderris Shrubland","East Gippsland UplandsLimestone Pomaderris Shrubland","EGU_0133",0,0,0,null,null,null,null,null,null,null,9,45,2,1,null,null,5,5,10,15,3,5,2,5,null,null,7,20,null,null,null,null,null,null,null,null,null,null,null,null,3,1,0,10,"0","10","Continuous",0,10,11,18,46,40,0,1,1,133,"En","Endangered",1,0,0,"EGU_0133","Forest/Woodland","Woody vegetation"]
["East Gippsland Uplands","EGU_","Lowland Forest","East Gippsland UplandsLowland Forest","EGU_0016",70,20,25,30,0,5,2,10,null,null,7,25,3,10,1,1,1,1,4,10,null,null,1,5,2,10,3,10,1,1,null,null,null,null,1,5,null,null,null,null,3,5,0,10,null,null,"Continuous",0,14,12,5,45,40,200,1,1,16,"LC","Least Concern",1,0,0,"EGU_0016","Forest/Woodland","Woody vegetation"]
["East Gippsland Uplands","EGU_","Lowland Herb-rich Forest","East Gippsland UplandsLowland Herb-rich Forest","EGU_0877",70,20,20,30,0,5,null,null,null,null,4,20,2,5,null,null,4,10,8,15,null,null,1,5,1,0,5,15,null,null,null,null,null,null,null,null,null,null,"1","0",1,1,0,10,null,null,"Continuous",0,11,6,12,25,40,200,1,1,877,"LC","Least Concern",1,0,0,"EGU_0877","Forest/Woodland","Woody vegetation"]
["East Gippsland Uplands","EGU_","Montane Damp Forest","East Gippsland UplandsMontane Damp Forest","EGU_0038",90,20,30,40,0,5,3,20,null,null,7,25,4,10,1,1,3,5,8,15,2,5,1,1,null,null,6,15,1,1,null,null,null,null,2,10,"1","1",null,null,1,5,0,20,null,null,"Continuous",0,15,14,13,55,50,300,1,1,38,"LC","Least Concern",1,0,0,"EGU_0038","Forest/Woodland","Woody vegetation"]
["East Gippsland Uplands","EGU_","Montane Dry Woodland","East Gippsland UplandsMontane Dry Woodland","EGU_0036",50,15,15,20,0,5,2,20,"1","1",6,20,2,5,null,null,2,5,9,20,2,5,2,5,null,null,6,15,1,5,null,null,null,null,1,5,null,null,null,null,null,null,0,10,"0","10","Continuous",0,14,10,13,45,20,150,1,1,36,"LC","Least Concern",1,0,0,"EGU_0036","Forest/Woodland","Woody vegetation"]
["East Gippsland Uplands","EGU_","Montane Grassy Woodland","East Gippsland UplandsMontane Grassy Woodland","EGU_0037",50,15,10,20,0,5,1,5,null,null,2,10,3,5,1,1,1,1,8,20,2,5,1,5,null,null,5,25,1,5,null,null,null,null,1,1,null,null,null,null,1,1,0,10,"0","10","Continuous",0,15,6,11,20,20,150,1,1,37,"Vu","Vulnerable",1,0,0,"EGU_0037","Forest/Woodland","Woody vegetation"]
["East Gippsland Uplands","EGU_","Montane Herb-rich Woodland","East Gippsland UplandsMontane Herb-rich Woodland","EGU_0319",70,15,25,40,0,5,1,10,null,null,6,15,2,5,1,1,5,10,12,20,3,5,1,1,null,null,7,20,1,1,null,null,null,null,2,5,null,null,null,null,2,5,0,10,null,null,"Continuous",0,14,9,20,30,20,150,1,1,319,"LC","Least Concern",1,0,0,"EGU_0319","Forest/Woodland","Woody vegetation"]
["East Gippsland Uplands","EGU_","Montane Riparian Thicket","East Gippsland UplandsMontane Riparian Thicket","EGU_0041",0,15,0,null,null,null,null,null,null,null,3,5,null,null,null,null,null,null,null,null,2,1,2,40,null,null,2,1,null,null,null,null,null,null,3,20,"1","5","2","1",null,null,0,20,null,null,"Continuous",0,8,3,2,5,40,50,1.25,1.25,41,"LC","Least Concern",3,0,0,"EGU_0041","scrubs/shrublands/mallee without logs","Woody vegetation"]
["East Gippsland Uplands","EGU_","Montane Riparian Woodland","East Gippsland UplandsMontane Riparian Woodland","EGU_0040",60,15,10,15,0,5,1,10,null,null,3,10,3,5,null,null,4,10,12,20,4,10,3,5,1,1,6,30,3,5,null,null,null,null,2,5,null,null,null,null,null,null,0,20,null,null,"Continuous",0,13,7,20,25,40,150,1,1,40,"En","Endangered",1,0,0,"EGU_0040","Forest/Woodland","Woody vegetation"]
["East Gippsland Uplands","EGU_","Montane Swamp","East Gippsland UplandsMontane Swamp","EGU_0318",0,0,0,null,null,null,null,null,null,null,5,20,2,5,null,null,1,1,3,10,2,5,1,5,null,null,4,10,4,15,null,null,null,null,1,1,null,null,null,null,null,null,0,40,null,null,"Episodic",30,10,7,6,25,10,0,1.36,1.36,318,"En","Endangered",6,0,0,"EGU_0318","wetlands","Non-woody wetland vegetation"]
["East Gippsland Uplands","EGU_","Montane Wet Forest","East Gippsland UplandsMontane Wet Forest","EGU_0039",90,20,30,40,0,5,5,30,null,null,5,25,1,1,null,null,null,null,3,5,null,null,1,1,1,1,2,10,null,null,null,null,null,null,4,30,"2","10",null,null,1,1,0,20,null,null,"Continuous",0,12,11,3,56,50,300,1,1,39,"LC","Least Concern",1,0,0,"EGU_0039","Forest/Woodland","Woody vegetation"]
["East Gippsland Uplands","EGU_","Rainshadow Grassy Woodland","East Gippsland UplandsRainshadow Grassy Woodland","EGU_0175_61",70,15,15,15,1,5,4,15,null,null,4,15,2,5,null,null,4,5,8,15,3,5,1,1,null,null,5,20,1,5,null,null,null,null,2,5,null,null,null,null,3,5,0,10,null,null,"Continuous",0,13,10,15,35,20,150,1,{"$error":"#N/A"},{"$error":"#N/A"},{"$error":"#N/A"},{"$error":"#N/A"},{"$error":"#N/A"},{"$error":"#N/A"},{"$error":"#N/A"},{"$error":"#N/A"},{"$error":"#N/A"},{"$error":"#N/A"}]
["East Gippsland Uplands","EGU_","Riparian Forest","East Gippsland UplandsRiparian Forest","EGU_0018",80,20,30,40,0,5,4,15,null,null,11,30,null,null,null,null,3,5,9,10,2,5,3,5,1,5,6,10,2,5,null,null,null,null,4,15,"1","5",null,null,5,10,0,20,null,null,"Continuous",0,14,15,14,45,50,300,1,1,18,"LC","Least Concern",1,0,0,"EGU_0018","Forest/Woodland","Woody vegetation"]
["East Gippsland Uplands","EGU_","Riparian Shrubland","East Gippsland UplandsRiparian Shrubland","EGU_0019",0,0,0,null,null,null,null,null,null,null,6,25,null,null,null,null,6,5,5,10,3,5,3,5,null,null,2,10,2,1,null,null,null,null,3,5,null,null,null,null,2,1,0,20,null,null,"Episodic",5,10,6,14,25,20,100,1.25,1.25,19,"Ra","Rare",3,0,0,"EGU_0019","scrubs/shrublands/mallee without logs","Woody vegetation"]
["East Gippsland Uplands","EGU_","Riverine Escarpment Scrub","East Gippsland UplandsRiverine Escarpment Scrub","EGU_0082",0,0,0,null,0,5,null,null,null,null,10,30,1,1,null,null,2,5,9,15,2,1,2,1,null,null,4,10,1,1,null,null,null,null,3,10,null,null,null,null,2,5,0,10,null,null,"Continuous",0,12,11,13,31,40,50,1.25,1.25,82,"LC","Least Concern",3,0,0,"EGU_0082","scrubs/shrublands/mallee without logs","Woody vegetation"]
["East Gippsland Uplands","EGU_","Rocky Outcrop Shrubland","East Gippsland UplandsRocky Outcrop Shrubland","EGU_0028",0,0,0,null,null,null,null,null,null,null,7,25,2,5,1,1,3,5,3,5,null,null,1,5,null,null,5,10,null,null,null,null,null,null,null,null,null,null,null,null,2,1,0,20,"0","10","Continuous",0,10,9,6,30,40,0,1.36,1.36,28,"Ra","Rare",4,0,0,"EGU_0028","heathlands","Woody vegetation"]
["East Gippsland Uplands","EGU_","Sand Heathland","East Gippsland UplandsSand Heathland","EGU_0006",0,0,0,null,null,null,null,null,null,null,5,30,5,20,null,null,null,null,2,5,2,5,1,5,1,1,1,1,2,5,null,null,null,null,1,5,null,null,null,null,null,null,0,10,"0","10","Episodic",20,11,10,4,50,40,0,1.36,{"$error":"#N/A"},{"$error":"#N/A"},{"$error":"#N/A"},{"$error":"#N/A"},{"$error":"#N/A"},{"$error":"#N/A"},{"$error":"#N/A"},{"$error":"#N/A"},{"$error":"#N/A"},{"$error":"#N/A"}]
["East Gippsland Uplands","EGU_","Shrubby Damp Forest","East Gippsland UplandsShrubby Damp Forest","EGU_0316",90,20,25,40,0,5,2,10,null,null,6,25,2,1,null,null,2,5,10,15,2,5,2,1,2,5,4,15,null,null,null,null,null,null,2,15,"1","5","1","0",3,5,0,20,null,null,"Continuous",0,15,10,14,36,80,300,1,1,316,"LC","Least Concern",1,0,0,"EGU_0316","Forest/Woodland","Woody vegetation"]
["East Gippsland Uplands","EGU_","Shrubby Dry Forest","East Gippsland UplandsShrubby Dry Forest","EGU_0021",70,20,25,30,0,5,1,10,null,null,6,30,2,5,null,null,null,null,5,5,null,null,1,1,2,5,3,10,1,1,null,null,null,null,2,5,null,null,null,null,3,5,0,10,"0","10","Episodic",20,13,9,5,45,30,200,1,1,21,"LC","Least Concern",1,0,0,"EGU_0021","Forest/Woodland","Woody vegetation"]
["East Gippsland Uplands","EGU_","Shrubby Foothill Forest","East Gippsland UplandsShrubby Foothill Forest","EGU_0045",70,20,25,40,0,5,2,10,null,null,9,30,5,15,1,1,2,5,5,5,1,1,2,5,1,1,4,5,1,1,null,null,null,null,1,5,null,null,null,null,2,1,0,10,null,null,"Episodic",30,15,16,8,55,40,200,1,1,45,"LC","Least Concern",1,0,0,"EGU_0045","Forest/Woodland","Woody vegetation"]
["East Gippsland Uplands","EGU_","Shrubby Wet Forest","East Gippsland UplandsShrubby Wet Forest","EGU_0201",90,20,30,40,0,5,2,20,null,null,7,25,3,10,null,null,2,1,8,15,2,1,1,1,null,null,6,15,1,1,null,null,null,null,2,5,null,null,null,null,null,null,0,20,null,null,"Continuous",0,12,12,12,55,50,300,1,1,201,"LC","Least Concern",1,0,0,"EGU_0201","Forest/Woodland","Woody vegetation"]
["East Gippsland Uplands","EGU_","Sub-alpine Grassland","East Gippsland UplandsSub-alpine Grassland","EGU_0206",0,20,0,null,null,null,null,null,null,null,1,5,3,5,1,1,3,5,11,20,3,10,1,1,null,null,5,20,2,10,null,null,null,null,null,null,null,null,null,null,null,null,0,20,"0","10","Continuous",0,11,4,17,10,10,0,1.36,1.36,206,"Ra","Rare",5,0,0,"EGU_0206","grasslands","Other grassland vegetation"]
["East Gippsland Uplands","EGU_","Sub-alpine Shrubland","East Gippsland UplandsSub-alpine Shrubland","EGU_0042",0,0,0,null,null,null,null,null,null,null,6,40,4,15,2,1,3,5,8,15,2,5,null,null,null,null,5,20,1,5,null,null,null,null,null,null,null,null,null,null,null,null,0,20,null,null,"Continuous",0,9,10,13,55,40,100,1.25,1.25,42,"Ra","Rare",3,0,0,"EGU_0042","scrubs/shrublands/mallee without logs","Woody vegetation"]
["East Gippsland Uplands","EGU_","Sub-alpine Woodland","East Gippsland UplandsSub-alpine Woodland","EGU_0043",40,15,10,15,0,5,1,5,null,null,5,20,2,10,null,null,3,10,8,20,2,5,null,null,null,null,4,20,1,5,null,null,null,null,1,1,null,null,null,null,null,null,0,20,"0","10","Continuous",0,12,8,13,35,20,100,1,1,43,"LC","Least Concern",1,0,0,"EGU_0043","Forest/Woodland","Woody vegetation"]
["East Gippsland Uplands","EGU_","Swampy Riparian Woodland","East Gippsland UplandsSwampy Riparian Woodland","EGU_0083",70,10,15,20,0,5,4,25,null,null,4,20,1,1,1,1,3,5,6,10,2,5,3,15,2,10,6,15,2,5,null,null,null,null,2,5,null,null,null,null,2,5,0,10,null,null,"Continuous",0,15,9,11,46,20,200,1,1,83,"En","Endangered",1,0,0,"EGU_0083","Forest/Woodland","Woody vegetation"]
["East Gippsland Uplands","EGU_","Tableland Damp Forest","East Gippsland UplandsTableland Damp Forest","EGU_0035",90,20,30,40,0,5,3,20,null,null,7,20,2,10,null,null,2,5,8,15,2,15,1,5,1,1,3,15,1,5,null,null,null,null,2,5,null,null,null,null,1,1,0,20,null,null,"Continuous",0,14,12,12,50,50,300,1,1,35,"LC","Least Concern",1,0,0,"EGU_0035","Forest/Woodland","Woody vegetation"]
["East Gippsland Uplands","EGU_","Treed Clay Heathland","East Gippsland UplandsTreed Clay Heathland","EGU_0007_61",40,10,8,10,null,null,null,null,null,null,9,30,6,10,3,5,null,null,8,10,2,1,5,10,1,5,7,10,2,5,null,null,null,null,null,null,null,null,null,null,null,null,0,10,"0","10","Episodic",30,11,15,10,40,20,50,1,{"$error":"#N/A"},{"$error":"#N/A"},{"$error":"#N/A"},{"$error":"#N/A"},{"$error":"#N/A"},{"$error":"#N/A"},{"$error":"#N/A"},{"$error":"#N/A"},{"$error":"#N/A"},{"$error":"#N/A"}]
["East Gippsland Uplands","EGU_","Treed Limestone Pomaderris Shrubland","East Gippsland UplandsTreed Limestone Pomaderris Shrubland","EGU_0133_61",60,10,10,10,0,5,2,10,null,null,9,45,2,1,null,null,5,5,10,15,3,5,2,5,null,null,7,20,null,null,null,null,null,null,null,null,null,null,null,null,3,1,0,10,"0","10","Continuous",0,12,13,18,56,40,50,1,{"$error":"#N/A"},{"$error":"#N/A"},{"$error":"#N/A"},{"$error":"#N/A"},{"$error":"#N/A"},{"$error":"#N/A"},{"$error":"#N/A"},{"$error":"#N/A"},{"$error":"#N/A"},{"$error":"#N/A"}]
["East Gippsland Uplands","EGU_","Treed Sand Heathland","East Gippsland UplandsTreed Sand Heathland","EGU_0006_61",50,15,10,10,0,5,null,null,null,null,5,30,5,20,null,null,null,null,2,5,2,5,1,5,1,1,1,1,2,5,null,null,null,null,1,5,null,null,null,null,null,null,0,10,"0","10","Episodic",20,12,10,4,50,40,150,1,{"$error":"#N/A"},{"$error":"#N/A"},{"$error":"#N/A"},{"$error":"#N/A"},{"$error":"#N/A"},{"$error":"#N/A"},{"$error":"#N/A"},{"$error":"#N/A"},{"$error":"#N/A"},{"$error":"#N/A"}]
["East Gippsland Uplands","EGU_","Valley Grassy Forest","East Gippsland UplandsValley Grassy Forest","EGU_0047",70,20,25,20,0,5,3,15,null,null,7,25,1,1,2,1,3,5,10,20,3,5,3,15,null,null,5,20,2,5,null,null,null,null,2,5,null,null,null,null,5,5,0,20,null,null,"Continuous",0,14,11,16,41,20,200,1,1,47,"D","Depleted",1,0,0,"EGU_0047","Forest/Woodland","Woody vegetation"]
["East Gippsland Uplands","EGU_","Valley Heathy Forest","East Gippsland UplandsValley Heathy Forest","EGU_0127",70,20,15,30,0,5,2,10,null,null,5,20,5,10,2,15,1,5,12,15,5,5,1,5,null,null,7,20,1,5,null,null,null,null,null,null,null,null,null,null,null,null,0,10,null,null,"Episodic",30,12,12,18,40,40,200,1,1,127,"Vu","Vulnerable",1,0,0,"EGU_0127","Forest/Woodland","Woody vegetation"]
["East Gippsland Uplands","EGU_","Valley Slopes Dry Forest","East Gippsland UplandsValley Slopes Dry Forest","EGU_0177",70,20,20,30,0,5,2,15,null,null,5,20,null,null,1,5,1,5,3,10,1,5,null,null,null,null,3,10,1,5,null,null,null,null,null,null,null,null,null,null,2,5,0,10,null,null,"Continuous",0,11,7,5,35,40,200,1,1,177,"Ra","Rare",1,0,0,"EGU_0177","Forest/Woodland","Woody vegetation"]
["East Gippsland Uplands","EGU_","Warm Temperate Rainforest","East Gippsland UplandsWarm Temperate Rainforest","EGU_0032",70,20,20,50,0,5,5,30,null,null,6,15,null,null,null,null,2,1,5,10,1,1,1,1,1,1,2,5,1,1,null,null,null,null,8,25,"2","20","4","10",9,20,0,20,null,null,"Continuous",0,15,11,8,45,50,200,1,1,32,"Ra","Rare",1,0,0,"EGU_0032","Forest/Woodland","Woody vegetation"]
["East Gippsland Uplands","EGU_","Wet Forest","East Gippsland UplandsWet Forest","EGU_0030",90,20,30,40,0,5,4,20,null,null,7,25,null,null,null,null,1,1,5,15,1,1,1,1,1,1,3,5,1,1,null,null,null,null,4,30,"2","15","1","1",4,10,0,20,null,null,"Continuous",0,15,11,7,45,50,300,1,1,30,"LC","Least Concern",1,0,0,"EGU_0030","Forest/Woodland","Woody vegetation"]
["East Gippsland Uplands","EGU_","Wet Heathland","East Gippsland UplandsWet Heathland","EGU_0008",0,10,0,null,null,null,null,null,null,null,7,30,3,5,null,null,2,5,4,5,null,null,2,10,3,10,4,10,3,10,null,null,null,null,1,1,null,null,null,null,2,10,0,20,null,null,"Episodic",30,11,10,6,35,20,0,1.36,1.36,8,"LC","Least Concern",4,0,0,"EGU_0008","heathlands","Woody vegetation"]
["Gippsland Plain","GipP","Aquatic Herbland","Gippsland PlainAquatic Herbland","GipP0653",0,0,0,null,null,null,null,null,null,null,null,null,null,null,null,null,2,10,3,20,3,15,2,20,null,null,2,10,1,5,null,null,null,null,null,null,null,null,null,null,null,null,null,null,null,null,"Episodic",5,6,null,8,null,10,0,1.36,1.36,653,"En","Endangered",6,0,0,"GipP0653","wetlands","Non-woody wetland vegetation"]
["Gippsland Plain","GipP","Aquatic Sedgeland","Gippsland PlainAquatic Sedgeland","GipP0308",null,0,0,null,null,null,null,null,null,null,null,null,null,null,null,null,null,null,null,null,null,null,null,null,null,null,null,null,null,null,null,null,null,null,null,null,null,null,null,null,null,null,null,null,null,null,null,0,0,null,null,null,0,0,0,{"$error":"#N/A"},{"$error":"#N/A"},{"$error":"#N/A"},{"$error":"#N/A"},{"$error":"#N/A"},{"$error":"#N/A"},{"$error":"#N/A"},{"$error":"#N/A"},{"$error":"#N/A"},{"$error":"#N/A"}]
["Gippsland Plain","GipP","Banksia Woodland","Gippsland PlainBanksia Woodland","GipP0014",50,15,10,15,0,5,1,5,null,null,10,25,7,15,null,null,1,1,5,10,1,1,3,10,1,5,5,10,2,5,null,null,null,null,2,10,null,null,null,null,3,1,0,10,null,null,"Episodic",30,14,18,7,45,40,150,1,1,14,"LC","Least Concern",1,0,0,"GipP0014","Forest/Woodland","Woody vegetation"]
["Gippsland Plain","GipP","Berm Grassy Shrubland","Gippsland PlainBerm Grassy Shrubland","GipP0311",0,0,0,null,null,null,null,null,null,null,2,20,2,5,null,null,2,5,2,10,2,5,1,1,null,null,2,25,2,10,null,null,null,null,null,null,null,null,null,null,null,null,null,null,null,null,"Continuous",0,8,4,6,25,10,0,1.36,1.36,311,"En","Endangered",5,0,0,"GipP0311","grasslands","Other grassland vegetation"]
["Gippsland Plain","GipP","Bird Colony Succulent Herbland","Gippsland PlainBird Colony Succulent Herbland","GipP0155",0,0,0,null,null,null,null,null,null,null,1,10,null,null,null,null,2,5,5,10,1,10,null,null,1,5,3,30,2,5,null,null,null,null,null,null,null,null,null,null,1,5,null,null,null,null,"Continuous",0,8,1,8,10,0,0,1.36,1.36,155,"Ra","Rare",5,0,0,"GipP0155","grasslands","Other grassland vegetation"]
["Gippsland Plain","GipP","Blocked Coastal Stream Swamp","Gippsland PlainBlocked Coastal Stream Swamp","GipP0875",0,0,0,null,null,null,null,null,null,null,null,null,null,null,null,null,3,25,1,5,1,1,null,null,1,55,3,5,1,1,null,null,null,null,null,null,null,null,null,null,null,null,null,null,null,null,"Episodic",5,6,null,5,null,10,0,1.36,1.36,875,"Ra","Rare",6,0,0,"GipP0875","wetlands","Non-woody wetland vegetation"]
["Gippsland Plain","GipP","Box Ironbark Forest","Gippsland PlainBox Ironbark Forest","GipP0061",70,15,20,30,0,5,null,null,null,null,4,20,3,10,2,1,2,5,10,15,2,1,1,1,null,null,5,10,null,null,null,null,null,null,1,1,null,null,null,null,null,null,0,10,"0","20","Continuous",0,12,7,14,30,20,200,1,1,61,"Vu","Vulnerable",1,0,0,"GipP0061","Forest/Woodland","Woody vegetation"]
["Gippsland Plain","GipP","Brackish Aquatic Herbland","Gippsland PlainBrackish Aquatic Herbland","GipP0537",null,0,0,null,null,null,null,null,null,null,null,null,null,null,null,null,null,null,null,null,null,null,null,null,null,null,null,null,null,null,null,null,null,null,null,null,null,null,null,null,null,null,null,null,null,null,null,0,0,null,null,null,0,0,0,{"$error":"#N/A"},{"$error":"#N/A"},{"$error":"#N/A"},{"$error":"#N/A"},{"$error":"#N/A"},{"$error":"#N/A"},{"$error":"#N/A"},{"$error":"#N/A"},{"$error":"#N/A"},{"$error":"#N/A"}]
["Gippsland Plain","GipP","Brackish Grassland","Gippsland PlainBrackish Grassland","GipP0934",0,0,0,null,null,null,null,null,null,null,null,null,null,null,null,null,1,1,3,5,5,5,2,20,null,null,4,20,1,10,null,null,null,null,null,null,null,null,null,null,null,null,0,10,null,null,"Continuous",0,7,null,9,null,10,0,1.36,1.36,934,"En","Endangered",5,0,0,"GipP0934","grasslands","Other grassland vegetation"]
["Gippsland Plain","GipP","Brackish Herbland","Gippsland PlainBrackish Herbland","GipP0538",null,0,0,null,null,null,null,null,null,null,null,null,null,null,null,null,null,null,null,null,null,null,null,null,null,null,null,null,null,null,null,null,null,null,null,null,null,null,null,null,null,null,null,null,null,null,null,0,0,null,null,null,0,0,0,{"$error":"#N/A"},{"$error":"#N/A"},{"$error":"#N/A"},{"$error":"#N/A"},{"$error":"#N/A"},{"$error":"#N/A"},{"$error":"#N/A"},{"$error":"#N/A"},{"$error":"#N/A"},{"$error":"#N/A"}]
["Gippsland Plain","GipP","Brackish Wetland","Gippsland PlainBrackish Wetland","GipP0656",0,0,0,null,null,null,null,null,null,null,null,null,null,null,null,null,1,5,4,20,2,5,1,15,1,10,2,5,3,15,null,null,null,null,null,null,null,null,null,null,1,5,null,null,null,null,"Episodic",5,8,null,7,null,10,0,1.36,1.36,656,"En","Endangered",6,0,0,"GipP0656","wetlands","Non-woody wetland vegetation"]
["Gippsland Plain","GipP","Calcareous Swale Grassland","Gippsland PlainCalcareous Swale Grassland","GipP0309",0,0,0,null,null,null,null,null,null,null,3,30,1,1,1,1,1,1,2,5,2,5,2,5,null,null,4,10,1,20,null,null,null,null,null,null,null,null,null,null,2,5,0,20,null,null,"Continuous",0,11,4,5,31,10,0,1.36,1.36,309,"Vu","Vulnerable",5,0,0,"GipP0309","grasslands","Other grassland vegetation"]
["Gippsland Plain","GipP","Calcareous Wet Herbland","Gippsland PlainCalcareous Wet Herbland","GipP0591",null,0,0,null,null,null,null,null,null,null,null,null,null,null,null,null,null,null,null,null,null,null,null,null,null,null,null,null,null,null,null,null,null,null,null,null,null,null,null,null,null,null,null,null,null,null,null,0,0,null,null,null,0,0,0,{"$error":"#N/A"},{"$error":"#N/A"},{"$error":"#N/A"},{"$error":"#N/A"},{"$error":"#N/A"},{"$error":"#N/A"},{"$error":"#N/A"},{"$error":"#N/A"},{"$error":"#N/A"},{"$error":"#N/A"}]
["Gippsland Plain","GipP","Clay Heathland","Gippsland PlainClay Heathland","GipP0007",0,0,0,null,null,null,null,null,null,null,6,40,7,10,2,1,2,1,8,10,2,1,3,5,null,null,4,5,4,5,null,null,null,null,2,1,null,null,null,null,null,null,0,10,"0","10","Episodic",30,12,13,12,50,20,0,1.36,1.36,7,"D","Depleted",4,0,0,"GipP0007","heathlands","Woody vegetation"]
["Gippsland Plain","GipP","Coast Banksia Woodland","Gippsland PlainCoast Banksia Woodland","GipP0002",70,10,15,15,0,5,null,null,null,null,3,40,1,1,null,null,2,1,3,15,2,10,1,1,null,null,1,5,1,10,null,null,null,null,1,10,null,null,null,null,2,10,0,20,null,null,"Episodic",30,12,4,7,41,40,100,1,1,2,"Vu","Vulnerable",1,0,0,"GipP0002","Forest/Woodland","Woody vegetation"]
["Gippsland Plain","GipP","Coastal Alkaline Scrub","Gippsland PlainCoastal Alkaline Scrub","GipP0858",0,0,0,null,null,null,null,null,null,null,4,30,2,5,null,null,1,1,5,10,2,5,1,5,null,null,4,10,2,5,null,null,null,null,null,null,null,null,null,null,2,1,0,20,null,null,"Continuous",0,10,6,8,35,40,50,1.1499999999999999,1.1499999999999999,858,"Vu","Vulnerable",2,0,0,"GipP0858","scrubs/shrublands/mallee with logs","Woody vegetation"]
["Gippsland Plain","GipP","Coastal Dune Grassland","Gippsland PlainCoastal Dune Grassland","GipP0879",0,0,0,null,null,null,null,null,null,null,1,5,1,5,1,1,2,5,4,5,3,10,null,null,null,null,3,10,2,25,null,null,null,null,null,null,null,null,null,null,1,1,null,null,null,null,"Continuous",0,9,2,9,10,10,0,1.36,1.36,879,"D","Depleted",5,"y",0,"GipP0879","grasslands","Other grassland vegetation"]
["Gippsland Plain","GipP","Coastal Dune Scrub","Gippsland PlainCoastal Dune Scrub","GipP0160",0,0,0,null,null,null,null,null,null,null,6,50,null,null,null,null,1,1,3,10,1,1,2,5,null,null,6,15,1,1,null,null,null,null,null,null,null,null,null,null,3,5,0,10,null,null,"Episodic",30,9,6,5,50,40,0,1.36,1.36,160,"D","Depleted",4,0,0,"GipP0160","heathlands","Woody vegetation"]
["Gippsland Plain","GipP","Coastal Headland Scrub","Gippsland PlainCoastal Headland Scrub","GipP0161",0,0,0,null,null,null,null,null,null,null,7,50,2,5,null,null,2,1,4,5,2,5,1,1,null,null,4,10,2,5,null,null,null,null,null,null,null,null,null,null,2,5,0,10,null,null,"Continuous",0,10,9,8,55,40,0,1.36,1.36,161,"D","Depleted",4,0,0,"GipP0161","heathlands","Woody vegetation"]
["Gippsland Plain","GipP","Coastal Lagoon Wetland","Gippsland PlainCoastal Lagoon Wetland","GipP0011",0,0,0,null,null,null,null,null,null,null,4,15,2,1,null,null,1,1,2,5,1,1,1,5,2,15,1,5,2,5,null,null,null,null,1,5,null,null,null,null,1,1,0,10,null,null,"Continuous",0,12,6,4,16,20,0,1.36,1.36,11,"Vu","Vulnerable",6,0,0,"GipP0011","wetlands","Non-woody wetland vegetation"]
["Gippsland Plain","GipP","Coastal Saltmarsh","Gippsland PlainCoastal Saltmarsh","GipP0009",0,0,0,null,null,null,null,null,null,null,2,20,1,1,null,null,null,null,3,20,2,15,null,null,1,1,1,5,2,10,null,null,null,null,null,null,null,null,null,null,null,null,null,null,"0","10","Continuous",0,8,3,5,21,10,0,1.36,1.36,9,"LC","Least Concern",5,"y",0,"GipP0009","grasslands","Other grassland vegetation"]
["Gippsland Plain","GipP","Coastal Tussock Grassland",{"$f":"CONCATENATE(A259,C259)","v":"Gippsland PlainCoastal Tussock Grassland"},"GipP0163",0,0,0,null,null,null,null,null,null,null,3,20,1,5,1,1,2,5,5,10,3,5,3,10,null,null,4,25,2,5,null,null,null,null,null,null,null,null,null,null,null,null,0,10,"0","10","Continuous",0,11,4,10,25,20,0,1.36,1.36,163,"Vu","Vulnerable",5,0,0,"GipP0163","grasslands","Other grassland vegetation"]
["Gippsland Plain","GipP","Creekline Grassy Woodland","Gippsland PlainCreekline Grassy Woodland","GipP0068",80,15,15,15,0,5,2,10,null,null,2,5,2,1,null,null,2,5,8,15,1,1,3,15,null,null,12,20,3,15,null,null,null,null,null,null,null,null,null,null,null,null,0,10,null,null,"Continuous",0,11,6,11,16,40,200,1,1,68,"En","Endangered",1,0,0,"GipP0068","Forest/Woodland","Woody vegetation"]
["Gippsland Plain","GipP","Creekline Herb-rich Woodland","Gippsland PlainCreekline Herb-rich Woodland","GipP0164",70,10,15,20,0,5,2,10,null,null,5,15,null,null,null,null,2,1,5,5,1,1,3,15,1,5,2,5,2,10,null,null,null,null,2,20,null,null,null,null,1,0,0,20,null,null,"Continuous",0,13,7,8,25,20,100,1,1,164,"En","Endangered",1,0,0,"GipP0164","Forest/Woodland","Woody vegetation"]
["Gippsland Plain","GipP","Damp Forest","Gippsland PlainDamp Forest","GipP0029",90,20,30,40,0,5,3,20,null,null,9,25,2,5,1,1,2,1,6,10,1,1,3,5,1,5,3,5,1,1,null,null,null,null,3,20,"1","5",null,null,4,10,0,20,null,null,"Continuous",0,16,14,9,50,50,300,1,1,29,"En","Endangered",1,0,0,"GipP0029","Forest/Woodland","Woody vegetation"]
["Gippsland Plain","GipP","Damp Heathland","Gippsland PlainDamp Heathland","GipP0710",0,0,0,null,null,null,null,null,null,null,5,50,5,10,1,1,null,null,4,10,3,10,2,5,1,1,4,5,2,10,null,null,null,null,null,null,null,null,null,null,3,5,0,20,null,null,"Episodic",30,11,10,7,60,20,0,1.36,1.36,710,"Ra","Rare",4,0,0,"GipP0710","heathlands","Woody vegetation"]
["Gippsland Plain","GipP","Damp Heathy Woodland","Gippsland PlainDamp Heathy Woodland","GipP0793",60,10,10,15,0,5,null,null,null,null,5,30,4,5,2,1,null,null,3,5,3,20,2,5,null,null,3,10,1,5,null,null,null,null,1,5,null,null,null,null,null,null,0,20,"0","10","Episodic",30,12,9,6,35,20,100,1,1,793,"Vu","Vulnerable",1,0,0,"GipP0793","Forest/Woodland","Woody vegetation"]
["Gippsland Plain","GipP","Damp Sands Herb-rich Woodland","Gippsland PlainDamp Sands Herb-rich Woodland","GipP0003",70,15,15,15,0,5,1,5,null,null,5,25,3,5,1,1,2,5,8,15,5,10,2,10,1,1,4,10,2,10,null,null,null,null,1,15,null,null,null,null,null,null,0,10,null,null,"Continuous",0,14,9,15,35,40,150,1,1,3,"Vu","Vulnerable",1,0,0,"GipP0003","Forest/Woodland","Woody vegetation"]
["Gippsland Plain","GipP","Deep Freshwater Marsh","Gippsland PlainDeep Freshwater Marsh","GipP0681",null,null,0,null,null,null,null,null,null,null,null,null,null,null,null,null,null,null,null,null,null,null,null,null,null,null,null,null,null,null,null,null,null,null,null,null,null,null,null,null,null,null,null,null,null,null,null,5,0,null,null,null,null,0,1.36,1.36,681,"Vu","Vulnerable",6,0,0,"GipP0681","wetlands","Non-woody wetland vegetation"]
["Gippsland Plain","GipP","Dry Rainforest","Gippsland PlainDry Rainforest","GipP0034",60,10,15,50,0,5,3,20,null,null,9,20,null,null,null,null,5,5,12,15,5,5,2,5,null,null,3,5,3,5,null,null,null,null,5,10,null,null,"2","1",6,10,0,20,null,null,"Continuous",0,13,12,22,40,50,100,1,1,34,"En","Endangered",1,0,0,"GipP0034","Forest/Woodland","Woody vegetation"]
["Gippsland Plain","GipP","Dry Valley Forest","Gippsland PlainDry Valley Forest","GipP0169",70,20,20,30,0,5,2,10,null,null,4,30,null,null,null,null,null,null,9,20,4,10,1,5,null,null,1,5,2,10,null,null,null,null,3,10,null,null,null,null,3,5,0,10,null,null,"Continuous",0,11,6,13,40,40,200,1,1,169,"En","Endangered",1,0,0,"GipP0169","Forest/Woodland","Woody vegetation"]
["Gippsland Plain","GipP","Escarpment Shrubland","Gippsland PlainEscarpment Shrubland","GipP0895",0,0,0,null,null,null,null,null,null,null,3,10,2,5,null,null,3,5,4,10,5,5,1,5,1,5,9,25,3,5,null,null,null,null,1,5,null,null,null,null,1,5,0,20,"0","10","Continuous",0,13,5,12,15,20,150,1.1499999999999999,1,895,"En","Endangered",1,0,0,"GipP0895","Forest/Woodland","Woody vegetation"]
["Gippsland Plain","GipP","Estuarine Flats Grassland","Gippsland PlainEstuarine Flats Grassland","GipP0914",0,0,0,null,null,null,null,null,null,null,2,5,1,5,null,null,1,1,3,15,4,15,2,15,null,null,2,20,3,15,null,null,null,null,null,null,null,null,null,null,null,null,null,null,null,null,"Continuous",0,8,3,8,10,10,0,1.36,1.36,914,"En","Endangered",6,0,0,"GipP0914","wetlands","Non-woody wetland vegetation"]
["Gippsland Plain","GipP","Estuarine Scrub","Gippsland PlainEstuarine Scrub","GipP0953",0,0,6,50,null,null,null,null,null,null,2,10,null,null,null,null,null,null,3,20,2,5,null,null,null,null,2,10,2,15,null,null,null,null,null,null,null,null,null,null,null,null,null,null,null,null,"Continuous",0,5,2,5,10,20,50,1.1499999999999999,{"$error":"#N/A"},{"$error":"#N/A"},{"$error":"#N/A"},{"$error":"#N/A"},{"$error":"#N/A"},{"$error":"#N/A"},{"$error":"#N/A"},{"$error":"#N/A"},{"$error":"#N/A"},{"$error":"#N/A"}]
["Gippsland Plain","GipP","Estuarine Wetland","Gippsland PlainEstuarine Wetland","GipP0010",0,0,0,null,null,null,null,null,null,null,1,10,2,5,null,null,2,5,6,20,2,10,2,10,1,5,2,5,3,20,null,null,null,null,null,null,null,null,null,null,null,null,null,null,null,null,"Episodic",5,9,3,10,15,10,0,1.36,1.36,953,"En","Endangered",6,0,0,"GipP0010","scrubs/shrublands/mallee without logs","Woody vegetation"]
["Gippsland Plain","GipP","Floodplain Reedbed","Gippsland PlainFloodplain Reedbed","GipP0863",0,0,0,null,null,null,null,null,null,null,1,5,null,null,null,null,2,10,2,5,2,5,null,null,2,30,1,5,null,null,null,null,null,null,null,null,null,null,null,null,1,1,null,null,null,null,"Episodic",5,7,1,6,5,10,0,1.36,1.36,863,"En","Endangered",6,0,0,"GipP0863","wetlands","Non-woody wetland vegetation"]
["Gippsland Plain","GipP","Floodplain Riparian Woodland","Gippsland PlainFloodplain Riparian Woodland","GipP0056",80,15,20,20,0,5,2,10,null,null,5,15,null,null,null,null,7,15,5,10,2,5,2,10,1,10,5,10,2,10,null,null,null,null,null,null,null,null,null,null,2,5,0,10,null,null,"Episodic",5,12,7,14,25,40,300,1,1,56,"En","Endangered",1,0,0,"GipP0056","Forest/Woodland","Woody vegetation"]
["Gippsland Plain","GipP","Forest Bog","Gippsland PlainForest Bog","GipP0723",null,0,0,null,null,null,null,null,null,null,null,null,null,null,null,null,null,null,null,null,null,null,null,null,null,null,null,null,null,null,null,null,null,null,null,null,null,null,null,null,null,null,null,null,null,null,null,0,0,null,null,null,0,0,0,{"$error":"#N/A"},{"$error":"#N/A"},{"$error":"#N/A"},{"$error":"#N/A"},{"$error":"#N/A"},{"$error":"#N/A"},{"$error":"#N/A"},{"$error":"#N/A"},{"$error":"#N/A"},{"$error":"#N/A"}]
["Gippsland Plain","GipP","Forest Creekline Sedge Swamp","Gippsland PlainForest Creekline Sedge Swamp","GipP0728",null,0,0,null,null,null,null,null,null,null,null,null,null,null,null,null,null,null,null,null,null,null,null,null,null,null,null,null,null,null,null,null,null,null,null,null,null,null,null,null,null,null,null,null,null,null,null,0,0,null,null,null,0,0,0,{"$error":"#N/A"},{"$error":"#N/A"},{"$error":"#N/A"},{"$error":"#N/A"},{"$error":"#N/A"},{"$error":"#N/A"},{"$error":"#N/A"},{"$error":"#N/A"},{"$error":"#N/A"},{"$error":"#N/A"}]
["Gippsland Plain","GipP","Gallery Rainforest","Gippsland PlainGallery Rainforest","GipP0135",70,20,20,50,0,5,4,20,null,null,12,30,2,5,1,1,1,1,6,10,2,1,4,15,1,1,4,5,2,5,null,null,null,null,6,20,"1","1","2","5",8,10,0,20,null,null,"Continuous",0,17,18,9,55,40,200,1,1,135,"En","Endangered",1,0,0,"GipP0135","Forest/Woodland","Woody vegetation"]
["Gippsland Plain","GipP","Granitic Hills Woodland","Gippsland PlainGranitic Hills Woodland","GipP0072",60,15,10,10,0,5,2,10,null,null,5,10,5,5,null,null,1,5,5,5,5,5,2,5,null,null,3,15,2,10,null,null,null,null,2,5,null,null,null,null,1,1,0,10,null,null,"Continuous",0,13,12,11,25,40,150,0,{"$error":"#N/A"},{"$error":"#N/A"},{"$error":"#N/A"},{"$error":"#N/A"},{"$error":"#N/A"},{"$error":"#N/A"},{"$error":"#N/A"},{"$error":"#N/A"},{"$error":"#N/A"},{"$error":"#N/A"}]
["Gippsland Plain","GipP","Grassy Dry Forest","Gippsland PlainGrassy Dry Forest","GipP0022",60,20,20,30,3,5,2,10,null,null,9,20,4,5,2,1,2,5,8,15,2,5,3,5,null,null,11,30,2,10,null,null,null,null,null,null,null,null,null,null,3,5,0,10,"0","10","Continuous",0,14,15,12,35,20,200,1,1,22,"LC","Least Concern",1,0,0,"GipP0022","Forest/Woodland","Woody vegetation"]
["Gippsland Plain","GipP","Grassy Forest","Gippsland PlainGrassy Forest","GipP0128",70,20,20,20,0,5,2,10,null,null,4,10,2,1,2,5,1,1,5,10,3,5,2,5,1,1,3,45,null,null,null,null,null,null,1,1,null,null,null,null,3,5,0,10,null,null,"Continuous",0,14,8,9,21,40,200,1,1,128,"En","Endangered",1,0,0,"GipP0128","Forest/Woodland","Woody vegetation"]
["Gippsland Plain","GipP","Grassy Woodland","Gippsland PlainGrassy Woodland","GipP0175",70,15,15,15,0,5,2,10,null,null,6,15,2,5,2,1,2,5,8,10,3,5,2,10,1,10,6,20,2,10,null,null,null,null,1,5,null,null,null,null,2,5,0,10,null,null,"Continuous",0,15,10,13,30,20,150,1,1,175,"En","Endangered",1,0,0,"GipP0175","Forest/Woodland","Woody vegetation"]
["Gippsland Plain","GipP","Gully Woodland","Gippsland PlainGully Woodland","GipP0902",70,10,20,20,0,5,4,15,null,null,6,15,1,1,null,null,2,1,6,10,2,5,2,5,1,5,8,20,2,10,null,null,null,null,3,10,null,null,null,null,4,10,0,20,null,null,"Continuous",0,14,11,10,31,20,100,1,1,902,"En","Endangered",1,0,0,"GipP0902","Forest/Woodland","Woody vegetation"]
["Gippsland Plain","GipP","Heathy Woodland","Gippsland PlainHeathy Woodland","GipP0048",50,15,10,10,0,5,null,null,null,null,5,30,5,20,null,null,null,null,2,5,2,5,1,5,1,1,1,5,2,5,null,null,null,null,1,5,null,null,null,null,null,null,0,10,"0","10","Episodic",20,12,10,4,50,40,150,1,1,48,"LC","Least Concern",1,0,0,"GipP0048","Forest/Woodland","Woody vegetation"]
["Gippsland Plain","GipP","Herb-rich Foothill Forest","Gippsland PlainHerb-rich Foothill Forest","GipP0023",70,20,25,40,0,5,2,10,null,null,5,10,2,5,1,1,2,1,7,10,2,1,1,5,2,5,3,20,1,1,null,null,null,null,2,25,null,null,null,null,2,5,0,20,null,null,"Continuous",0,15,9,11,25,40,200,1,1,23,"Vu","Vulnerable",1,0,0,"GipP0023","Forest/Woodland","Woody vegetation"]
["Gippsland Plain","GipP","LaTrobe Valley Plains Grassland","Gippsland PlainLaTrobe Valley Plains Grassland","GipP0132_61",0,0,0,null,null,null,null,null,null,null,null,null,1,1,null,null,2,5,12,30,3,5,1,1,null,null,10,40,2,5,null,null,null,null,null,null,null,null,null,null,null,null,0,10,null,null,"Episodic",5,8,1,17,1,10,0,1.36,{"$error":"#N/A"},{"$error":"#N/A"},{"$error":"#N/A"},{"$error":"#N/A"},{"$error":"#N/A"},{"$error":"#N/A"},{"$error":"#N/A"},{"$error":"#N/A"},{"$error":"#N/A"},{"$error":"#N/A"}]
["Gippsland Plain","GipP","Limestone Box Forest","Gippsland PlainLimestone Box Forest","GipP0015",70,20,20,25,0,5,3,20,null,null,2,5,null,null,null,null,2,1,4,10,2,5,null,null,null,null,null,null,2,5,null,null,null,null,3,15,null,null,null,null,4,10,0,10,null,null,"Continuous",0,10,5,8,25,20,150,1,1,15,"Vu","Vulnerable",1,0,0,"GipP0015","Forest/Woodland","Woody vegetation"]
["Gippsland Plain","GipP","Limestone Pomaderris Shrubland","Gippsland PlainLimestone Pomaderris Shrubland","GipP0133",0,0,0,null,null,null,null,null,null,null,9,45,2,1,null,null,5,5,10,15,3,5,2,1,null,null,7,30,null,null,null,null,null,null,null,null,null,null,null,null,3,1,0,10,"0","10","Continuous",0,10,11,18,46,20,0,1.25,1,133,"En","Endangered",1,0,0,"GipP0133","Forest/Woodland","Woody vegetation"]
["Gippsland Plain","GipP","Lowland Forest","Gippsland PlainLowland Forest","GipP0016",70,20,20,30,0,5,2,10,null,null,7,30,5,10,2,5,1,1,7,10,7,5,2,15,1,5,7,15,1,1,null,null,null,null,2,15,null,null,null,null,3,1,0,10,null,null,"Continuous",0,15,14,15,50,40,200,1,1,16,"Vu","Vulnerable",1,0,0,"GipP0016","Forest/Woodland","Woody vegetation"]
["Gippsland Plain","GipP","Lowland Herb-rich Forest","Gippsland PlainLowland Herb-rich Forest","GipP0877",70,20,20,30,0,5,3,10,null,null,4,20,1,1,1,5,2,5,13,30,4,5,1,15,null,null,5,5,2,10,null,null,null,null,null,null,null,null,null,null,null,null,0,10,null,null,"Continuous",0,12,8,19,31,40,200,1,1,877,"D","Depleted",1,0,0,"GipP0877","Forest/Woodland","Woody vegetation"]
["Gippsland Plain","GipP","Mangrove Shrubland","Gippsland PlainMangrove Shrubland","GipP0140",0,0,0,null,null,null,null,null,null,null,1,40,null,null,null,null,null,null,null,null,null,null,null,null,null,null,null,null,1,5,null,null,null,null,null,null,null,null,null,null,null,null,null,null,null,null,"Continuous",0,2,1,null,40,0,0,1.36,1.36,140,"LC","Least Concern",4,0,0,"GipP0140","heathlands","Woody vegetation"]
["Gippsland Plain","GipP","Plains Grassland","Gippsland PlainPlains Grassland","GipP0132",null,null,null,null,null,null,null,null,null,null,null,null,null,null,null,null,null,null,null,null,null,null,null,null,null,null,null,null,null,null,null,null,null,null,null,null,null,null,null,null,null,null,null,null,null,null,null,null,0,null,null,null,null,0,0,1.36,"132_61","En","Endangered",5,"y",0,"GipP0132","grasslands","High rainfall volcanic plains or Gippsland plains grassland vegetation"]
["Gippsland Plain","GipP","Plains Grassy Forest","Gippsland PlainPlains Grassy Forest","GipP0151",70,20,20,30,0,5,3,15,null,null,6,20,3,5,2,5,3,5,6,10,2,5,2,10,1,5,4,15,2,1,null,null,null,null,2,10,null,null,null,null,null,null,0,10,null,null,"Continuous",0,14,12,11,40,20,200,1,1,151,"Vu","Vulnerable",1,0,0,"GipP0151","Forest/Woodland","Woody vegetation"]
["Gippsland Plain","GipP","Plains Grassy Wetland","Gippsland PlainPlains Grassy Wetland","GipP0125",0,0,0,null,null,null,null,null,null,null,null,null,null,null,null,null,3,10,10,20,2,10,2,5,2,10,10,20,4,10,null,null,null,null,null,null,null,null,null,null,null,null,0,10,null,null,"Episodic",5,8,null,15,null,10,50,1.36,1.36,125,"En","Endangered",6,"y",0,"GipP0125","wetlands","Non-woody wetland vegetation"]
["Gippsland Plain","GipP","Plains Grassy Woodland","Gippsland PlainPlains Grassy Woodland","GipP0055",80,10,15,20,0,5,1,5,null,null,2,10,1,1,1,1,1,5,10,20,3,5,2,5,1,10,9,35,2,10,null,null,null,null,null,null,null,null,null,null,null,null,0,10,null,null,"Continuous",0,13,4,14,16,10,100,1,1,55,"En","Endangered",1,0,0,"GipP0055","Forest/Woodland","Woody vegetation"]
["Gippsland Plain","GipP","Plains Swampy Woodland","Gippsland PlainPlains Swampy Woodland","GipP0651",80,10,15,10,0,5,1,5,null,null,3,15,null,null,null,null,3,5,8,20,4,5,3,30,1,1,7,10,2,5,null,null,null,null,null,null,null,null,null,null,null,null,0,20,null,null,"Continuous",0,11,4,15,20,10,100,1,1,651,"En","Endangered",1,0,0,"GipP0651","Forest/Woodland","Woody vegetation"]
["Gippsland Plain","GipP","Riparian Forest","Gippsland PlainRiparian Forest","GipP0018",80,20,30,40,0,5,2,15,null,null,8,25,1,5,null,null,3,5,10,10,2,5,3,15,1,5,4,10,3,10,null,null,null,null,3,15,"1","1",null,null,2,5,0,20,null,null,"Continuous",0,15,11,15,45,50,300,1,1,18,"Vu","Vulnerable",1,0,0,"GipP0018","Forest/Woodland","Woody vegetation"]
["Gippsland Plain","GipP","Riparian Scrub","Gippsland PlainRiparian Scrub","GipP0191",0,0,0,null,null,null,null,null,null,null,3,10,1,1,null,null,null,null,1,1,1,1,1,10,1,5,1,1,3,15,null,null,null,null,1,5,null,null,null,null,2,15,0,20,null,null,"Continuous",0,11,4,2,11,40,0,1.25,1.25,191,"Vu","Vulnerable",3,0,0,"GipP0191","scrubs/shrublands/mallee without logs","Woody vegetation"]
["Gippsland Plain","GipP","Riparian Shrubland","Gippsland PlainRiparian Shrubland","GipP0019",0,0,0,null,null,null,null,null,null,null,9,25,null,null,null,null,4,5,9,15,2,5,3,5,null,null,3,10,2,1,null,null,null,null,4,10,null,null,null,null,2,5,0,10,null,null,"Episodic",5,10,9,15,25,20,100,1.25,1.25,19,"En","Endangered",3,0,0,"GipP0019","scrubs/shrublands/mallee without logs","Woody vegetation"]
["Gippsland Plain","GipP","Riparian Thicket","Gippsland PlainRiparian Thicket","GipP0059",0,0,6,50,null,null,null,null,null,null,8,30,3,5,1,1,2,5,5,10,1,5,3,10,2,5,2,5,3,15,null,null,null,null,3,10,"1","5",null,null,2,5,0,20,null,null,"Continuous",0,14,11,8,35,40,0,1.25,1.36,59,"Vu","Vulnerable",4,0,0,"GipP0059","heathlands","Woody vegetation"]
["Gippsland Plain","GipP","Riparian Woodland","Gippsland PlainRiparian Woodland","GipP0641",80,15,20,20,0,5,2,10,null,null,4,10,1,5,null,null,4,15,5,10,1,5,3,15,1,5,4,20,2,5,null,null,null,null,null,null,null,null,null,null,1,5,0,10,null,null,"Continuous",0,13,7,10,25,30,200,1,1,641,"En","Endangered",1,0,0,"GipP0641","Forest/Woodland","Woody vegetation"]
["Gippsland Plain","GipP","Riverine Escarpment Scrub","Gippsland PlainRiverine Escarpment Scrub","GipP0082",0,0,0,null,0,5,null,null,null,null,10,20,null,null,null,null,4,5,13,20,6,10,2,5,null,null,6,10,2,10,null,null,null,null,7,20,null,null,null,null,4,5,0,10,null,null,"Continuous",0,11,10,23,20,40,50,1.25,1.25,82,"En","Endangered",3,0,0,"GipP0082","scrubs/shrublands/mallee without logs","Woody vegetation"]
["Gippsland Plain","GipP","Rushy Riverine Swamp","Gippsland PlainRushy Riverine Swamp","GipP0804",null,0,0,null,null,null,null,null,null,null,null,null,null,null,null,null,null,null,null,null,null,null,null,null,null,null,null,null,null,null,null,null,null,null,null,null,null,null,null,null,null,null,null,null,null,null,null,0,0,null,null,null,0,0,0,{"$error":"#N/A"},{"$error":"#N/A"},{"$error":"#N/A"},{"$error":"#N/A"},{"$error":"#N/A"},{"$error":"#N/A"},{"$error":"#N/A"},{"$error":"#N/A"},{"$error":"#N/A"},{"$error":"#N/A"}]
["Gippsland Plain","GipP","Saline Aquatic Meadow","Gippsland PlainSaline Aquatic Meadow","GipP0842",null,0,0,null,null,null,null,null,null,null,null,null,null,null,null,null,null,null,null,null,null,null,null,null,null,null,null,null,null,null,null,null,null,null,null,null,null,null,null,null,null,null,null,null,null,null,null,0,0,null,null,null,0,0,0,{"$error":"#N/A"},{"$error":"#N/A"},{"$error":"#N/A"},{"$error":"#N/A"},{"$error":"#N/A"},{"$error":"#N/A"},{"$error":"#N/A"},{"$error":"#N/A"},{"$error":"#N/A"},{"$error":"#N/A"}]
["Gippsland Plain","GipP","Sand Forest","Gippsland PlainSand Forest","GipP0134",70,15,20,30,3,5,1,5,null,null,3,5,1,5,2,5,null,null,2,5,null,null,1,1,null,null,7,15,2,1,null,null,null,null,1,50,null,null,null,null,null,null,0,10,null,null,"Continuous",0,11,5,2,15,40,150,1,{"$error":"#N/A"},{"$error":"#N/A"},{"$error":"#N/A"},{"$error":"#N/A"},{"$error":"#N/A"},{"$error":"#N/A"},{"$error":"#N/A"},{"$error":"#N/A"},{"$error":"#N/A"},{"$error":"#N/A"}]
["Gippsland Plain","GipP","Sand Heathland","Gippsland PlainSand Heathland","GipP0006",0,0,0,null,null,null,null,null,null,null,7,55,4,10,null,null,null,null,3,5,2,5,1,5,1,1,2,5,2,15,null,null,null,null,1,1,null,null,null,null,null,null,0,10,"0","10","Episodic",30,11,11,5,65,20,0,1.36,1.36,6,"Ra","Rare",4,0,0,"GipP0006","heathlands","Woody vegetation"]
["Gippsland Plain","GipP","Sandy Flood Scrub","Gippsland PlainSandy Flood Scrub","GipP0141",0,0,0,null,null,null,null,null,null,null,3,15,1,1,null,null,null,null,2,5,1,1,3,15,1,10,1,1,2,5,null,null,null,null,1,5,null,null,null,null,null,null,0,20,null,null,"Episodic",5,10,4,3,16,10,50,1.25,1.25,141,"En","Endangered",3,0,0,"GipP0141","scrubs/shrublands/mallee without logs","Woody vegetation"]
["Gippsland Plain","GipP","Sandy Stream Woodland","Gippsland PlainSandy Stream Woodland","GipP0674",80,10,15,10,0,5,2,15,null,null,5,15,null,null,null,null,null,null,6,10,3,5,2,10,2,20,10,30,3,5,null,null,null,null,2,5,"1","1",null,null,null,null,0,10,null,null,"Continuous",0,12,7,9,30,40,200,1,{"$error":"#N/A"},{"$error":"#N/A"},{"$error":"#N/A"},{"$error":"#N/A"},{"$error":"#N/A"},{"$error":"#N/A"},{"$error":"#N/A"},{"$error":"#N/A"},{"$error":"#N/A"},{"$error":"#N/A"}]
["Gippsland Plain","GipP","Seasonally Inundated Shrubby Woodland","Gippsland PlainSeasonally Inundated Shrubby Woodland","GipP0195",null,null,0,null,null,null,null,null,null,null,null,null,null,null,null,null,null,null,null,null,null,null,null,null,null,null,null,null,null,null,null,null,null,null,null,null,null,null,null,null,null,null,null,null,null,null,null,0,0,null,null,null,null,0,1,1,195,"En","Endangered",1,0,0,"GipP0195","Forest/Woodland","Woody vegetation"]
["Gippsland Plain","GipP","Sedge Wetland","Gippsland PlainSedge Wetland","GipP0136",0,0,0,null,null,null,null,null,null,null,1,5,null,null,null,null,1,5,4,10,null,null,1,15,2,30,1,1,2,10,null,null,null,null,null,null,null,null,null,null,null,null,0,10,null,null,"Episodic",5,8,1,5,5,10,0,1.36,1.36,136,"Vu","Vulnerable",6,0,0,"GipP0136","wetlands","Non-woody wetland vegetation"]
["Gippsland Plain","GipP","Sedgy Swamp Woodland","Gippsland PlainSedgy Swamp Woodland","GipP0707",80,10,15,10,0,5,null,null,null,null,2,5,null,null,null,null,3,5,6,10,5,5,1,10,2,40,4,5,2,1,null,null,null,null,null,null,null,null,null,null,null,null,0,5,null,null,"Continuous",0,10,2,14,5,20,100,1,1,707,"En","Endangered",1,0,0,"GipP0707","Forest/Woodland","Woody vegetation"]
["Gippsland Plain","GipP","Shrubby Damp Forest","Gippsland PlainShrubby Damp Forest","GipP0316",90,20,30,40,0,5,4,20,null,null,8,20,2,10,1,1,4,5,8,15,2,5,2,5,1,1,3,10,1,5,null,null,null,null,2,15,"1","1",null,null,2,5,0,20,null,null,"Continuous",0,16,14,14,50,50,300,1,1,316,"LC","Least Concern",1,0,0,"GipP0316","Forest/Woodland","Woody vegetation"]
["Gippsland Plain","GipP","Shrubby Dry Forest","Gippsland PlainShrubby Dry Forest","GipP0021",60,20,25,30,0,5,1,5,null,null,11,40,9,15,1,1,null,null,4,5,null,null,null,null,null,null,4,5,1,1,null,null,null,null,1,1,null,null,null,null,null,null,0,10,null,null,"Episodic",20,10,21,4,60,20,200,1,1,21,"LC","Least Concern",1,0,0,"GipP0021","Forest/Woodland","Woody vegetation"]
["Gippsland Plain","GipP","Shrubby Foothill Forest","Gippsland PlainShrubby Foothill Forest","GipP0045",70,20,25,40,0,5,1,5,null,null,8,35,3,10,1,5,null,null,3,5,1,1,2,5,1,10,2,5,null,null,null,null,null,null,2,10,null,null,null,null,1,1,0,10,null,null,"Episodic",30,13,12,4,50,40,200,1,1,45,"En","Endangered",1,0,0,"GipP0045","Forest/Woodland","Woody vegetation"]
["Gippsland Plain","GipP","Shrubby Gully Forest","Gippsland PlainShrubby Gully Forest","GipP0938",70,20,20,30,0,5,2,10,null,null,5,20,null,null,null,null,null,null,5,10,3,5,3,15,2,10,3,10,1,5,null,null,null,null,4,20,null,null,null,null,2,1,0,20,null,null,"Continuous",0,12,7,8,30,20,150,1,{"$error":"#N/A"},{"$error":"#N/A"},{"$error":"#N/A"},{"$error":"#N/A"},{"$error":"#N/A"},{"$error":"#N/A"},{"$error":"#N/A"},{"$error":"#N/A"},{"$error":"#N/A"},{"$error":"#N/A"}]
["Gippsland Plain","GipP","South Gippsland Plains Grassland","Gippsland PlainSouth Gippsland Plains Grassland","GipP0132_62",0,0,0,null,null,null,null,null,null,null,null,null,null,null,null,null,5,5,12,5,6,5,3,10,null,null,5,50,2,10,null,null,null,null,null,null,null,null,null,null,null,null,0,10,null,null,"Episodic",5,7,null,23,null,10,0,1.36,{"$error":"#N/A"},{"$error":"#N/A"},{"$error":"#N/A"},{"$error":"#N/A"},{"$error":"#N/A"},{"$error":"#N/A"},{"$error":"#N/A"},{"$error":"#N/A"},{"$error":"#N/A"},{"$error":"#N/A"}]
["Gippsland Plain","GipP","Spray-zone Coastal Shrubland","Gippsland PlainSpray-zone Coastal Shrubland","GipP0876",0,0,0,null,null,null,null,null,null,null,2,5,4,30,null,null,null,null,2,5,4,5,2,5,null,null,4,10,1,1,null,null,null,null,null,null,null,null,null,null,1,5,null,null,"0","10","Continuous",0,9,6,6,35,10,0,1.36,{"$error":"#N/A"},{"$error":"#N/A"},{"$error":"#N/A"},{"$error":"#N/A"},{"$error":"#N/A"},{"$error":"#N/A"},{"$error":"#N/A"},{"$error":"#N/A"},{"$error":"#N/A"},{"$error":"#N/A"}]
["Gippsland Plain","GipP","Swamp Scrub","Gippsland PlainSwamp Scrub","GipP0053",0,0,8,50,0,null,null,null,null,null,2,10,2,1,null,null,2,5,3,15,2,5,2,10,3,10,2,5,2,15,null,null,null,null,1,5,null,null,null,null,1,1,0,20,null,null,"Continuous",0,12,4,7,11,40,0,1.25,1.1499999999999999,"53_61","En","Endangered",3,0,0,"GipP0053","scrubs/shrublands/mallee without logs","Woody vegetation"]
["Gippsland Plain","GipP","Swampy Riparian Woodland","Gippsland PlainSwampy Riparian Woodland","GipP0083",70,15,15,20,0,5,4,30,null,null,5,20,1,1,1,1,3,5,7,10,3,5,3,15,1,5,5,10,2,10,null,null,null,null,2,10,null,null,null,null,2,5,0,10,null,null,"Continuous",0,15,10,13,51,20,200,1,1,83,"En","Endangered",1,0,0,"GipP0083","Forest/Woodland","Woody vegetation"]
["Gippsland Plain","GipP","Swampy Woodland","Gippsland PlainSwampy Woodland","GipP0937",70,15,15,15,0,5,1,5,null,null,2,20,null,null,null,null,null,null,5,10,3,10,4,30,2,10,4,10,null,null,null,null,null,null,null,null,null,null,null,null,null,null,0,20,null,null,"Continuous",0,9,3,8,25,20,150,1,1,937,"En","Endangered",1,0,0,"GipP0937","Forest/Woodland","Woody vegetation"]
["Gippsland Plain","GipP","Tall Marsh","Gippsland PlainTall Marsh","GipP0821",0,0,0,null,null,null,null,null,null,null,null,null,null,null,null,null,3,10,2,5,6,10,1,5,2,40,null,null,1,1,null,null,null,null,null,null,null,null,null,null,null,null,null,null,null,null,"Episodic",5,6,null,11,null,10,0,1.36,{"$error":"#N/A"},{"$error":"#N/A"},{"$error":"#N/A"},{"$error":"#N/A"},{"$error":"#N/A"},{"$error":"#N/A"},{"$error":"#N/A"},{"$error":"#N/A"},{"$error":"#N/A"},{"$error":"#N/A"}]
["Gippsland Plain","GipP","Treed Escarpment Shrubland","Gippsland PlainTreed Escarpment Shrubland","GipP0895_61",70,15,0,0,0,5,3,10,null,null,3,10,2,5,null,null,3,5,4,10,5,5,1,5,1,5,9,25,3,5,null,null,null,null,1,5,null,null,null,null,1,5,0,20,"0","10","Continuous",0,15,8,12,25,20,150,1,{"$error":"#N/A"},{"$error":"#N/A"},{"$error":"#N/A"},{"$error":"#N/A"},{"$error":"#N/A"},{"$error":"#N/A"},{"$error":"#N/A"},{"$error":"#N/A"},{"$error":"#N/A"},{"$error":"#N/A"}]
["Gippsland Plain","GipP","Treed Limestone Pomaderris Shrubland","Gippsland PlainTreed Limestone Pomaderris Shrubland","GipP0133_61",60,10,10,10,0,5,2,10,null,null,9,45,2,1,null,null,5,5,10,15,3,5,2,1,null,null,7,30,null,null,null,null,null,null,null,null,null,null,null,null,3,1,0,10,"0","10","Continuous",0,12,13,18,56,20,50,1,{"$error":"#N/A"},{"$error":"#N/A"},{"$error":"#N/A"},{"$error":"#N/A"},{"$error":"#N/A"},{"$error":"#N/A"},{"$error":"#N/A"},{"$error":"#N/A"},{"$error":"#N/A"},{"$error":"#N/A"}]
["Gippsland Plain","GipP","Valley Grassy Forest",{"$f":"CONCATENATE(A323,C323)","v":"Gippsland PlainValley Grassy Forest"},"GipP0047",70,20,20,20,0,5,2,10,null,null,2,15,null,null,1,1,2,5,11,25,3,5,2,5,2,10,16,40,2,5,null,null,null,null,null,null,null,null,null,null,1,1,0,20,null,null,"Continuous",0,13,4,16,25,20,200,1,1,47,"Vu","Vulnerable",1,0,0,"GipP0047","Forest/Woodland","Woody vegetation"]
["Gippsland Plain","GipP","Valley Heathy Forest","Gippsland PlainValley Heathy Forest","GipP0127",70,20,15,30,0,5,2,10,null,null,7,15,5,5,2,1,null,null,6,10,3,5,2,5,2,20,7,15,1,1,null,null,null,null,1,1,null,null,null,null,3,5,0,10,null,null,"Episodic",30,14,14,9,30,40,200,1,1,127,"En","Endangered",1,0,0,"GipP0127","Forest/Woodland","Woody vegetation"]
["Gippsland Plain","GipP","Warm Temperate Rainforest","Gippsland PlainWarm Temperate Rainforest","GipP0032",70,20,20,50,0,5,3,30,null,null,2,10,null,null,null,null,2,5,3,5,1,5,1,1,null,null,1,1,2,5,null,null,null,null,4,25,null,null,"1","5",7,20,0,20,null,null,"Continuous",0,13,5,6,40,50,200,1,1,32,"En","Endangered",1,0,0,"GipP0032","Forest/Woodland","Woody vegetation"]
["Gippsland Plain","GipP","Wet Forest","Gippsland PlainWet Forest","GipP0030",90,20,30,40,0,5,3,20,null,null,6,15,null,null,null,null,1,1,6,10,2,1,2,5,1,1,3,15,1,10,null,null,null,null,4,15,"1","15",null,null,2,5,0,20,null,null,"Continuous",0,14,9,9,35,50,300,1,1,30,"D","Depleted",1,0,0,"GipP0030","Forest/Woodland","Woody vegetation"]
["Gippsland Plain","GipP","Wet Heathland","Gippsland PlainWet Heathland","GipP0008",0,0,0,null,null,null,null,null,null,null,6,40,3,5,1,1,null,null,3,5,2,5,1,5,2,10,2,5,5,20,null,null,null,null,1,1,null,null,null,null,null,null,0,20,null,null,"Episodic",30,11,9,5,45,20,0,1.36,1.36,8,"D","Depleted",4,0,0,"GipP0008","heathlands","Woody vegetation"]
["Gippsland Plain","GipP","Wet Swale Herbland","Gippsland PlainWet Swale Herbland","GipP0012",0,0,0,null,null,null,null,null,null,null,null,null,1,1,null,null,1,1,7,15,3,5,2,5,1,1,4,10,4,25,null,null,null,null,1,5,null,null,null,null,2,1,null,null,null,null,"Episodic",5,10,1,11,1,10,0,1.36,1.36,12,"Vu","Vulnerable",6,0,0,"GipP0012","wetlands","Non-woody wetland vegetation"]
["Gippsland Plain","GipP","Wetland Formation","Gippsland PlainWetland Formation","GipP0074",null,null,0,null,null,null,null,null,null,null,null,null,null,null,null,null,null,null,null,null,null,null,null,null,null,null,null,null,null,null,null,null,null,null,null,null,null,null,null,null,null,null,null,null,null,null,null,5,0,null,null,null,null,0,1.36,1.36,74,"En","Endangered",6,0,0,"GipP0074","wetlands","Non-woody wetland vegetation"]
["Glenelg Plain","GleP","Aquatic Herbland","Glenelg PlainAquatic Herbland","GleP0653",0,0,0,null,null,null,null,null,null,null,null,null,null,null,null,null,null,null,3,20,null,null,1,25,null,null,4,25,1,1,null,null,null,null,null,null,null,null,null,null,null,null,null,null,null,null,"Episodic",5,4,null,3,null,10,0,1.36,1.36,653,"En","Endangered",6,0,0,"GleP0653","wetlands","Non-woody wetland vegetation"]
["Glenelg Plain","GleP","Aquatic Sedgeland","Glenelg PlainAquatic Sedgeland","GleP0308",null,0,0,null,null,null,null,null,null,null,null,null,null,null,null,null,null,null,null,null,null,null,null,null,null,null,null,null,null,null,null,null,null,null,null,null,null,null,null,null,null,null,null,null,null,null,null,0,0,null,null,null,0,0,0,{"$error":"#N/A"},{"$error":"#N/A"},{"$error":"#N/A"},{"$error":"#N/A"},{"$error":"#N/A"},{"$error":"#N/A"},{"$error":"#N/A"},{"$error":"#N/A"},{"$error":"#N/A"},{"$error":"#N/A"}]
["Glenelg Plain","GleP","Basalt Shrubby Woodland","Glenelg PlainBasalt Shrubby Woodland","GleP0642",null,null,0,null,null,null,null,null,null,null,null,null,null,null,null,null,null,null,null,null,null,null,null,null,null,null,null,null,null,null,null,null,null,null,null,null,null,null,null,null,null,null,null,null,null,null,null,0,0,null,null,null,null,0,1,1,642,"En","Endangered",1,0,0,"GleP0642","Forest/Woodland","Woody vegetation"]
["Glenelg Plain","GleP","Bird Colony Succulent Herbland","Glenelg PlainBird Colony Succulent Herbland","GleP0155",0,0,0,null,null,null,null,null,null,null,1,30,null,null,null,null,null,null,2,5,2,20,1,1,null,null,null,null,null,null,null,null,null,null,null,null,null,null,null,null,2,40,null,null,null,null,"Continuous",0,5,1,4,30,10,0,1.36,1.36,155,"Vu","Vulnerable",5,0,0,"GleP0155","grasslands","Other grassland vegetation"]
["Glenelg Plain","GleP","Brackish Sedgeland","Glenelg PlainBrackish Sedgeland","GleP0013",0,0,0,null,null,null,null,null,null,null,null,null,null,null,null,null,1,5,5,10,5,5,1,5,null,null,4,10,3,50,"3","5",null,null,null,null,null,null,null,null,null,null,null,null,null,null,"Episodic",5,7,null,11,null,10,0,1.36,1.36,13,"Vu","Vulnerable",6,0,0,"GleP0013","wetlands","Non-woody wetland vegetation"]
["Glenelg Plain","GleP","Brackish Wetland","Glenelg PlainBrackish Wetland","GleP0656",0,0,0,null,null,null,null,null,null,null,null,null,null,null,null,null,1,5,3,15,3,10,1,10,2,10,2,5,3,15,null,null,null,null,null,null,null,null,null,null,1,1,null,null,"0","10","Episodic",5,9,null,7,null,10,0,1.36,1.36,656,"Vu","Vulnerable",6,0,0,"GleP0656","wetlands","Non-woody wetland vegetation"]
["Glenelg Plain","GleP","Calcareous Wet Herbland","Glenelg PlainCalcareous Wet Herbland","GleP0591",null,0,0,null,null,null,null,null,null,null,null,null,null,null,null,null,null,null,null,null,null,null,null,null,null,null,null,null,null,null,null,null,null,null,null,null,null,null,null,null,null,null,null,null,null,null,null,0,0,null,null,null,0,0,0,{"$error":"#N/A"},{"$error":"#N/A"},{"$error":"#N/A"},{"$error":"#N/A"},{"$error":"#N/A"},{"$error":"#N/A"},{"$error":"#N/A"},{"$error":"#N/A"},{"$error":"#N/A"},{"$error":"#N/A"}]
["Glenelg Plain","GleP","Coastal Alkaline Scrub","Glenelg PlainCoastal Alkaline Scrub","GleP0858",0,0,0,null,null,null,null,null,null,null,4,30,null,null,null,null,3,5,2,1,2,10,1,5,null,null,3,5,2,30,null,null,null,null,null,null,null,null,null,null,2,1,0,20,null,null,"Continuous",0,9,4,7,30,40,50,1.1499999999999999,1.1499999999999999,858,"En","Endangered",2,0,0,"GleP0858","scrubs/shrublands/mallee with logs","Woody vegetation"]
["Glenelg Plain","GleP","Coastal Dune Scrub","Glenelg PlainCoastal Dune Scrub","GleP0160",0,0,0,null,null,null,null,null,null,null,7,50,null,null,null,null,3,5,7,15,3,10,null,null,null,null,2,15,2,5,null,null,null,null,null,null,null,null,null,null,3,5,0,10,null,null,"Episodic",30,8,7,13,50,40,0,1.36,{"$error":"#N/A"},{"$error":"#N/A"},{"$error":"#N/A"},{"$error":"#N/A"},{"$error":"#N/A"},{"$error":"#N/A"},{"$error":"#N/A"},{"$error":"#N/A"},{"$error":"#N/A"},{"$error":"#N/A"}]
["Glenelg Plain","GleP","Coastal Headland Scrub","Glenelg PlainCoastal Headland Scrub","GleP0161",0,0,0,null,null,null,null,null,null,null,7,50,null,null,null,null,2,1,4,5,2,5,1,1,null,null,4,10,2,5,null,null,null,null,null,null,null,null,null,null,2,5,0,10,"0","10","Continuous",0,10,7,8,50,40,0,1.36,1.36,161,"En","Endangered",4,0,0,"GleP0161","heathlands","Woody vegetation"]
["Glenelg Plain","GleP","Coastal Mallee Scrub","Glenelg PlainCoastal Mallee Scrub","GleP0665",0,0,4,40,null,null,null,null,null,null,6,10,6,10,null,null,2,1,3,5,1,1,2,5,null,null,7,15,null,null,null,null,null,null,null,null,null,null,null,null,1,1,0,10,"0","10","Continuous",0,10,12,6,20,20,50,1.1499999999999999,1.1499999999999999,665,"En","Endangered",2,0,0,"GleP0665","scrubs/shrublands/mallee with logs","Woody vegetation"]
["Glenelg Plain","GleP","Coastal Sand Heathland","Glenelg PlainCoastal Sand Heathland","GleP0005",null,null,0,null,null,null,null,null,null,null,null,null,null,null,null,null,null,null,null,null,null,null,null,null,null,null,null,null,null,null,null,null,null,null,null,null,null,null,null,null,null,null,null,null,null,null,null,0,0,null,null,null,null,0,1.36,1.36,5,"Ra","Rare",4,0,0,"GleP0005","heathlands","Woody vegetation"]
["Glenelg Plain","GleP","Creekline Grassy Woodland","Glenelg PlainCreekline Grassy Woodland","GleP0068",80,15,15,15,0,5,2,10,null,null,5,10,1,1,null,null,2,5,6,10,3,5,2,10,1,5,10,25,3,10,null,null,null,null,null,null,null,null,null,null,3,10,0,10,null,null,"Continuous",0,13,8,11,21,40,200,1,1,68,"En","Endangered",1,0,0,"GleP0068","Forest/Woodland","Woody vegetation"]
["Glenelg Plain","GleP","Creekline Herb-rich Woodland","Glenelg PlainCreekline Herb-rich Woodland","GleP0164",70,10,15,15,0,5,2,10,null,null,2,10,null,null,1,5,2,5,9,15,1,5,3,20,1,5,5,15,1,5,null,null,null,null,1,5,null,null,null,null,2,1,0,20,null,null,"Continuous",0,14,4,12,20,20,100,1,1,164,"En","Endangered",1,0,0,"GleP0164","Forest/Woodland","Woody vegetation"]
["Glenelg Plain","GleP","Creekline Sedgy Woodland","Glenelg PlainCreekline Sedgy Woodland","GleP0640",80,15,15,15,0,5,2,10,null,null,1,5,1,1,null,null,null,null,5,10,null,null,3,15,null,null,6,20,null,null,null,null,null,null,null,null,null,null,null,null,null,null,0,10,null,null,"Continuous",0,8,4,5,16,40,200,1,1,640,"En","Endangered",1,0,0,"GleP0640","Forest/Woodland","Woody vegetation"]
["Glenelg Plain","GleP","Damp Heathland","Glenelg PlainDamp Heathland","GleP0710",0,0,0,null,null,null,null,null,null,null,6,30,5,20,2,5,null,null,6,10,2,1,1,5,1,1,4,10,3,15,null,null,null,null,null,null,null,null,null,null,2,5,0,10,"0","10","Episodic",30,12,11,8,50,20,0,1.36,1.36,710,"D","Depleted",4,0,0,"GleP0710","heathlands","Woody vegetation"]
["Glenelg Plain","GleP","Damp Heathy Woodland","Glenelg PlainDamp Heathy Woodland","GleP0793",60,10,10,10,0,5,null,null,null,null,8,30,7,20,4,10,2,1,7,10,null,null,2,10,2,5,9,10,4,10,null,null,null,null,null,null,null,null,null,null,2,5,0,10,"0","10","Episodic",30,13,15,9,50,20,100,1,1,793,"D","Depleted",1,0,0,"GleP0793","Forest/Woodland","Woody vegetation"]
["Glenelg Plain","GleP","Damp Sands Herb-rich Woodland","Glenelg PlainDamp Sands Herb-rich Woodland","GleP0003",70,15,15,15,0,5,2,10,null,null,4,5,3,5,2,5,3,5,10,15,3,5,2,10,1,15,7,15,3,5,"1","0",null,null,1,5,null,null,null,null,2,1,0,10,null,null,"Continuous",0,16,9,16,20,40,150,1,1,3,"Vu","Vulnerable",1,0,0,"GleP0003","Forest/Woodland","Woody vegetation"]
["Glenelg Plain","GleP","Deep Freshwater Marsh","Glenelg PlainDeep Freshwater Marsh","GleP0681",null,null,0,null,null,null,null,null,null,null,null,null,null,null,null,null,null,null,null,null,null,null,null,null,null,null,null,null,null,null,null,null,null,null,null,null,null,null,null,null,null,null,null,null,null,null,null,5,0,null,null,null,null,0,1.36,1.36,681,"Vu","Vulnerable",6,0,0,"GleP0681","wetlands","Non-woody wetland vegetation"]
["Glenelg Plain","GleP","Escarpment Shrubland","Glenelg PlainEscarpment Shrubland","GleP0895",0,0,0,null,null,null,null,null,null,null,3,10,2,5,null,null,3,5,4,10,5,5,1,5,1,5,9,25,3,5,null,null,null,null,1,5,null,null,null,null,1,5,0,20,"0","10","Continuous",0,13,5,12,15,20,150,1.1499999999999999,1,895,"En","Endangered",1,0,0,"GleP0895","Forest/Woodland","Woody vegetation"]
["Glenelg Plain","GleP","Floodplain Riparian Woodland","Glenelg PlainFloodplain Riparian Woodland","GleP0056",80,15,20,20,0,5,1,5,null,null,3,15,null,null,null,null,2,5,3,10,3,10,2,15,1,10,5,15,1,5,null,null,null,null,null,null,null,null,null,null,1,5,0,10,null,null,"Episodic",5,12,4,8,20,40,300,1,1,56,"Vu","Vulnerable",1,0,0,"GleP0056","Forest/Woodland","Woody vegetation"]
["Glenelg Plain","GleP","Freshwater Lignum Shrubland","Glenelg PlainFreshwater Lignum Shrubland","GleP0657",0,0,0,null,null,null,null,null,null,null,1,20,null,null,null,null,2,5,3,20,3,10,1,5,null,null,6,25,3,10,null,null,null,null,null,null,null,null,null,null,null,null,0,10,"0","10","Episodic",10,9,1,8,20,10,0,1.36,1.36,657,"En","Endangered",6,0,0,"GleP0657","wetlands","Non-woody wetland vegetation"]
["Glenelg Plain","GleP","Freshwater Meadow","Glenelg PlainFreshwater Meadow","GleP0680",null,null,0,null,null,null,null,null,null,null,null,null,null,null,null,null,null,null,null,null,null,null,null,null,null,null,null,null,null,null,null,null,null,null,null,null,null,null,null,null,null,null,null,null,null,null,null,5,0,null,null,null,null,0,1.36,1.36,680,"En","Endangered",6,0,0,"GleP0680","wetlands","Non-woody wetland vegetation"]
["Glenelg Plain","GleP","Heathy Herb-rich Woodland","Glenelg PlainHeathy Herb-rich Woodland","GleP0179",70,15,15,20,0,5,2,10,null,null,5,15,7,10,3,5,2,5,8,10,2,5,3,10,1,5,8,15,3,10,null,null,null,null,1,20,null,null,null,null,null,null,0,10,null,null,"Continuous",0,14,14,12,35,20,150,1,1,179,"D","Depleted",1,0,0,"GleP0179","Forest/Woodland","Woody vegetation"]
["Glenelg Plain","GleP","Heathy Woodland","Glenelg PlainHeathy Woodland","GleP0048",60,15,10,15,2,5,null,null,null,null,8,30,8,20,3,5,null,null,5,10,1,1,2,10,1,5,5,10,2,10,null,null,null,null,1,5,null,null,null,null,null,null,0,10,"0","10","Episodic",20,13,16,6,50,40,150,1,1,48,"LC","Least Concern",1,0,0,"GleP0048","Forest/Woodland","Woody vegetation"]
["Glenelg Plain","GleP","Herb-rich Foothill Forest","Glenelg PlainHerb-rich Foothill Forest","GleP0023",70,20,25,40,0,5,2,10,null,null,5,15,1,1,1,1,3,5,10,20,5,5,3,5,1,5,10,20,2,10,null,null,null,null,3,10,null,null,null,null,null,null,0,20,null,null,"Continuous",0,14,8,18,26,40,200,1,1,23,"Vu","Vulnerable",1,0,0,"GleP0023","Forest/Woodland","Woody vegetation"]
["Glenelg Plain","GleP","Hills Herb-rich Woodland","Glenelg PlainHills Herb-rich Woodland","GleP0071",70,15,15,15,0,5,1,5,null,null,null,null,1,1,1,1,1,5,20,30,7,10,1,1,null,null,15,25,5,15,null,null,null,null,null,null,null,null,null,null,null,null,0,10,"0","10","Continuous",0,12,2,28,6,20,150,1,1,71,"Vu","Vulnerable",1,0,0,"GleP0071","Forest/Woodland","Woody vegetation"]
["Glenelg Plain","GleP","Lateritic Woodland","Glenelg PlainLateritic Woodland","GleP0704",70,15,15,15,0,5,1,5,null,null,11,25,11,20,4,5,2,5,14,10,4,5,2,5,1,1,15,20,4,5,"4","1",null,null,null,null,null,null,null,null,3,5,0,10,"0","10","Continuous",0,16,23,20,50,20,150,1,1,704,"Vu","Vulnerable",1,0,0,"GleP0704","Forest/Woodland","Woody vegetation"]
["Glenelg Plain","GleP","Limestone Pomaderris Shrubland","Glenelg PlainLimestone Pomaderris Shrubland","GleP0133",0,0,0,null,null,null,2,10,null,null,9,45,2,1,2,1,5,15,5,10,3,5,2,1,null,null,7,20,null,null,null,null,null,null,1,1,null,null,null,null,2,1,0,10,"0","10","Continuous",0,13,13,13,56,20,0,1.36,1,133,"Vu","Vulnerable",1,0,0,"GleP0133","Forest/Woodland","Woody vegetation"]
["Glenelg Plain","GleP","Limestone Ridge Woodland","Glenelg PlainLimestone Ridge Woodland","GleP0664",60,15,10,15,0,5,2,15,null,null,3,10,5,10,null,null,4,10,4,5,1,1,2,5,null,null,4,30,null,null,null,null,null,null,null,null,null,null,null,null,1,1,0,10,"0","10","Continuous",0,12,10,9,35,30,150,1,1,664,"Vu","Vulnerable",1,0,0,"GleP0664","Forest/Woodland","Woody vegetation"]
["Glenelg Plain","GleP","Limestone Woodland","Glenelg PlainLimestone Woodland","GleP0670",60,15,15,15,0,5,2,15,null,null,5,20,3,10,3,5,3,10,4,5,1,1,3,5,null,null,4,10,2,5,null,null,null,null,null,null,null,null,null,null,null,null,0,10,"0","10","Continuous",0,13,10,8,45,40,150,1,1,670,"Vu","Vulnerable",1,0,0,"GleP0670","Forest/Woodland","Woody vegetation"]
["Glenelg Plain","GleP","Lowland Forest","Glenelg PlainLowland Forest","GleP0016",70,20,20,30,0,5,2,10,null,null,7,15,5,10,4,10,2,5,15,20,4,5,3,5,2,5,8,15,1,5,null,null,null,null,2,10,null,null,null,null,2,1,0,10,null,null,"Continuous",0,15,14,21,35,40,200,1,1,16,"LC","Least Concern",1,0,0,"GleP0016","Forest/Woodland","Woody vegetation"]
["Glenelg Plain","GleP","Lunette Woodland","Glenelg PlainLunette Woodland","GleP0652",80,8,15,10,0,5,1,5,null,null,3,10,2,1,1,1,3,5,8,15,3,5,2,5,null,null,12,45,2,5,null,null,null,null,null,null,null,null,null,null,null,null,0,10,"0","10","Continuous",0,13,6,14,16,10,100,1,1,652,"En","Endangered",1,0,0,"GleP0652","Forest/Woodland","Woody vegetation"]
["Glenelg Plain","GleP","Permanent Open Freshwater","Glenelg PlainPermanent Open Freshwater","GleP0682",null,0,0,null,null,null,null,null,null,null,null,null,null,null,null,null,null,null,null,null,null,null,null,null,null,null,null,null,null,null,null,null,null,null,null,null,null,null,null,null,null,null,null,null,null,null,null,0,0,null,null,null,0,0,0,{"$error":"#N/A"},{"$error":"#N/A"},{"$error":"#N/A"},{"$error":"#N/A"},{"$error":"#N/A"},{"$error":"#N/A"},{"$error":"#N/A"},{"$error":"#N/A"},{"$error":"#N/A"},{"$error":"#N/A"}]
["Glenelg Plain","GleP","Permanent Saline","Glenelg PlainPermanent Saline","GleP0684",null,0,0,null,null,null,null,null,null,null,null,null,null,null,null,null,null,null,null,null,null,null,null,null,null,null,null,null,null,null,null,null,null,null,null,null,null,null,null,null,null,null,null,null,null,null,null,0,0,null,null,null,0,0,0,{"$error":"#N/A"},{"$error":"#N/A"},{"$error":"#N/A"},{"$error":"#N/A"},{"$error":"#N/A"},{"$error":"#N/A"},{"$error":"#N/A"},{"$error":"#N/A"},{"$error":"#N/A"},{"$error":"#N/A"}]
["Glenelg Plain","GleP","Plains Grassy Wetland","Glenelg PlainPlains Grassy Wetland","GleP0125",0,0,0,null,null,null,null,null,null,null,null,null,null,null,null,null,6,10,11,20,4,10,2,10,null,null,11,30,2,10,"2","1",null,null,null,null,null,null,null,null,null,null,0,10,null,null,"Episodic",5,8,null,21,null,10,50,1.36,1.36,125,"En","Endangered",6,"y",0,"GleP0125","wetlands","Non-woody wetland vegetation"]
["Glenelg Plain","GleP","Plains Grassy Woodland","Glenelg PlainPlains Grassy Woodland","GleP0055",80,15,15,10,0,5,1,1,null,null,1,5,2,5,1,1,1,1,18,25,4,10,1,1,null,null,15,40,4,5,null,null,null,null,null,null,null,null,null,null,null,null,0,10,null,null,"Continuous",0,12,4,23,11,10,100,1,1,55,"En","Endangered",1,0,0,"GleP0055","Forest/Woodland","Woody vegetation"]
["Glenelg Plain","GleP","Plains Sedgy Wetland","Glenelg PlainPlains Sedgy Wetland","GleP0647",0,0,0,null,null,null,null,null,null,null,null,null,null,null,null,null,1,5,4,10,null,null,1,5,1,10,4,40,1,10,null,null,null,null,null,null,null,null,null,null,null,null,null,null,null,null,"Episodic",5,6,null,5,null,10,0,1.36,1.36,647,"En","Endangered",6,0,0,"GleP0647","wetlands","Non-woody wetland vegetation"]
["Glenelg Plain","GleP","Plains Sedgy Woodland","Glenelg PlainPlains Sedgy Woodland","GleP0283",70,15,15,10,0,5,null,null,null,null,1,5,2,1,null,null,4,15,10,20,2,5,2,1,1,1,13,30,4,20,null,null,null,null,null,null,null,null,null,null,null,null,0,10,"0","10","Continuous",0,12,3,16,6,10,150,1,1,283,"Vu","Vulnerable",1,0,0,"GleP0283","Forest/Woodland","Woody vegetation"]
["Glenelg Plain","GleP","Plains Swampy Woodland","Glenelg PlainPlains Swampy Woodland","GleP0651",80,10,15,10,0,5,1,5,null,null,4,15,null,null,null,null,3,5,8,20,5,5,3,30,1,1,7,10,2,5,null,null,null,null,null,null,null,null,null,null,null,null,0,20,null,null,"Continuous",0,11,5,16,20,10,100,1,1,651,"En","Endangered",1,0,0,"GleP0651","Forest/Woodland","Woody vegetation"]
["Glenelg Plain","GleP","Plains Woodland","Glenelg PlainPlains Woodland","GleP0803",70,15,15,15,0,5,null,null,null,null,1,5,null,null,1,1,1,1,20,25,4,10,1,5,1,1,16,30,3,5,null,null,null,null,null,null,null,null,null,null,null,null,0,10,null,null,"Continuous",0,11,1,25,5,20,100,1,1,803,"En","Endangered",1,0,0,"GleP0803","Forest/Woodland","Woody vegetation"]
["Glenelg Plain","GleP","Red Gum Swamp","Glenelg PlainRed Gum Swamp","GleP0292",80,10,15,15,0,5,null,null,null,null,null,null,null,null,null,null,2,10,7,25,2,1,2,15,null,null,6,20,2,15,null,null,null,null,null,null,null,null,null,null,null,null,null,null,null,null,"Episodic",5,7,null,11,null,10,100,1,1,292,"En","Endangered",1,0,0,"GleP0292","Forest/Woodland","Woody vegetation"]
["Glenelg Plain","GleP","Riparian Forest","Glenelg PlainRiparian Forest","GleP0018",80,20,30,40,0,5,3,25,null,null,4,15,null,null,null,null,1,1,4,10,2,1,3,10,1,1,2,0,1,1,null,null,null,null,5,30,"1","5","2","1",2,1,0,10,null,null,"Continuous",0,15,7,7,40,50,300,1,1,18,"Vu","Vulnerable",1,0,0,"GleP0018","Forest/Woodland","Woody vegetation"]
["Glenelg Plain","GleP","Riparian Scrub","Glenelg PlainRiparian Scrub","GleP0191",0,0,0,null,null,null,null,null,null,null,4,10,2,1,1,1,1,5,4,5,null,null,2,25,null,null,1,10,3,15,null,null,null,null,null,null,null,null,null,null,null,null,0,20,null,null,"Continuous",0,9,6,5,11,40,0,1.25,1.25,191,"D","Depleted",3,0,0,"GleP0191","scrubs/shrublands/mallee without logs","Woody vegetation"]
["Glenelg Plain","GleP","Riparian Woodland","Glenelg PlainRiparian Woodland","GleP0641",80,15,20,20,0,5,null,null,null,null,3,10,1,1,null,null,3,5,9,20,2,5,3,30,null,null,2,10,null,null,null,null,null,null,1,1,null,null,null,null,3,10,0,10,null,null,"Episodic",5,11,4,14,11,20,200,1,1,641,"Vu","Vulnerable",1,0,0,"GleP0641","Forest/Woodland","Woody vegetation"]
["Glenelg Plain","GleP","Sand Heathland","Glenelg PlainSand Heathland","GleP0006",0,0,0,null,null,null,null,null,null,null,7,30,8,20,3,5,null,null,5,10,1,1,1,1,null,null,4,10,3,20,null,null,null,null,null,null,null,null,null,null,2,5,0,10,"0","10","Episodic",30,11,15,6,50,20,0,1.36,1.36,6,"Ra","Rare",4,0,0,"GleP0006","heathlands","Woody vegetation"]
["Glenelg Plain","GleP","Sandy Stream Woodland","Glenelg PlainSandy Stream Woodland","GleP0674",80,10,15,10,0,5,2,15,null,null,5,15,null,null,null,null,null,null,6,10,3,5,2,10,2,20,10,30,3,5,null,null,null,null,null,null,null,null,null,null,null,null,0,10,null,null,"Continuous",0,10,7,9,30,40,200,1,1,674,"En","Endangered",1,0,0,"GleP0674","Forest/Woodland","Woody vegetation"]
["Glenelg Plain","GleP","Seasonally Inundated Shrubby Woodland","Glenelg PlainSeasonally Inundated Shrubby Woodland","GleP0195",70,15,15,15,0,5,null,null,null,null,7,30,3,10,1,1,2,5,3,10,1,1,null,null,null,null,6,15,3,10,null,null,null,null,null,null,null,null,null,null,null,null,0,10,"0","10","Continuous",0,11,10,6,40,30,150,1,1,195,"En","Endangered",1,0,0,"GleP0195","Forest/Woodland","Woody vegetation"]
["Glenelg Plain","GleP","Sedge Wetland","Glenelg PlainSedge Wetland","GleP0136",0,0,0,null,null,null,null,null,null,null,null,null,null,null,null,null,1,5,null,null,1,1,2,20,1,20,null,null,null,null,null,null,null,null,null,null,null,null,null,null,null,null,0,10,null,null,"Episodic",5,5,null,2,null,10,0,1.36,1.36,136,"Vu","Vulnerable",6,0,0,"GleP0136","wetlands","Non-woody wetland vegetation"]
["Glenelg Plain","GleP","Sedgy Riparian Woodland","Glenelg PlainSedgy Riparian Woodland","GleP0198",70,15,15,20,0,5,1,10,null,null,5,20,null,null,null,null,null,null,3,10,null,null,5,30,null,null,2,5,2,5,null,null,null,null,2,10,null,null,null,null,null,null,0,20,null,null,"Continuous",0,9,6,3,30,20,200,1,1,198,"Vu","Vulnerable",1,0,0,"GleP0198","Forest/Woodland","Woody vegetation"]
["Glenelg Plain","GleP","Sedgy Swamp Woodland","Glenelg PlainSedgy Swamp Woodland","GleP0707",80,10,15,10,0,5,null,null,null,null,2,15,null,null,null,null,3,10,6,15,5,5,2,10,2,30,3,10,2,1,null,null,null,null,null,null,null,null,null,null,null,null,0,20,null,null,"Continuous",0,10,2,14,15,10,100,1,1,707,"En","Endangered",1,0,0,"GleP0707","Forest/Woodland","Woody vegetation"]
["Glenelg Plain","GleP","Shallow Freshwater Marsh","Glenelg PlainShallow Freshwater Marsh","GleP0200",null,null,0,null,null,null,null,null,null,null,null,null,null,null,null,null,null,null,null,null,null,null,null,null,null,null,null,null,null,null,null,null,null,null,null,null,null,null,null,null,null,null,null,null,null,null,null,5,0,null,null,null,null,0,1.36,1.36,200,"En","Endangered",6,0,0,"GleP0200","wetlands","Non-woody wetland vegetation"]
["Glenelg Plain","GleP","Shallow Sands Woodland","Glenelg PlainShallow Sands Woodland","GleP0882",70,15,15,15,0,5,2,15,null,null,3,5,4,10,2,5,3,5,17,20,3,5,2,5,null,null,11,25,4,10,"2","0",null,null,null,null,null,null,null,null,1,0,0,10,"0","10","Continuous",0,15,9,23,30,20,150,1,1,882,"Vu","Vulnerable",1,0,0,"GleP0882","Forest/Woodland","Woody vegetation"]
["Glenelg Plain","GleP","Spray-zone Coastal Shrubland","Glenelg PlainSpray-zone Coastal Shrubland","GleP0876",0,0,0,null,null,null,null,null,null,null,null,null,1,5,null,null,null,null,4,10,1,1,null,null,null,null,null,null,null,null,null,null,null,null,null,null,null,null,null,null,null,null,0,20,"0","20","Continuous",0,5,1,5,5,10,0,1.36,1.36,876,"En","Endangered",5,0,0,"GleP0876","grasslands","Other grassland vegetation"]
["Glenelg Plain","GleP","Swamp Scrub","Glenelg PlainSwamp Scrub","GleP0053",0,0,0,null,null,null,null,null,null,null,2,10,1,1,null,null,5,5,9,15,3,10,2,15,2,5,4,15,3,15,null,null,null,null,2,5,null,null,null,null,1,5,0,20,null,null,"Continuous",0,12,3,17,11,40,0,1.25,1.1499999999999999,53,"Vu","Vulnerable",3,0,0,"GleP0053","scrubs/shrublands/mallee without logs","Woody vegetation"]
["Glenelg Plain","GleP","Treed Escarpment Shrubland","Glenelg PlainTreed Escarpment Shrubland","GleP0895_61",70,15,0,0,0,5,3,10,null,null,3,10,2,5,null,null,3,5,4,10,5,5,1,5,1,5,9,25,3,5,null,null,null,null,1,5,null,null,null,null,1,5,0,20,"0","10","Continuous",0,15,8,12,25,20,150,1,{"$error":"#N/A"},{"$error":"#N/A"},{"$error":"#N/A"},{"$error":"#N/A"},{"$error":"#N/A"},{"$error":"#N/A"},{"$error":"#N/A"},{"$error":"#N/A"},{"$error":"#N/A"},{"$error":"#N/A"}]
["Glenelg Plain","GleP","Wet Forest","Glenelg PlainWet Forest","GleP0030",90,20,30,40,0,5,2,15,null,null,3,10,null,null,null,null,1,1,3,5,null,null,2,5,null,null,4,5,2,5,null,null,null,null,6,20,"2","25",null,null,1,1,0,20,null,null,"Continuous",0,12,5,4,25,50,300,1,1,30,"LC","Least Concern",1,0,0,"GleP0030","Forest/Woodland","Woody vegetation"]
["Glenelg Plain","GleP","Wet Heathland",{"$f":"CONCATENATE(A387,C387)","v":"Glenelg PlainWet Heathland"},"GleP0008",0,0,0,null,null,null,null,null,null,null,7,40,4,5,1,1,2,5,1,5,2,1,2,20,1,5,4,15,3,10,null,null,null,null,1,1,null,null,null,null,1,5,0,20,null,null,"Episodic",30,13,11,5,45,20,0,1.36,1.36,8,"LC","Least Concern",4,0,0,"GleP0008","heathlands","Woody vegetation"]
["Goldfields","Gold","Alluvial Terraces Herb-rich Woodland","GoldfieldsAlluvial Terraces Herb-rich Woodland","Gold0067",70,8,15,15,0,5,1,5,null,null,3,5,3,5,1,1,3,5,15,30,5,10,1,1,null,null,12,30,2,5,null,null,null,null,1,1,null,null,null,null,null,null,0,10,"0","10","Continuous",0,14,7,23,15,10,150,1,1,67,"En","Endangered",1,0,0,"Gold0067","Forest/Woodland","Woody vegetation"]
["Goldfields","Gold","Box Ironbark Forest","GoldfieldsBox Ironbark Forest","Gold0061",70,15,20,30,0,5,null,null,null,null,7,25,4,5,2,1,null,null,9,20,null,null,1,1,null,null,8,15,null,null,null,null,null,null,null,null,null,null,null,null,null,null,0,10,"0","20","Continuous",0,9,11,9,30,20,200,1,1,61,"D","Depleted",1,0,0,"Gold0061","Forest/Woodland","Woody vegetation"]
["Goldfields","Gold","Creekline Grassy Woodland","GoldfieldsCreekline Grassy Woodland","Gold0068",80,15,15,15,0,5,null,null,null,null,4,10,3,5,null,null,2,5,9,15,3,5,2,5,null,null,16,40,3,5,null,null,null,null,null,null,null,null,null,null,null,null,0,10,null,null,"Continuous",0,10,7,14,15,40,300,1,1,68,"En","Endangered",1,0,0,"Gold0068","Forest/Woodland","Woody vegetation"]
["Goldfields","Gold","Creekline Herb-rich Woodland","GoldfieldsCreekline Herb-rich Woodland","Gold0164",70,10,15,15,0,5,1,5,null,null,3,15,null,null,null,null,1,0,6,20,1,5,1,20,1,5,2,5,1,5,null,null,null,null,null,null,null,null,null,null,null,null,0,20,null,null,"Continuous",0,11,4,8,20,20,100,1,1,164,"En","Endangered",1,0,0,"Gold0164","Forest/Woodland","Woody vegetation"]
["Goldfields","Gold","Damp Sands Herb-rich Woodland","GoldfieldsDamp Sands Herb-rich Woodland","Gold0003",70,15,15,15,0,5,2,10,null,null,3,10,3,5,null,null,null,null,16,20,7,15,1,10,null,null,10,15,2,10,null,null,null,null,1,10,null,null,null,null,null,null,0,10,null,null,"Continuous",0,11,8,23,25,40,150,1,1,3,"En","Endangered",1,0,0,"Gold0003","Forest/Woodland","Woody vegetation"]
["Goldfields","Gold","Drainage-line Woodland","GoldfieldsDrainage-line Woodland","Gold0679",80,15,15,15,0,5,null,null,null,null,null,null,null,null,null,null,2,5,9,15,3,5,2,10,null,null,16,30,3,5,null,null,null,null,null,null,null,null,null,null,null,null,0,10,null,null,"Continuous",0,8,null,14,null,40,300,1,1,679,"En","Endangered",1,0,0,"Gold0679","Forest/Woodland","Woody vegetation"]
["Goldfields","Gold","Floodplain Riparian Woodland","GoldfieldsFloodplain Riparian Woodland","Gold0056",80,15,0,20,0,5,1,5,null,null,2,5,1,1,null,null,null,null,4,10,2,1,2,5,1,5,6,40,2,10,null,null,null,null,null,null,null,null,null,null,null,null,0,10,null,null,"Episodic",10,11,4,6,11,40,300,1,1,56,"En","Endangered",1,0,0,"Gold0056","Forest/Woodland","Woody vegetation"]
["Goldfields","Gold","Granitic Grassy Woodland","GoldfieldsGranitic Grassy Woodland","Gold0175_62",70,15,15,15,0,5,2,10,null,null,2,15,1,1,1,1,null,null,8,20,3,10,1,1,null,null,8,40,1,5,null,null,null,null,1,5,null,null,null,null,null,null,0,10,null,null,"Continuous",0,12,5,11,26,20,150,1,{"$error":"#N/A"},{"$error":"#N/A"},{"$error":"#N/A"},{"$error":"#N/A"},{"$error":"#N/A"},{"$error":"#N/A"},{"$error":"#N/A"},{"$error":"#N/A"},{"$error":"#N/A"},{"$error":"#N/A"}]
["Goldfields","Gold","Granitic Hills Woodland","GoldfieldsGranitic Hills Woodland","Gold0072",60,15,10,10,0,5,1,1,null,null,null,null,null,null,null,null,3,5,11,15,2,1,null,null,null,null,6,10,4,10,"2","1",null,null,1,10,null,null,null,null,null,null,0,10,"0","10","Continuous",0,11,1,16,1,20,150,1,1,72,"En","Endangered",1,0,0,"Gold0072","Forest/Woodland","Woody vegetation"]
["Goldfields","Gold","Grassy Dry Forest","GoldfieldsGrassy Dry Forest","Gold0022",60,20,20,30,0,5,1,5,null,null,3,5,3,5,2,1,3,10,16,30,3,5,2,5,null,null,13,30,4,5,null,null,null,null,1,5,null,null,null,null,1,1,0,10,"0","10","Continuous",0,15,7,22,15,20,200,1,1,22,"D","Depleted",1,0,0,"Gold0022","Forest/Woodland","Woody vegetation"]
["Goldfields","Gold","Grassy Woodland","GoldfieldsGrassy Woodland","Gold0175",null,null,0,null,null,null,null,null,null,null,null,null,null,null,null,null,null,null,null,null,null,null,null,null,null,null,null,null,null,null,null,null,null,null,null,null,null,null,null,null,null,null,null,null,null,null,null,0,0,null,null,null,null,0,1,1,175,"Vu","Vulnerable",1,0,0,"Gold0175","Forest/Woodland","Woody vegetation"]
["Goldfields","Gold","Heathy Dry Forest","GoldfieldsHeathy Dry Forest","Gold0020",60,20,20,30,0,5,1,5,null,null,8,25,6,15,2,5,3,5,10,20,2,5,2,5,null,null,10,25,2,1,null,null,null,null,null,null,null,null,null,null,null,null,0,10,"0","10","Episodic",20,13,15,15,45,20,200,1,1,20,"LC","Least Concern",1,0,0,"Gold0020","Forest/Woodland","Woody vegetation"]
["Goldfields","Gold","Heathy Woodland","GoldfieldsHeathy Woodland","Gold0048",60,15,10,15,0,5,null,null,null,null,9,30,7,20,2,1,2,5,9,15,null,null,1,1,null,null,7,15,null,null,null,null,null,null,null,null,null,null,null,null,null,null,0,10,"0","10","Episodic",20,10,16,11,50,40,150,1,1,48,"D","Depleted",1,0,0,"Gold0048","Forest/Woodland","Woody vegetation"]
["Goldfields","Gold","Herb-rich Foothill Forest","GoldfieldsHerb-rich Foothill Forest","Gold0023",70,20,25,40,0,5,2,10,null,null,2,5,2,1,1,1,4,5,11,25,3,5,2,5,1,5,6,20,2,5,null,null,null,null,2,10,null,null,null,null,3,5,0,20,null,null,"Continuous",0,15,6,18,16,40,200,1,1,23,"D","Depleted",1,0,0,"Gold0023","Forest/Woodland","Woody vegetation"]
["Goldfields","Gold","Hillcrest Herb-rich Woodland","GoldfieldsHillcrest Herb-rich Woodland","Gold0070",70,15,10,15,0,5,2,10,null,null,2,5,2,1,null,null,4,10,14,20,2,5,1,1,null,null,12,30,3,5,null,null,null,null,1,1,null,null,null,null,null,null,0,10,"0","10","Continuous",0,13,6,20,16,20,150,1,1,70,"D","Depleted",1,0,0,"Gold0070","Forest/Woodland","Woody vegetation"]
["Goldfields","Gold","Hills Herb-rich Woodland","GoldfieldsHills Herb-rich Woodland","Gold0071",70,15,15,15,0,5,1,5,null,null,5,15,null,null,null,null,4,5,15,20,3,5,2,1,null,null,11,30,5,10,null,null,null,null,2,10,null,null,null,null,null,null,0,10,"0","10","Continuous",0,12,6,22,20,20,150,1,1,71,"D","Depleted",1,0,0,"Gold0071","Forest/Woodland","Woody vegetation"]
["Goldfields","Gold","Lateritic Woodland","GoldfieldsLateritic Woodland","Gold0704",70,15,15,15,0,5,1,5,null,null,11,25,11,20,4,5,2,5,14,10,4,5,2,5,1,1,15,20,4,5,"4","1",null,null,null,null,null,null,null,null,3,5,0,10,"0","10","Continuous",0,16,23,20,50,20,150,1,1,704,"En","Endangered",1,0,0,"Gold0704","Forest/Woodland","Woody vegetation"]
["Goldfields","Gold","Lignum Swamp","GoldfieldsLignum Swamp","Gold0104",0,0,0,null,null,null,null,null,null,null,1,20,null,null,null,null,4,5,8,25,1,0,1,5,null,null,2,5,2,5,null,null,null,null,null,null,null,null,null,null,1,1,null,null,"0","10","Continuous",0,9,1,13,20,5,0,1.36,1.36,104,"Vu","Vulnerable",6,0,0,"Gold0104","wetlands","Non-woody wetland vegetation"]
["Goldfields","Gold","Low Rises Grassy Woodland","GoldfieldsLow Rises Grassy Woodland","Gold0175_61",70,15,15,15,0,5,null,null,null,null,6,15,3,5,1,1,4,10,10,15,2,5,2,5,null,null,11,25,3,5,null,null,null,null,null,null,null,null,null,null,null,null,0,10,"0","10","Continuous",0,12,9,16,20,20,150,1,{"$error":"#N/A"},{"$error":"#N/A"},{"$error":"#N/A"},{"$error":"#N/A"},{"$error":"#N/A"},{"$error":"#N/A"},{"$error":"#N/A"},{"$error":"#N/A"},{"$error":"#N/A"},{"$error":"#N/A"}]
["Goldfields","Gold","Metamorphic Slopes Shrubby Woodland","GoldfieldsMetamorphic Slopes Shrubby Woodland","Gold0069",40,15,8,15,null,null,1,5,null,null,7,25,3,5,1,1,2,5,11,20,2,1,1,5,null,null,7,15,null,null,null,null,null,null,1,5,null,null,null,null,null,null,0,10,"0","20","Continuous",0,12,11,15,35,20,150,1,1,69,"D","Depleted",1,0,0,"Gold0069","Forest/Woodland","Woody vegetation"]
["Goldfields","Gold","Plains Grassland","GoldfieldsPlains Grassland","Gold0132",null,null,null,null,null,null,null,null,null,null,null,null,null,null,null,null,null,null,null,null,null,null,null,null,null,null,null,null,null,null,null,null,null,null,null,null,null,null,null,null,null,null,null,null,null,null,null,null,0,null,null,null,null,0,1.36,1.36,132,"En","Endangered",5,"y",0,"Gold0132","grasslands","Other grassland vegetation"]
["Goldfields","Gold","Plains Grassy Wetland","GoldfieldsPlains Grassy Wetland","Gold0125",0,0,0,null,null,null,null,null,null,null,null,null,null,null,null,null,5,5,11,20,6,10,2,5,null,null,7,20,3,30,null,null,null,null,null,null,null,null,null,null,null,null,0,10,null,null,"Episodic",5,7,null,22,null,10,50,1.36,1.36,125,"En","Endangered",6,"y",0,"Gold0125","wetlands","Non-woody wetland vegetation"]
["Goldfields","Gold","Plains Grassy Woodland","GoldfieldsPlains Grassy Woodland","Gold0055",70,15,15,15,0,5,null,null,null,null,1,5,1,1,null,null,3,5,10,30,3,10,null,null,null,null,18,40,2,5,null,null,null,null,null,null,null,null,null,null,null,null,0,10,"0","10","Continuous",0,10,2,16,6,10,100,1,1,55,"En","Endangered",1,0,0,"Gold0055","Forest/Woodland","Woody vegetation"]
["Goldfields","Gold","Plains Woodland","GoldfieldsPlains Woodland","Gold0803",70,15,15,15,0,5,null,null,null,null,1,5,1,1,null,null,3,5,10,30,3,10,null,null,null,null,18,40,2,5,null,null,null,null,null,null,null,null,null,null,null,null,0,10,"0","10","Continuous",0,10,2,16,6,10,100,1,1,803,"En","Endangered",1,0,0,"Gold0803","Forest/Woodland","Woody vegetation"]
["Goldfields","Gold","Red Gum Swamp","GoldfieldsRed Gum Swamp","Gold0292",80,10,15,10,0,5,1,10,null,null,null,null,null,null,null,null,null,null,1,15,null,null,2,5,null,null,2,10,2,40,null,null,null,null,null,null,null,null,null,null,null,null,0,10,null,null,"Episodic",5,7,1,1,10,20,150,1,1,292,"En","Endangered",1,0,0,"Gold0292","Forest/Woodland","Woody vegetation"]
["Goldfields","Gold","Riparian Shrubland","GoldfieldsRiparian Shrubland","Gold0019",0,0,0,null,null,null,null,null,null,null,6,40,null,null,null,null,2,5,6,10,2,5,3,10,null,null,3,10,2,1,null,null,null,null,2,5,null,null,null,null,2,5,0,10,null,null,"Episodic",5,10,6,10,40,20,100,1.25,1.25,19,"D","Depleted",3,0,0,"Gold0019","scrubs/shrublands/mallee without logs","Woody vegetation"]
["Goldfields","Gold","Riparian Woodland","GoldfieldsRiparian Woodland","Gold0641",80,15,15,20,0,5,2,15,null,null,3,10,1,1,null,null,4,15,5,10,1,5,3,10,1,5,4,20,2,5,null,null,null,null,null,null,null,null,null,null,1,5,0,10,null,null,"Continuous",0,13,6,10,26,30,200,1,1,641,"En","Endangered",1,0,0,"Gold0641","Forest/Woodland","Woody vegetation"]
["Goldfields","Gold","Riverine Grassy Woodland","GoldfieldsRiverine Grassy Woodland","Gold0295",80,15,20,20,0,5,1,5,null,null,null,null,1,1,null,null,null,null,2,1,2,1,2,5,null,null,5,20,2,20,null,null,null,null,null,null,null,null,null,null,null,null,0,10,null,null,"Continuous",0,9,2,4,6,10,200,1,1,295,"Vu","Vulnerable",1,0,0,"Gold0295","Forest/Woodland","Woody vegetation"]
["Goldfields","Gold","Riverine Swampy Woodland","GoldfieldsRiverine Swampy Woodland","Gold0815",70,15,15,20,0,5,null,null,null,null,null,null,null,null,null,null,2,5,3,10,1,5,3,10,null,null,2,10,3,20,null,null,null,null,null,null,null,null,null,null,null,null,null,null,null,null,"Episodic",5,7,null,6,null,10,100,1,1,815,"Vu","Vulnerable",1,0,0,"Gold0815","Forest/Woodland","Woody vegetation"]
["Goldfields","Gold","Rocky Outcrop Shrubland","GoldfieldsRocky Outcrop Shrubland","Gold0028",null,null,null,null,null,null,null,null,null,null,null,null,null,null,null,null,null,null,null,null,null,null,null,null,null,null,null,null,null,null,null,null,null,null,null,null,null,null,null,null,null,null,null,null,null,null,null,null,0,null,null,null,null,0,1.36,1.36,28,"LC","Least Concern",4,0,0,"Gold0028","heathlands","Woody vegetation"]
["Goldfields","Gold","Sand Ridge Woodland","GoldfieldsSand Ridge Woodland","Gold0264",70,15,15,15,0,5,null,null,null,null,4,20,3,10,2,5,2,5,10,15,5,5,3,10,null,null,8,15,null,null,null,null,null,null,1,5,null,null,null,null,1,5,0,10,"0","10","Continuous",0,13,7,17,30,10,150,1,1,264,"En","Endangered",1,0,0,"Gold0264","Forest/Woodland","Woody vegetation"]
["Goldfields","Gold","Sandstone Ridge Shrubland","GoldfieldsSandstone Ridge Shrubland","Gold0093",0,0,3,30,null,null,null,null,null,null,9,30,5,10,1,1,1,1,6,15,null,null,null,null,null,null,3,5,null,null,null,null,null,null,null,null,null,null,null,null,null,null,0,20,"0","20","Episodic",30,8,14,7,40,20,50,1.1499999999999999,1.1499999999999999,93,"LC","Least Concern",2,0,0,"Gold0093","scrubs/shrublands/mallee with logs","Woody vegetation"]
["Goldfields","Gold","Scoria Cone Woodland","GoldfieldsScoria Cone Woodland","Gold0894",70,15,15,15,0,5,1,5,null,null,2,10,null,null,null,null,3,5,6,10,3,5,1,15,null,null,4,15,1,5,null,null,null,null,2,20,null,null,null,null,null,null,0,10,"0","10","Continuous",0,12,3,12,15,20,100,1,1,894,"En","Endangered",1,0,0,"Gold0894","Forest/Woodland","Woody vegetation"]
["Goldfields","Gold","Scrub-pine Woodland","GoldfieldsScrub-pine Woodland","Gold0092",null,0,0,null,null,null,null,null,null,null,null,null,null,null,null,null,null,null,null,null,null,null,null,null,null,null,null,null,null,null,null,null,null,null,null,null,null,null,null,null,null,null,null,null,null,null,null,0,0,null,null,null,0,0,0,{"$error":"#N/A"},{"$error":"#N/A"},{"$error":"#N/A"},{"$error":"#N/A"},{"$error":"#N/A"},{"$error":"#N/A"},{"$error":"#N/A"},{"$error":"#N/A"},{"$error":"#N/A"},{"$error":"#N/A"}]
["Goldfields","Gold","Sedge-rich Woodland","GoldfieldsSedge-rich Woodland","Gold0065",70,15,15,10,0,5,null,null,null,null,2,5,2,1,null,null,1,5,10,20,2,5,null,null,1,1,13,30,3,15,null,null,null,null,null,null,null,null,null,null,null,null,0,10,"0","10","Continuous",0,11,4,13,6,10,150,1,1,65,"En","Endangered",1,0,0,"Gold0065","Forest/Woodland","Woody vegetation"]
["Goldfields","Gold","Sedgy Riparian Woodland","GoldfieldsSedgy Riparian Woodland","Gold0198",70,15,15,20,0,5,1,10,null,null,4,20,2,5,null,null,1,1,7,10,2,5,3,30,2,10,7,10,2,15,null,null,null,null,1,5,null,null,null,null,null,null,0,10,null,null,"Continuous",0,13,7,10,35,30,200,1,1,198,"Vu","Vulnerable",1,0,0,"Gold0198","Forest/Woodland","Woody vegetation"]
["Goldfields","Gold","Semi-arid Woodland","GoldfieldsSemi-arid Woodland","Gold0097",40,20,12,20,0,5,null,null,null,null,5,15,5,20,null,null,2,5,7,5,2,5,null,null,null,null,2,10,1,1,null,null,null,null,null,null,null,null,null,null,null,null,0,10,"0","20","Continuous",0,10,10,11,35,20,200,1,1,97,"Vu","Vulnerable",1,0,"y","Gold0097","Forest/Woodland","Woody vegetation"]
["Goldfields","Gold","Shrubby Dry Forest","GoldfieldsShrubby Dry Forest","Gold0021",70,20,25,30,0,5,1,5,null,null,4,20,3,10,1,1,1,1,2,5,null,null,1,15,null,null,2,10,null,null,null,null,null,null,null,null,null,null,null,null,null,null,0,10,"0","10","Episodic",20,11,8,3,35,20,200,1,1,21,"Vu","Vulnerable",1,0,0,"Gold0021","Forest/Woodland","Woody vegetation"]
["Goldfields","Gold","Shrubby Woodland","GoldfieldsShrubby Woodland","Gold0282",80,15,15,20,0,5,1,5,null,null,2,30,3,15,null,null,null,null,2,1,null,null,1,5,null,null,1,1,null,null,null,null,null,null,null,null,null,null,null,null,null,null,0,10,null,null,"Continuous",0,8,6,2,50,20,150,1,1,282,"LC","Least Concern",1,0,0,"Gold0282","Forest/Woodland","Woody vegetation"]
["Goldfields","Gold","Stream Bank Shrubland","GoldfieldsStream Bank Shrubland","Gold0851",80,15,15,10,0,5,1,10,null,null,10,40,null,null,null,null,4,5,9,20,2,5,3,15,null,null,3,10,2,10,null,null,null,null,1,1,null,null,null,null,2,5,0,10,null,null,"Continuous",0,12,11,15,50,20,100,1,1,851,"En","Endangered",1,0,0,"Gold0851","Forest/Woodland","Woody vegetation"]
["Goldfields","Gold","Swamp Scrub","GoldfieldsSwamp Scrub","Gold0053",null,null,null,null,null,null,null,null,null,null,null,null,null,null,null,null,null,null,null,null,null,null,null,null,null,null,null,null,null,null,null,null,null,null,null,null,null,null,null,null,null,null,null,null,null,null,null,null,0,null,null,null,null,0,1.25,1.1499999999999999,53,"En","Endangered",3,0,0,"Gold0053","scrubs/shrublands/mallee without logs","Woody vegetation"]
["Goldfields","Gold","Swampy Riparian Woodland","GoldfieldsSwampy Riparian Woodland","Gold0083",70,10,15,20,0,5,2,10,null,null,2,5,null,null,null,null,5,10,9,20,4,10,4,10,1,5,9,25,2,5,null,null,null,null,1,1,null,null,null,null,2,5,0,20,null,null,"Continuous",0,13,4,18,15,20,200,1,1,83,"En","Endangered",1,0,0,"Gold0083","Forest/Woodland","Woody vegetation"]
["Goldfields","Gold","Valley Grassy Forest","GoldfieldsValley Grassy Forest","Gold0047",70,20,20,20,0,5,1,5,null,null,3,5,2,5,1,5,2,5,11,20,2,5,2,5,null,null,8,30,2,10,null,null,null,null,1,1,null,null,null,null,null,null,0,20,null,null,"Continuous",0,13,6,15,15,40,200,1,1,47,"Vu","Vulnerable",1,0,0,"Gold0047","Forest/Woodland","Woody vegetation"]
["Goldfields","Gold","Valley Heathy Forest","GoldfieldsValley Heathy Forest","Gold0127",70,20,15,30,0,5,2,10,null,null,7,15,5,5,2,1,null,null,6,10,3,5,3,5,2,20,6,15,1,1,null,null,null,null,1,1,null,null,null,null,3,5,0,10,null,null,"Episodic",30,14,14,9,30,40,200,1,1,127,"En","Endangered",1,0,0,"Gold0127","Forest/Woodland","Woody vegetation"]
["Goldfields","Gold","Wetland Formation","GoldfieldsWetland Formation","Gold0074",null,null,0,null,null,null,null,null,null,null,null,null,null,null,null,null,null,null,null,null,null,null,null,null,null,null,null,null,null,null,null,null,null,null,null,null,null,null,null,null,null,null,null,null,null,null,null,5,0,null,null,null,null,0,1.36,1.36,74,"En","Endangered",6,0,0,"Gold0074","wetlands","Non-woody wetland vegetation"]
["Greater Grampians","GGr_","Alluvial Terraces Herb-rich Woodland","Greater GrampiansAlluvial Terraces Herb-rich Woodland","GGr_0067",70,10,15,15,0,5,1,10,null,null,5,15,4,5,2,5,2,5,15,15,8,10,2,5,null,null,10,15,4,10,null,null,null,null,null,null,null,null,null,null,null,null,0,10,"0","10","Continuous",0,13,10,25,30,10,150,1,1,67,"LC","Least Concern",1,0,0,"GGr_0067","Forest/Woodland","Woody vegetation"]
["Greater Grampians","GGr_","Aquatic Herbland","Greater GrampiansAquatic Herbland","GGr_0653",0,0,0,null,null,null,null,null,null,null,null,null,null,null,null,null,2,10,5,40,2,10,null,null,1,5,4,10,2,15,null,null,null,null,null,null,null,null,null,null,null,null,null,null,null,null,"Episodic",5,6,null,9,null,10,0,1.36,1.36,653,"En","Endangered",6,0,0,"GGr_0653","wetlands","Non-woody wetland vegetation"]
["Greater Grampians","GGr_","Basalt Shrubby Woodland","Greater GrampiansBasalt Shrubby Woodland","GGr_0642",70,15,15,15,0,5,2,10,null,null,2,5,null,null,2,1,2,1,10,15,5,10,3,5,1,5,10,25,3,10,null,null,null,null,1,15,null,null,null,null,null,null,0,10,"0","10","Continuous",0,14,4,17,15,20,150,1,1,642,"En","Endangered",1,0,0,"GGr_0642","Forest/Woodland","Woody vegetation"]
["Greater Grampians","GGr_","Claypan Ephemeral Wetland","Greater GrampiansClaypan Ephemeral Wetland","GGr_0284",0,0,0,null,null,null,null,null,null,null,null,null,null,null,null,null,null,null,3,20,7,15,null,null,null,null,4,20,1,1,null,null,null,null,null,null,null,null,null,null,null,null,null,null,"0","10","Episodic",5,5,null,10,null,10,0,1.36,1.36,284,"Vu","Vulnerable",6,0,0,"GGr_0284","wetlands","Non-woody wetland vegetation"]
["Greater Grampians","GGr_","Creekline Grassy Woodland","Greater GrampiansCreekline Grassy Woodland","GGr_0068",80,15,15,15,0,5,2,15,null,null,5,10,1,1,null,null,2,5,6,10,3,5,2,10,1,5,10,30,3,10,null,null,null,null,null,null,null,null,null,null,3,10,0,10,null,null,"Continuous",0,13,8,11,26,40,200,1,1,68,"En","Endangered",1,0,0,"GGr_0068","Forest/Woodland","Woody vegetation"]
["Greater Grampians","GGr_","Creekline Sedgy Woodland","Greater GrampiansCreekline Sedgy Woodland","GGr_0640",80,15,15,15,0,5,2,10,null,null,2,5,2,1,null,null,2,5,5,10,1,1,3,15,1,5,6,20,null,null,null,null,null,null,null,null,null,null,null,null,null,null,0,10,null,null,"Continuous",0,11,6,8,16,40,200,1,1,640,"En","Endangered",1,0,0,"GGr_0640","Forest/Woodland","Woody vegetation"]
["Greater Grampians","GGr_","Damp Forest","Greater GrampiansDamp Forest","GGr_0029",90,20,30,40,0,5,1,10,null,null,3,10,null,null,null,null,1,5,3,10,null,null,null,null,1,5,1,5,1,10,null,null,null,null,2,20,"1","5",null,null,1,5,0,20,null,null,"Continuous",0,12,4,4,20,50,300,1,1,29,"LC","Least Concern",1,0,0,"GGr_0029","Forest/Woodland","Woody vegetation"]
["Greater Grampians","GGr_","Damp Heath Scrub","Greater GrampiansDamp Heath Scrub","GGr_0165",0,0,0,null,null,null,null,null,null,null,8,40,5,10,null,null,1,1,2,5,1,0,3,10,1,5,4,10,3,30,null,null,null,null,null,null,null,null,null,null,null,null,0,10,null,null,"Episodic",20,10,13,4,50,40,0,1.36,1.36,165,"LC","Least Concern",4,0,0,"GGr_0165","heathlands","Woody vegetation"]
["Greater Grampians","GGr_","Damp Heathland","Greater GrampiansDamp Heathland","GGr_0710",0,0,0,null,null,null,null,null,null,null,6,30,5,20,2,5,null,null,6,10,2,1,1,5,1,1,4,10,3,15,null,null,null,null,null,null,null,null,null,null,2,5,0,10,"0","10","Episodic",30,12,11,8,50,20,0,1.36,1.36,710,"LC","Least Concern",4,0,0,"GGr_0710","heathlands","Woody vegetation"]
["Greater Grampians","GGr_","Damp Sands Herb-rich Woodland","Greater GrampiansDamp Sands Herb-rich Woodland","GGr_0003",70,15,15,15,0,5,1,5,null,null,6,30,3,5,1,1,null,null,6,10,5,5,2,10,null,null,2,5,2,10,null,null,null,null,1,10,null,null,null,null,null,null,0,20,null,null,"Continuous",0,12,10,11,40,40,150,1,1,3,"LC","Least Concern",1,0,0,"GGr_0003","Forest/Woodland","Woody vegetation"]
["Greater Grampians","GGr_","Dry Creekline Woodland","Greater GrampiansDry Creekline Woodland","GGr_0285",70,15,15,20,0,5,null,null,null,null,4,20,null,null,null,null,1,1,5,10,3,0,1,5,null,null,5,20,2,5,"2","1",null,null,null,null,null,null,null,null,null,null,0,20,null,null,"Continuous",0,10,4,9,20,20,200,1,1,285,"En","Endangered",1,0,0,"GGr_0285","Forest/Woodland","Woody vegetation"]
["Greater Grampians","GGr_","Floodplain Thicket","Greater GrampiansFloodplain Thicket","GGr_0280",80,10,15,10,0,5,1,5,null,null,8,50,1,5,null,null,1,5,2,1,1,1,4,15,null,null,2,5,3,15,null,null,null,null,null,null,null,null,null,null,null,null,0,20,null,null,"Episodic",5,11,10,4,60,20,100,1,1,280,"LC","Least Concern",1,0,0,"GGr_0280","Forest/Woodland","Woody vegetation"]
["Greater Grampians","GGr_","Freshwater Meadow","Greater GrampiansFreshwater Meadow","GGr_0680",null,null,0,null,null,null,null,null,null,null,null,null,null,null,null,null,null,null,null,null,null,null,null,null,null,null,null,null,null,null,null,null,null,null,null,null,null,null,null,null,null,null,null,null,null,null,null,0,0,null,null,null,null,0,1.36,1.36,680,"En","Endangered",6,0,0,"GGr_0680","wetlands","Non-woody wetland vegetation"]
["Greater Grampians","GGr_","Grassy Dry Forest","Greater GrampiansGrassy Dry Forest","GGr_0022",60,20,20,30,0,5,2,5,null,null,3,10,3,5,2,5,3,5,7,20,3,5,2,5,null,null,6,25,1,5,null,null,null,null,1,1,null,null,null,null,1,1,0,10,"0","10","Continuous",0,15,8,13,20,20,200,1,1,22,"D","Depleted",1,0,0,"GGr_0022","Forest/Woodland","Woody vegetation"]
["Greater Grampians","GGr_","Grassy Woodland","Greater GrampiansGrassy Woodland","GGr_0175",70,15,15,15,0,5,2,10,null,null,2,10,2,1,2,5,2,5,8,20,3,5,1,1,null,null,8,40,1,5,null,null,null,null,null,null,null,null,null,null,1,1,0,10,null,null,"Continuous",0,13,6,13,21,20,150,1,1,175,"En","Endangered",1,0,0,"GGr_0175","Forest/Woodland","Woody vegetation"]
["Greater Grampians","GGr_","Heathland Thicket","Greater GrampiansHeathland Thicket","GGr_0279",0,0,0,null,null,null,null,null,null,null,8,50,4,10,1,1,2,5,3,5,null,null,1,5,null,null,4,10,2,5,null,null,null,null,null,null,null,null,null,null,2,1,0,10,null,null,"Episodic",30,10,12,5,60,20,0,1.36,1.36,279,"LC","Least Concern",4,0,0,"GGr_0279","heathlands","Woody vegetation"]
["Greater Grampians","GGr_","Heathy Dry Forest","Greater GrampiansHeathy Dry Forest","GGr_0020",60,20,20,30,0,5,1,5,null,null,13,25,12,20,3,5,null,null,10,20,3,5,1,5,2,5,7,10,2,5,null,null,null,null,1,1,null,null,null,null,2,5,0,10,"0","10","Episodic",20,15,26,13,50,20,200,1,1,20,"LC","Least Concern",1,0,0,"GGr_0020","Forest/Woodland","Woody vegetation"]
["Greater Grampians","GGr_","Heathy Woodland","Greater GrampiansHeathy Woodland","GGr_0048",60,15,10,15,0,5,null,null,null,null,10,40,10,20,3,5,1,1,6,10,2,1,2,5,1,5,6,10,2,10,null,null,null,null,null,null,null,null,null,null,2,5,0,10,"0","10","Episodic",20,14,20,9,60,40,150,1,1,48,"LC","Least Concern",1,0,0,"GGr_0048","Forest/Woodland","Woody vegetation"]
["Greater Grampians","GGr_","Herb-rich Foothill Forest",{"$f":"CONCATENATE(A451,C451)","v":"Greater GrampiansHerb-rich Foothill Forest"},"GGr_0023",70,20,25,40,0,5,2,10,null,null,7,25,2,1,null,null,4,5,10,15,3,5,2,5,1,5,3,10,2,5,null,null,null,null,3,10,null,null,null,null,2,5,0,20,null,null,"Continuous",0,14,11,17,36,40,200,1,1,23,"D","Depleted",1,0,0,"GGr_0023","Forest/Woodland","Woody vegetation"]
["Greater Grampians","GGr_","Herb-rich Heathy Forest","Greater GrampiansHerb-rich Heathy Forest","GGr_0278",70,20,15,30,0,5,null,null,null,null,10,20,5,5,2,5,3,5,10,20,5,5,3,5,null,null,8,15,2,10,null,null,null,null,2,5,null,null,null,null,3,5,0,20,null,null,"Episodic",30,13,15,18,25,40,200,1,1,278,"LC","Least Concern",1,0,0,"GGr_0278","Forest/Woodland","Woody vegetation"]
["Greater Grampians","GGr_","Hills Herb-rich Woodland","Greater GrampiansHills Herb-rich Woodland","GGr_0071",70,15,15,15,0,5,1,5,null,null,6,10,6,10,3,5,4,5,15,25,5,10,2,5,null,null,8,15,2,5,null,null,null,null,null,null,null,null,null,null,null,null,0,10,"0","10","Continuous",0,13,13,24,25,20,150,1,1,71,"LC","Least Concern",1,0,0,"GGr_0071","Forest/Woodland","Woody vegetation"]
["Greater Grampians","GGr_","Lateritic Woodland","Greater GrampiansLateritic Woodland","GGr_0704",70,15,15,15,0,5,1,5,null,null,11,25,11,20,4,5,2,5,14,10,4,5,3,10,null,null,15,20,4,10,"4","1",null,null,null,null,null,null,null,null,3,5,0,10,"0","10","Continuous",0,15,23,20,50,20,150,1,1,704,"D","Depleted",1,0,0,"GGr_0704","Forest/Woodland","Woody vegetation"]
["Greater Grampians","GGr_","Lowland Forest","Greater GrampiansLowland Forest","GGr_0016",70,20,25,30,0,5,2,10,null,null,14,30,6,10,2,5,1,1,8,15,2,5,2,5,1,5,5,10,2,5,null,null,null,null,2,5,null,null,null,null,3,5,0,10,null,null,"Continuous",0,15,22,11,50,40,200,1,1,16,"LC","Least Concern",1,0,0,"GGr_0016","Forest/Woodland","Woody vegetation"]
["Greater Grampians","GGr_","Montane Grassy Woodland","Greater GrampiansMontane Grassy Woodland","GGr_0037",0,20,5,20,null,null,null,null,null,null,6,20,3,10,2,5,2,5,15,20,3,10,2,5,null,null,7,20,1,1,null,null,null,null,null,null,null,null,null,null,null,null,0,10,"0","10","Continuous",0,11,9,20,30,20,150,1,1,37,"LC","Least Concern",1,0,0,"GGr_0037","Forest/Woodland","Woody vegetation"]
["Greater Grampians","GGr_","Montane Rocky Shrubland","Greater GrampiansMontane Rocky Shrubland","GGr_0192",0,15,0,null,null,null,null,null,null,null,10,40,4,10,1,1,null,null,2,1,null,null,2,5,null,null,4,5,1,1,null,null,null,null,null,null,null,null,"1","1",null,null,0,20,null,null,"Episodic",30,9,14,2,50,40,100,1.25,1.25,192,"LC","Least Concern",3,0,0,"GGr_0192","scrubs/shrublands/mallee without logs","Woody vegetation"]
["Greater Grampians","GGr_","Montane Wet Heathland","Greater GrampiansMontane Wet Heathland","GGr_0184",0,0,0,null,null,null,null,null,null,null,6,40,2,5,null,null,null,null,2,1,null,null,1,5,null,null,4,20,2,20,null,null,null,null,null,null,null,null,null,null,null,null,0,20,null,null,"Episodic",30,7,8,2,45,20,0,1.36,1.36,184,"LC","Least Concern",4,0,0,"GGr_0184","heathlands","Woody vegetation"]
["Greater Grampians","GGr_","Plains Grassy Wetland","Greater GrampiansPlains Grassy Wetland","GGr_0125",0,0,0,null,null,null,null,null,null,null,null,null,null,null,null,null,6,10,11,20,4,10,2,10,null,null,11,30,2,10,"2","1",null,null,null,null,null,null,null,null,null,null,0,10,null,null,"Episodic",5,8,null,21,null,10,50,1.36,1.36,125,"En","Endangered",6,"y",0,"GGr_0125","wetlands","Non-woody wetland vegetation"]
["Greater Grampians","GGr_","Plains Grassy Woodland","Greater GrampiansPlains Grassy Woodland","GGr_0055",80,15,15,15,0,5,1,1,null,null,1,5,2,5,1,1,1,1,18,25,4,10,3,5,null,null,15,40,4,5,null,null,null,null,null,null,null,null,null,null,null,null,0,10,null,null,"Continuous",0,12,4,23,11,10,100,1,1,55,"Vu","Vulnerable",1,0,0,"GGr_0055","Forest/Woodland","Woody vegetation"]
["Greater Grampians","GGr_","Plains Sedgy Wetland","Greater GrampiansPlains Sedgy Wetland","GGr_0647",0,0,0,null,null,null,null,null,null,null,null,null,null,null,null,null,2,5,5,40,5,10,2,5,1,5,4,25,2,5,null,null,null,null,null,null,null,null,null,null,null,null,null,null,null,null,"Episodic",5,7,null,12,null,10,50,1.36,1.36,647,"En","Endangered",6,0,0,"GGr_0647","wetlands","Non-woody wetland vegetation"]
["Greater Grampians","GGr_","Plains Sedgy Woodland","Greater GrampiansPlains Sedgy Woodland","GGr_0283",70,15,15,10,0,5,null,null,null,null,2,5,2,1,null,null,4,15,10,20,2,5,2,1,1,1,13,30,4,20,null,null,null,null,null,null,null,null,null,null,null,null,0,10,null,null,"Continuous",0,11,4,16,6,10,150,1,1,283,"Vu","Vulnerable",1,0,0,"GGr_0283","Forest/Woodland","Woody vegetation"]
["Greater Grampians","GGr_","Plains Woodland","Greater GrampiansPlains Woodland","GGr_0803",70,15,15,15,0,5,null,null,null,null,2,5,2,5,1,1,1,1,20,25,4,10,1,5,1,1,16,30,3,5,null,null,null,null,null,null,null,null,null,null,null,null,0,10,null,null,"Continuous",0,12,4,25,10,20,100,1,1,803,"En","Endangered",1,0,0,"GGr_0803","Forest/Woodland","Woody vegetation"]
["Greater Grampians","GGr_","Red Gum Swamp","Greater GrampiansRed Gum Swamp","GGr_0292",80,10,15,15,0,5,null,null,null,null,null,null,null,null,null,null,2,10,7,25,2,1,2,15,null,null,6,20,2,15,null,null,null,null,null,null,null,null,null,null,null,null,null,null,null,null,"Episodic",5,7,null,11,null,10,100,1,1,292,"Vu","Vulnerable",1,0,0,"GGr_0292","Forest/Woodland","Woody vegetation"]
["Greater Grampians","GGr_","Riparian Forest","Greater GrampiansRiparian Forest","GGr_0018",80,20,30,40,0,5,2,10,null,null,8,20,2,1,null,null,null,null,3,5,1,1,4,20,null,null,3,5,3,5,null,null,null,null,5,25,"1","5",null,null,1,1,0,20,null,null,"Continuous",0,13,12,4,31,50,300,1,1,18,"D","Depleted",1,0,0,"GGr_0018","Forest/Woodland","Woody vegetation"]
["Greater Grampians","GGr_","Riparian Scrub","Greater GrampiansRiparian Scrub","GGr_0191",0,0,0,null,null,null,null,null,null,null,6,20,3,5,null,null,2,1,4,5,2,1,2,20,null,null,3,5,5,10,"1","0",null,null,1,5,null,null,null,null,3,15,0,20,null,null,"Continuous",0,12,9,8,25,40,0,1.25,1.25,191,"LC","Least Concern",3,0,0,"GGr_0191","scrubs/shrublands/mallee without logs","Woody vegetation"]
["Greater Grampians","GGr_","Riparian Shrubland","Greater GrampiansRiparian Shrubland","GGr_0019",0,20,0,null,null,null,null,null,null,null,6,40,null,null,null,null,2,5,6,10,2,5,3,10,null,null,3,10,2,1,null,null,null,null,2,5,null,null,null,null,2,5,0,10,null,null,"Episodic",5,10,6,10,40,20,100,1.25,1.25,19,"LC","Least Concern",3,0,0,"GGr_0019","scrubs/shrublands/mallee without logs","Woody vegetation"]
["Greater Grampians","GGr_","Riparian Woodland","Greater GrampiansRiparian Woodland","GGr_0641",80,15,15,10,0,5,2,10,null,null,2,10,1,1,null,null,4,10,5,10,1,5,3,10,null,null,4,30,2,5,null,null,null,null,null,null,null,null,null,null,1,5,0,10,null,null,"Continuous",0,12,5,10,21,30,200,1,1,641,"En","Endangered",1,0,0,"GGr_0641","Forest/Woodland","Woody vegetation"]
["Greater Grampians","GGr_","Rocky Outcrop Herbland","Greater GrampiansRocky Outcrop Herbland","GGr_0193",0,0,0,null,null,null,2,10,null,null,4,10,4,5,2,1,1,1,3,5,null,null,2,5,null,null,3,5,2,5,null,null,null,null,1,1,null,null,null,null,1,1,0,40,null,null,"Continuous",0,12,10,4,25,10,0,1.36,1.36,193,"LC","Least Concern",5,"y",0,"GGr_0193","grasslands","Other grassland vegetation"]
["Greater Grampians","GGr_","Rocky Outcrop Shrubland","Greater GrampiansRocky Outcrop Shrubland","GGr_0028",0,0,0,null,null,null,null,null,null,null,13,55,7,15,2,5,1,1,4,5,2,1,2,5,null,null,6,10,2,5,null,null,null,null,null,null,null,null,null,null,1,1,0,20,"0","10","Continuous",0,12,20,7,70,40,0,1.36,1.36,28,"LC","Least Concern",4,0,0,"GGr_0028","heathlands","Woody vegetation"]
["Greater Grampians","GGr_","Sand Forest","Greater GrampiansSand Forest","GGr_0134",70,15,20,30,0,5,1,5,null,null,3,5,1,5,2,5,null,null,2,5,null,null,1,1,null,null,7,15,2,1,null,null,null,null,1,50,null,null,null,null,null,null,0,10,null,null,"Continuous",0,11,5,2,15,40,150,1,1,134,"En","Endangered",1,0,0,"GGr_0134","Forest/Woodland","Woody vegetation"]
["Greater Grampians","GGr_","Sand Heathland","Greater GrampiansSand Heathland","GGr_0006",0,0,0,null,null,null,null,null,null,null,9,45,9,20,2,1,1,1,5,10,2,1,2,10,1,5,5,15,3,15,null,null,null,null,null,null,null,null,null,null,1,1,0,10,"0","10","Episodic",30,13,18,8,65,20,0,1.36,1.36,6,"LC","Least Concern",4,0,0,"GGr_0006","heathlands","Woody vegetation"]
["Greater Grampians","GGr_","Seasonally Inundated Shrubby Woodland","Greater GrampiansSeasonally Inundated Shrubby Woodland","GGr_0195",70,15,15,15,0,5,null,null,null,null,7,40,6,20,1,1,null,null,4,10,1,1,null,null,null,null,5,15,2,10,null,null,null,null,null,null,null,null,null,null,null,null,0,10,"0","10","Continuous",0,10,13,5,60,20,150,1,1,195,"LC","Least Concern",1,0,0,"GGr_0195","Forest/Woodland","Woody vegetation"]
["Greater Grampians","GGr_","Sedge Wetland","Greater GrampiansSedge Wetland","GGr_0136",80,5,15,10,0,5,null,null,null,null,1,5,null,null,null,null,1,1,1,1,null,null,1,1,1,10,2,15,2,35,null,null,null,null,null,null,null,null,null,null,1,5,null,null,null,null,"Episodic",5,9,1,2,5,0,0,1.36,1.36,136,"En","Endangered",6,0,0,"GGr_0136","wetlands","Non-woody wetland vegetation"]
["Greater Grampians","GGr_","Sedge-rich Wetland","Greater GrampiansSedge-rich Wetland","GGr_0281",null,0,0,null,null,null,null,null,null,null,null,null,null,null,null,null,null,null,null,null,null,null,null,null,null,null,null,null,null,null,null,null,null,null,null,null,null,null,null,null,null,null,null,null,null,null,null,0,0,null,null,null,0,0,0,{"$error":"#N/A"},{"$error":"#N/A"},{"$error":"#N/A"},{"$error":"#N/A"},{"$error":"#N/A"},{"$error":"#N/A"},{"$error":"#N/A"},{"$error":"#N/A"},{"$error":"#N/A"},{"$error":"#N/A"}]
["Greater Grampians","GGr_","Sedgy Riparian Woodland","Greater GrampiansSedgy Riparian Woodland","GGr_0198",70,15,15,20,0,5,3,15,null,null,6,25,1,5,1,1,null,null,5,10,null,null,3,20,1,5,3,5,2,10,null,null,null,null,2,10,null,null,null,null,null,null,0,20,null,null,"Continuous",0,12,10,5,45,30,200,1,1,198,"LC","Least Concern",1,0,0,"GGr_0198","Forest/Woodland","Woody vegetation"]
["Greater Grampians","GGr_","Semi-permanent Saline","Greater GrampiansSemi-permanent Saline","GGr_0683",null,0,0,null,null,null,null,null,null,null,null,null,null,null,null,null,null,null,null,null,null,null,null,null,null,null,null,null,null,null,null,null,null,null,null,null,null,null,null,null,null,null,null,null,null,null,null,0,0,null,null,null,0,0,0,{"$error":"#N/A"},{"$error":"#N/A"},{"$error":"#N/A"},{"$error":"#N/A"},{"$error":"#N/A"},{"$error":"#N/A"},{"$error":"#N/A"},{"$error":"#N/A"},{"$error":"#N/A"},{"$error":"#N/A"}]
["Greater Grampians","GGr_","Shallow Freshwater Marsh","Greater GrampiansShallow Freshwater Marsh","GGr_0200",null,null,0,null,null,null,null,null,null,null,null,null,null,null,null,null,null,null,null,null,null,null,null,null,null,null,null,null,null,null,null,null,null,null,null,null,null,null,null,null,null,null,null,null,null,null,null,5,0,null,null,null,null,0,1.36,1.36,200,"Vu","Vulnerable",6,0,0,"GGr_0200","wetlands","Non-woody wetland vegetation"]
["Greater Grampians","GGr_","Shallow Sands Woodland","Greater GrampiansShallow Sands Woodland","GGr_0882",70,15,15,15,0,5,1,5,null,null,5,20,6,15,3,5,3,5,19,20,4,5,2,5,null,null,13,20,4,5,null,null,null,null,null,null,null,null,null,null,null,null,0,10,"0","10","Continuous",0,13,12,26,40,20,150,1,1,882,"Vu","Vulnerable",1,0,0,"GGr_0882","Forest/Woodland","Woody vegetation"]
["Greater Grampians","GGr_","Shrubby Foothill Forest","Greater GrampiansShrubby Foothill Forest","GGr_0045",70,20,25,40,0,5,1,10,"1","1",13,40,5,10,3,5,1,1,5,10,null,null,2,5,1,10,6,15,2,5,null,null,null,null,2,5,null,null,null,null,2,5,0,10,null,null,"Episodic",30,15,19,6,60,40,200,1,1,45,"LC","Least Concern",1,0,0,"GGr_0045","Forest/Woodland","Woody vegetation"]
["Greater Grampians","GGr_","Shrubby Woodland","Greater GrampiansShrubby Woodland","GGr_0282",70,15,15,20,0,5,2,10,null,null,6,40,3,5,1,1,2,1,5,5,2,5,2,10,1,5,4,10,2,10,null,null,null,null,1,1,null,null,null,null,null,null,0,10,null,null,"Continuous",0,14,11,9,55,20,150,1,1,282,"LC","Least Concern",1,0,0,"GGr_0282","Forest/Woodland","Woody vegetation"]
["Greater Grampians","GGr_","Stony Rises Woodland","Greater GrampiansStony Rises Woodland","GGr_0203",null,0,0,null,null,null,null,null,null,null,null,null,null,null,null,null,null,null,null,null,null,null,null,null,null,null,null,null,null,null,null,null,null,null,null,null,null,null,null,null,null,null,null,null,null,null,null,0,0,null,null,null,0,0,1,1,203,"Vu","Vulnerable",1,0,0,"GGr_0203","Forest/Woodland","Woody vegetation"]
["Greater Grampians","GGr_","Swamp Scrub","Greater GrampiansSwamp Scrub","GGr_0053",0,0,0,50,null,null,null,null,null,null,2,10,1,1,null,null,5,5,9,15,3,10,2,15,2,5,4,15,3,15,null,null,null,null,2,5,null,null,null,null,1,5,0,20,null,null,"Continuous",0,12,3,17,11,40,0,1.25,1.1499999999999999,53,"En","Endangered",3,0,0,"GGr_0053","scrubs/shrublands/mallee without logs","Woody vegetation"]
["Greater Grampians","GGr_","Tall Marsh","Greater GrampiansTall Marsh","GGr_0821",0,0,0,null,null,null,null,null,null,null,null,null,null,null,null,null,3,10,2,5,6,10,1,5,2,40,null,null,1,1,null,null,null,null,null,null,null,null,null,null,null,null,null,null,null,null,"Episodic",5,6,null,11,null,10,0,1.36,{"$error":"#N/A"},{"$error":"#N/A"},{"$error":"#N/A"},{"$error":"#N/A"},{"$error":"#N/A"},{"$error":"#N/A"},{"$error":"#N/A"},{"$error":"#N/A"},{"$error":"#N/A"},{"$error":"#N/A"}]
["Greater Grampians","GGr_","Valley Grassy Forest","Greater GrampiansValley Grassy Forest","GGr_0047",70,20,25,20,0,5,3,10,null,null,10,20,5,5,2,5,3,5,16,20,5,5,3,5,1,1,8,15,2,10,null,null,null,null,2,5,null,null,"1","0",3,5,0,20,null,null,"Continuous",0,16,18,24,35,40,200,1,1,47,"Vu","Vulnerable",1,0,0,"GGr_0047","Forest/Woodland","Woody vegetation"]
["Greater Grampians","GGr_","Wet Forest","Greater GrampiansWet Forest","GGr_0030",90,20,30,40,0,5,2,20,null,null,4,15,1,1,null,null,2,5,3,5,null,null,2,5,1,5,2,5,2,5,null,null,null,null,6,20,"2","20","2","1",1,1,0,20,null,null,"Continuous",0,15,7,5,36,50,300,1,1,30,"LC","Least Concern",1,0,0,"GGr_0030","Forest/Woodland","Woody vegetation"]
["Greater Grampians","GGr_","Wet Heathland","Greater GrampiansWet Heathland","GGr_0008",0,0,0,null,null,null,null,null,null,null,8,35,5,10,1,1,2,5,5,10,2,1,3,15,1,5,5,10,5,15,"1","1",null,null,2,5,null,null,null,null,1,1,0,20,null,null,"Episodic",30,14,13,9,45,20,0,1.36,1.36,8,"Vu","Vulnerable",4,0,0,"GGr_0008","heathlands","Woody vegetation"]
["Highlands Far East","HFE_","Cool Temperate Rainforest","Highlands Far EastCool Temperate Rainforest","HFE_0031",70,20,25,50,0,5,2,20,null,null,2,5,null,null,null,null,2,10,2,5,null,null,null,null,null,null,null,null,null,null,null,null,null,null,6,25,"2","25","2","5",2,1,0,20,null,null,"Continuous",0,10,4,4,25,50,200,1,1,31,"Ra","Rare",1,0,0,"HFE_0031","Forest/Woodland","Woody vegetation"]
["Highlands Far East","HFE_","Cool Temperate Rainforest/Warm Temperate Rainf","Highlands Far EastCool Temperate Rainforest/Warm Temperate Rainf","HFE_0033",70,20,20,50,0,5,5,25,null,null,6,15,null,null,null,null,2,1,3,5,1,1,2,1,2,1,2,5,null,null,null,null,null,null,8,25,"3","20","4","5",7,20,0,20,null,null,"Continuous",0,14,11,6,40,50,200,1,1,33,"Ra","Rare",1,0,0,"HFE_0033","Forest/Woodland","Woody vegetation"]
["Highlands Far East","HFE_","Damp Forest","Highlands Far EastDamp Forest","HFE_0029",90,20,30,40,0,5,3,15,null,null,10,25,2,5,null,null,2,1,6,15,1,1,2,5,1,5,4,10,1,1,null,null,null,null,4,20,"1","5",null,null,4,10,0,20,null,null,"Continuous",0,15,15,9,45,50,300,1,1,29,"LC","Least Concern",1,0,0,"HFE_0029","Forest/Woodland","Woody vegetation"]
["Highlands Far East","HFE_","Lowland Forest","Highlands Far EastLowland Forest","HFE_0016",70,20,25,30,0,5,2,10,null,null,7,25,3,10,1,1,1,1,4,10,null,null,1,5,2,10,3,10,1,1,null,null,null,null,3,15,null,null,null,null,3,5,0,10,null,null,"Continuous",0,14,12,5,45,40,200,1,1,16,"LC","Least Concern",1,0,0,"HFE_0016","Forest/Woodland","Woody vegetation"]
["Highlands Far East","HFE_","Montane Damp Forest","Highlands Far EastMontane Damp Forest","HFE_0038",90,20,30,40,0,5,2,15,null,null,7,25,3,10,1,1,3,5,8,15,2,5,1,1,null,null,6,15,1,1,null,null,null,null,2,10,"1","1",null,null,1,5,0,20,null,null,"Continuous",0,15,12,13,50,50,300,1,1,38,"LC","Least Concern",1,0,0,"HFE_0038","Forest/Woodland","Woody vegetation"]
["Highlands Far East","HFE_","Montane Dry Woodland","Highlands Far EastMontane Dry Woodland","HFE_0036",50,15,15,20,0,5,2,20,"1","1",6,20,2,5,null,null,2,5,9,20,2,5,2,5,null,null,6,15,1,5,null,null,null,null,1,5,null,null,null,null,null,null,0,10,"0","10","Continuous",0,14,10,13,45,20,150,1,1,36,"LC","Least Concern",1,0,0,"HFE_0036","Forest/Woodland","Woody vegetation"]
["Highlands Far East","HFE_","Montane Grassy Woodland","Highlands Far EastMontane Grassy Woodland","HFE_0037",60,15,10,20,0,5,1,5,null,null,2,10,3,5,1,1,1,1,8,20,2,5,1,5,null,null,5,25,1,5,null,null,null,null,1,1,null,null,null,null,1,1,0,10,"0","10","Continuous",0,15,6,11,20,20,150,1,{"$error":"#N/A"},{"$error":"#N/A"},{"$error":"#N/A"},{"$error":"#N/A"},{"$error":"#N/A"},{"$error":"#N/A"},{"$error":"#N/A"},{"$error":"#N/A"},{"$error":"#N/A"},{"$error":"#N/A"}]
["Highlands Far East","HFE_","Montane Riparian Thicket","Highlands Far EastMontane Riparian Thicket","HFE_0041",0,0,0,null,null,null,null,null,null,null,3,5,null,null,null,null,null,null,null,null,2,1,2,40,null,null,2,1,null,null,null,null,null,null,3,20,"1","5","2","1",null,null,0,20,null,null,"Continuous",0,8,3,2,5,40,50,1.25,1.25,41,"LC","Least Concern",3,0,0,"HFE_0041","scrubs/shrublands/mallee without logs","Woody vegetation"]
["Highlands Far East","HFE_","Montane Riparian Woodland","Highlands Far EastMontane Riparian Woodland","HFE_0040",60,15,10,15,0,5,1,10,null,null,3,10,3,5,null,null,4,10,12,20,4,10,3,5,1,1,6,30,3,5,null,null,null,null,2,5,null,null,null,null,null,null,0,20,null,null,"Continuous",0,13,7,20,25,40,150,1,1,40,"Vu","Vulnerable",1,0,0,"HFE_0040","Forest/Woodland","Woody vegetation"]
["Highlands Far East","HFE_","Montane Wet Forest","Highlands Far EastMontane Wet Forest","HFE_0039",90,20,30,40,0,5,5,30,null,null,5,25,1,1,null,null,null,null,3,5,null,null,1,1,1,1,2,10,null,null,null,null,null,null,4,30,"2","10",null,null,1,1,0,20,null,null,"Continuous",0,12,11,3,56,50,300,1,1,39,"LC","Least Concern",1,0,0,"HFE_0039","Forest/Woodland","Woody vegetation"]
["Highlands Far East","HFE_","Riparian Forest","Highlands Far EastRiparian Forest","HFE_0018",80,20,30,40,0,5,4,20,null,null,11,30,null,null,null,null,3,5,9,10,2,5,3,5,1,5,6,10,2,5,null,null,null,null,4,15,"2","5",null,null,5,10,0,10,null,null,"Continuous",0,14,15,14,50,50,300,1,1,18,"LC","Least Concern",1,0,0,"HFE_0018","Forest/Woodland","Woody vegetation"]
["Highlands Far East","HFE_","Rocky Outcrop Shrubland","Highlands Far EastRocky Outcrop Shrubland","HFE_0028",0,0,0,null,null,null,null,null,null,null,10,50,3,15,1,1,3,5,3,5,null,null,1,5,null,null,5,10,null,null,null,null,null,null,null,null,null,null,null,null,1,1,0,10,"0","10","Continuous",0,10,13,6,65,40,100,1.36,1.36,28,"Ra","Rare",4,0,0,"HFE_0028","heathlands","Woody vegetation"]
["Highlands Far East","HFE_","Shrubby Dry Forest","Highlands Far EastShrubby Dry Forest","HFE_0021",70,20,25,30,0,5,1,10,null,null,6,30,2,5,null,null,null,null,5,5,null,null,1,1,2,5,3,10,1,1,null,null,null,null,2,5,null,null,null,null,3,5,0,10,"0","10","Episodic",20,13,9,5,45,30,200,1,1,21,"LC","Least Concern",1,0,0,"HFE_0021","Forest/Woodland","Woody vegetation"]
["Highlands Far East","HFE_","Tableland Damp Forest","Highlands Far EastTableland Damp Forest","HFE_0035",90,20,30,40,0,5,3,20,null,null,7,20,2,10,null,null,2,5,8,15,2,15,1,5,1,1,3,15,1,5,null,null,null,null,2,5,null,null,null,null,1,1,0,20,null,null,"Continuous",0,14,12,12,50,50,300,1,1,35,"LC","Least Concern",1,0,0,"HFE_0035","Forest/Woodland","Woody vegetation"]
["Highlands Far East","HFE_","Valley Grassy Forest","Highlands Far EastValley Grassy Forest","HFE_0047",70,20,25,20,0,5,3,15,null,null,7,25,1,1,2,1,3,5,10,20,3,5,3,15,null,null,5,20,2,5,null,null,null,null,2,5,null,null,null,null,5,5,0,20,null,null,"Continuous",0,14,11,16,41,20,200,1,1,47,"D","Depleted",1,0,0,"HFE_0047","Forest/Woodland","Woody vegetation"]
["Highlands Far East","HFE_","Warm Temperate Rainforest","Highlands Far EastWarm Temperate Rainforest","HFE_0032",70,20,20,50,0,5,5,25,null,null,6,15,null,null,null,null,2,1,5,10,1,1,1,1,1,1,2,5,1,1,null,null,null,null,8,25,"2","20","4","5",9,20,0,20,null,null,"Continuous",0,15,11,8,40,50,200,1,1,32,"Ra","Rare",1,0,0,"HFE_0032","Forest/Woodland","Woody vegetation"]
["Highlands Far East","HFE_","Wet Forest","Highlands Far EastWet Forest","HFE_0030",90,20,50,40,0,5,4,20,null,null,7,25,null,null,null,null,1,1,5,15,1,1,1,1,1,1,3,5,1,1,null,null,null,null,4,30,"2","15","1","1",4,10,0,20,null,null,"Continuous",0,15,11,7,45,50,300,1,1,30,"LC","Least Concern",1,0,0,"HFE_0030","Forest/Woodland","Woody vegetation"]
["Highlands Northern Fall","HNF_","Blackthorn Scrub","Highlands Northern FallBlackthorn Scrub","HNF_0027",null,0,0,null,null,null,null,null,null,null,null,null,null,null,null,null,null,null,null,null,null,null,null,null,null,null,null,null,null,null,null,null,null,null,null,null,null,null,null,null,null,null,null,null,null,null,null,0,0,null,null,null,0,0,1.25,1.25,27,"Ra","Rare",3,0,0,"HNF_0027","scrubs/shrublands/mallee without logs","Woody vegetation"]
["Highlands Northern Fall","HNF_","Clay Heathland","Highlands Northern FallClay Heathland","HNF_0007",0,0,0,null,null,null,null,null,null,null,9,30,6,10,3,5,2,1,8,10,null,null,4,10,1,5,7,10,2,5,null,null,null,null,null,null,null,null,null,null,null,null,0,10,"0","10","Episodic",30,11,15,10,40,20,0,1.36,1.36,7,"Vu","Vulnerable",4,0,0,"HNF_0007","heathlands","Woody vegetation"]
["Highlands Northern Fall","HNF_","Cool Temperate Rainforest","Highlands Northern FallCool Temperate Rainforest","HNF_0031",70,20,25,50,0,5,2,10,null,null,4,10,null,null,null,null,null,null,3,5,null,null,1,1,1,5,1,1,null,null,null,null,null,null,6,25,"2","25","3","5",2,1,0,20,null,null,"Continuous",0,12,6,3,20,50,200,1,1,31,"En","Endangered",1,0,0,"HNF_0031","Forest/Woodland","Woody vegetation"]
["Highlands Northern Fall","HNF_","Creekline Grassy Woodland","Highlands Northern FallCreekline Grassy Woodland","HNF_0068",80,15,15,15,0,5,1,5,null,null,4,10,3,5,null,null,2,5,9,15,3,5,3,15,1,5,15,30,3,5,null,null,null,null,null,null,null,null,null,null,null,null,0,10,null,null,"Continuous",0,12,8,14,20,40,300,1,1,68,"En","Endangered",1,0,0,"HNF_0068","Forest/Woodland","Woody vegetation"]
["Highlands Northern Fall","HNF_","Damp Forest","Highlands Northern FallDamp Forest","HNF_0029",90,20,30,40,0,5,5,30,null,null,6,15,null,null,null,null,2,1,8,15,2,1,1,1,1,5,2,5,1,1,null,null,null,null,3,15,"1","5",null,null,2,5,0,20,null,null,"Continuous",0,14,11,12,45,50,300,1,1,29,"LC","Least Concern",1,0,0,"HNF_0029","Forest/Woodland","Woody vegetation"]
["Highlands Northern Fall","HNF_","Damp Sands Herb-rich Woodland","Highlands Northern FallDamp Sands Herb-rich Woodland","HNF_0003",70,15,15,15,0,5,1,10,null,null,3,10,3,5,null,null,null,null,12,20,7,15,1,10,null,null,10,15,2,10,null,null,null,null,1,10,null,null,null,null,null,null,0,10,null,null,"Continuous",0,11,7,19,25,40,150,1,1,3,"Vu","Vulnerable",1,0,0,"HNF_0003","Forest/Woodland","Woody vegetation"]
["Highlands Northern Fall","HNF_","Dry Valley Forest","Highlands Northern FallDry Valley Forest","HNF_0169",70,20,20,30,0,5,4,15,null,null,9,30,3,10,1,1,4,5,11,15,3,5,3,5,null,null,4,15,1,1,null,null,null,null,3,10,"1","5",null,null,2,5,0,10,null,null,"Continuous",0,15,16,18,55,40,200,1,1,169,"Vu","Vulnerable",1,0,0,"HNF_0169","Forest/Woodland","Woody vegetation"]
["Highlands Northern Fall","HNF_","Floodplain Riparian Woodland","Highlands Northern FallFloodplain Riparian Woodland","HNF_0056",80,15,20,15,0,5,2,10,null,null,6,15,1,1,null,null,4,10,4,10,1,1,3,10,2,10,3,10,3,10,null,null,null,null,1,5,null,null,null,null,1,5,0,10,null,null,"Episodic",10,14,9,9,26,40,300,1,1,56,"En","Endangered",1,0,0,"HNF_0056","Forest/Woodland","Woody vegetation"]
["Highlands Northern Fall","HNF_","Granitic Hills Woodland","Highlands Northern FallGranitic Hills Woodland","HNF_0072",60,15,10,15,0,5,1,5,null,null,4,20,3,20,null,null,2,5,11,20,null,null,null,null,null,null,4,5,3,5,null,null,null,null,1,1,null,null,null,null,null,null,0,10,null,null,"Continuous",0,10,8,13,45,20,150,1,1,72,"LC","Least Concern",1,0,0,"HNF_0072","Forest/Woodland","Woody vegetation"]
["Highlands Northern Fall","HNF_","Grassy Dry Forest","Highlands Northern FallGrassy Dry Forest","HNF_0022",60,20,20,30,0,5,1,5,null,null,4,10,3,5,2,1,4,5,12,25,3,5,2,5,null,null,8,20,2,1,null,null,null,null,2,5,null,null,null,null,2,1,0,10,"0","10","Continuous",0,15,8,19,20,20,200,1,1,22,"LC","Least Concern",1,0,0,"HNF_0022","Forest/Woodland","Woody vegetation"]
["Highlands Northern Fall","HNF_","Grassy Woodland",{"$f":"CONCATENATE(A515,C515)","v":"Highlands Northern FallGrassy Woodland"},"HNF_0175",70,15,15,20,0,5,1,5,null,null,3,20,1,1,null,null,5,10,4,10,null,null,2,1,null,null,8,30,1,1,null,null,null,null,2,1,null,null,null,null,1,5,0,10,"0","10","Continuous",0,13,5,9,26,20,150,1,1,175,"D","Depleted",1,0,0,"HNF_0175","Forest/Woodland","Woody vegetation"]
["Highlands Northern Fall","HNF_","Heathy Dry Forest","Highlands Northern FallHeathy Dry Forest","HNF_0020",60,20,20,30,0,5,1,5,null,null,8,20,4,10,2,5,2,1,5,5,null,null,1,5,null,null,6,10,null,null,null,null,null,null,1,1,null,null,null,null,1,5,0,10,"0","10","Episodic",20,13,13,7,35,20,200,1,1,20,"LC","Least Concern",1,0,0,"HNF_0020","Forest/Woodland","Woody vegetation"]
["Highlands Northern Fall","HNF_","Heathy Woodland","Highlands Northern FallHeathy Woodland","HNF_0048",60,15,10,15,0,5,null,null,null,null,7,40,6,20,1,1,null,null,4,5,null,null,2,10,1,5,4,10,null,null,null,null,null,null,1,1,null,null,null,null,null,null,0,10,"0","10","Episodic",20,11,13,4,60,40,150,1,1,48,"D","Depleted",1,0,0,"HNF_0048","Forest/Woodland","Woody vegetation"]
["Highlands Northern Fall","HNF_","Herb-rich Foothill Forest","Highlands Northern FallHerb-rich Foothill Forest","HNF_0023",70,20,25,40,0,5,2,10,null,null,7,15,3,5,2,5,3,5,11,20,3,5,2,5,1,1,6,10,2,5,null,null,null,null,2,10,null,null,null,null,2,5,0,20,null,null,"Continuous",0,15,12,17,30,40,200,1,1,23,"LC","Least Concern",1,0,0,"HNF_0023","Forest/Woodland","Woody vegetation"]
["Highlands Northern Fall","HNF_","Lake Bed Herbland","Highlands Northern FallLake Bed Herbland","HNF_0107",null,null,0,null,null,null,null,null,null,null,null,null,null,null,null,null,null,null,null,null,null,null,null,null,null,null,null,null,null,null,null,null,null,null,null,null,null,null,null,null,null,null,null,null,null,null,null,0,0,null,null,null,null,0,1.36,1.36,107,"En","Endangered",6,0,0,"HNF_0107","wetlands","Non-woody wetland vegetation"]
["Highlands Northern Fall","HNF_","Limestone Montane Grassland","Highlands Northern FallLimestone Montane Grassland","HNF_0702_61",0,0,0,null,null,null,null,null,null,null,2,5,1,1,1,1,3,5,11,20,3,10,null,null,null,null,6,20,2,5,null,null,null,null,2,5,null,null,null,null,null,null,0,20,"0","10","Continuous",0,11,3,17,6,10,0,1.36,{"$error":"#N/A"},{"$error":"#N/A"},{"$error":"#N/A"},{"$error":"#N/A"},{"$error":"#N/A"},{"$error":"#N/A"},{"$error":"#N/A"},{"$error":"#N/A"},{"$error":"#N/A"},{"$error":"#N/A"}]
["Highlands Northern Fall","HNF_","Lowland Forest","Highlands Northern FallLowland Forest","HNF_0016",70,20,25,30,0,5,2,10,null,null,6,20,3,5,1,5,1,1,5,10,2,5,2,1,1,10,2,5,1,5,null,null,null,null,2,5,null,null,null,null,1,1,0,10,null,null,"Continuous",0,15,11,8,35,40,200,1,1,16,"LC","Least Concern",1,0,0,"HNF_0016","Forest/Woodland","Woody vegetation"]
["Highlands Northern Fall","HNF_","Montane Damp Forest","Highlands Northern FallMontane Damp Forest","HNF_0038",90,20,30,40,0,5,3,15,null,null,7,20,2,1,1,5,4,5,12,20,2,5,1,1,null,null,6,20,1,5,null,null,null,null,2,15,null,null,null,null,2,5,0,20,null,null,"Continuous",0,14,12,18,36,80,300,1,1,38,"LC","Least Concern",1,0,0,"HNF_0038","Forest/Woodland","Woody vegetation"]
["Highlands Northern Fall","HNF_","Montane Dry Woodland","Highlands Northern FallMontane Dry Woodland","HNF_0036",50,15,15,20,0,5,2,20,null,null,5,20,2,5,2,5,3,5,9,15,null,null,2,5,null,null,6,15,null,null,null,null,null,null,1,5,null,null,null,null,2,1,0,10,"0","10","Continuous",0,13,9,12,45,20,150,1,1,36,"LC","Least Concern",1,0,0,"HNF_0036","Forest/Woodland","Woody vegetation"]
["Highlands Northern Fall","HNF_","Montane Grassland","Highlands Northern FallMontane Grassland","HNF_0702",null,null,null,null,null,null,null,null,null,null,null,null,null,null,null,null,null,null,null,null,null,null,null,null,null,null,null,null,null,null,null,null,null,null,null,null,null,null,null,null,null,null,null,null,null,null,null,null,0,null,null,null,null,0,1.36,1.36,702,"En","Endangered",5,0,0,"HNF_0702","grasslands","Other grassland vegetation"]
["Highlands Northern Fall","HNF_","Montane Grassland","Highlands Northern FallMontane Grassland","HNF_0702_62",0,0,0,null,null,null,null,null,null,null,null,null,null,null,1,1,3,5,11,20,3,10,null,null,null,null,6,20,2,5,null,null,null,null,null,null,null,null,null,null,null,null,0,20,"0","10","Continuous",0,8,null,17,null,10,0,1.36,{"$error":"#N/A"},{"$error":"#N/A"},{"$error":"#N/A"},{"$error":"#N/A"},{"$error":"#N/A"},{"$error":"#N/A"},{"$error":"#N/A"},{"$error":"#N/A"},{"$error":"#N/A"},{"$error":"#N/A"}]
["Highlands Northern Fall","HNF_","Montane Grassy Shrubland","Highlands Northern FallMontane Grassy Shrubland","HNF_0207",0,0,0,null,null,null,2,20,"1","1",6,20,2,5,null,null,2,5,9,20,2,5,2,5,null,null,6,15,1,5,null,null,null,null,1,5,null,null,null,null,null,null,0,10,"0","10","Continuous",0,13,10,13,45,20,150,1,1,207,"En","Endangered",1,0,0,"HNF_0207","Forest/Woodland","Woody vegetation"]
["Highlands Northern Fall","HNF_","Montane Grassy Woodland","Highlands Northern FallMontane Grassy Woodland","HNF_0037",50,15,10,20,0,5,1,5,null,null,6,20,3,10,2,5,4,10,15,20,3,10,2,5,null,null,7,20,1,1,null,null,null,null,1,1,null,null,null,null,null,null,0,10,"0","10","Continuous",0,14,10,22,35,20,150,1,1,37,"D","Depleted",1,0,0,"HNF_0037","Forest/Woodland","Woody vegetation"]
["Highlands Northern Fall","HNF_","Montane Herb-rich Woodland","Highlands Northern FallMontane Herb-rich Woodland","HNF_0319",70,15,25,40,0,5,2,10,null,null,6,15,2,5,1,1,5,10,12,20,3,5,1,5,null,null,8,25,1,1,null,null,null,null,3,10,null,null,null,null,2,5,0,20,null,null,"Continuous",0,14,10,20,30,20,150,1,1,319,"LC","Least Concern",1,0,0,"HNF_0319","Forest/Woodland","Woody vegetation"]
["Highlands Northern Fall","HNF_","Montane Riparian Thicket","Highlands Northern FallMontane Riparian Thicket","HNF_0041",0,0,0,null,null,null,null,null,null,null,4,10,null,null,null,null,null,null,4,5,2,1,2,5,null,null,3,5,null,null,null,null,null,null,5,35,"1","1",null,null,null,null,0,20,null,null,"Continuous",0,8,4,6,10,40,50,1.25,1.25,41,"Ra","Rare",3,0,0,"HNF_0041","scrubs/shrublands/mallee without logs","Woody vegetation"]
["Highlands Northern Fall","HNF_","Montane Riparian Woodland","Highlands Northern FallMontane Riparian Woodland","HNF_0040",60,15,10,15,0,5,1,10,null,null,3,10,3,5,null,null,4,10,12,20,4,10,3,5,1,1,6,30,3,5,null,null,null,null,2,5,null,null,null,null,null,null,0,20,null,null,"Continuous",0,13,7,20,25,40,150,1,1,40,"Vu","Vulnerable",1,0,0,"HNF_0040","Forest/Woodland","Woody vegetation"]
["Highlands Northern Fall","HNF_","Montane Swamp","Highlands Northern FallMontane Swamp","HNF_0318",0,0,0,null,null,null,null,null,null,null,5,20,2,5,null,null,1,1,3,10,2,5,1,5,null,null,4,10,4,15,null,null,null,null,1,1,null,null,null,null,null,null,0,40,null,null,"Episodic",30,10,7,6,25,10,0,1.36,1.36,318,"En","Endangered",6,0,0,"HNF_0318","wetlands","Non-woody wetland vegetation"]
["Highlands Northern Fall","HNF_","Montane Wet Forest","Highlands Northern FallMontane Wet Forest","HNF_0039",90,20,30,40,0,5,5,30,null,null,5,15,null,null,null,null,2,1,6,10,1,1,null,null,1,15,2,5,null,null,null,null,null,null,3,20,"2","5",null,null,2,1,0,20,null,null,"Continuous",0,12,10,9,45,50,300,1,1,39,"LC","Least Concern",1,0,0,"HNF_0039","Forest/Woodland","Woody vegetation"]
["Highlands Northern Fall","HNF_","Perched Boggy Shrubland","Highlands Northern FallPerched Boggy Shrubland","HNF_0185",0,0,0,null,null,null,null,null,null,null,6,50,null,null,null,null,2,1,6,10,2,5,4,10,1,5,3,10,2,5,null,null,null,null,2,10,null,null,null,null,null,null,0,30,null,null,"Continuous",0,10,6,10,50,20,0,1.36,1.36,185,"En","Endangered",4,0,0,"HNF_0185","heathlands","Woody vegetation"]
["Highlands Northern Fall","HNF_","Plains Grassy Woodland","Highlands Northern FallPlains Grassy Woodland","HNF_0055",80,10,15,10,0,5,1,5,null,null,3,10,2,1,1,1,3,5,8,15,3,5,2,5,null,null,12,45,2,5,null,null,null,null,null,null,null,null,null,null,null,null,0,10,"0","10","Continuous",0,13,6,14,16,10,100,1,1,55,"En","Endangered",1,0,0,"HNF_0055","Forest/Woodland","Woody vegetation"]
["Highlands Northern Fall","HNF_","Riparian Forest","Highlands Northern FallRiparian Forest","HNF_0018",80,20,30,40,0,5,4,20,null,null,7,15,1,1,null,null,2,1,10,15,3,1,4,5,1,5,3,5,2,1,null,null,null,null,5,25,"2","10",null,null,2,5,0,20,null,null,"Continuous",0,15,12,15,36,40,300,1,1,18,"LC","Least Concern",1,0,0,"HNF_0018","Forest/Woodland","Woody vegetation"]
["Highlands Northern Fall","HNF_","Riparian Scrub","Highlands Northern FallRiparian Scrub","HNF_0191",0,0,0,null,null,null,null,null,null,null,3,10,null,null,null,null,4,10,8,10,4,5,3,20,2,5,5,10,3,10,null,null,null,null,null,null,null,null,null,null,1,5,0,20,null,null,"Continuous",0,10,3,16,10,40,0,1.25,{"$error":"#N/A"},{"$error":"#N/A"},{"$error":"#N/A"},{"$error":"#N/A"},{"$error":"#N/A"},{"$error":"#N/A"},{"$error":"#N/A"},{"$error":"#N/A"},{"$error":"#N/A"},{"$error":"#N/A"}]
["Highlands Northern Fall","HNF_","Riparian Shrubland","Highlands Northern FallRiparian Shrubland","HNF_0019",0,0,0,null,null,null,null,null,null,null,9,20,null,null,null,null,null,null,2,5,null,null,1,10,null,null,4,5,1,1,null,null,null,null,4,10,"2","1",null,null,2,5,0,20,null,null,"Continuous",0,9,9,2,20,40,100,1.25,1.25,19,"Vu","Vulnerable",3,0,0,"HNF_0019","scrubs/shrublands/mallee without logs","Woody vegetation"]
["Highlands Northern Fall","HNF_","Riparian Thicket","Highlands Northern FallRiparian Thicket","HNF_0059",0,0,6,50,null,null,null,null,null,null,8,30,3,5,1,1,2,5,5,10,1,5,3,10,2,5,2,5,3,15,null,null,null,null,3,10,"1","5",null,null,2,5,0,20,null,null,"Continuous",0,14,11,8,35,40,0,1.25,1.36,59,"Vu","Vulnerable",4,0,0,"HNF_0059","heathlands","Woody vegetation"]
["Highlands Northern Fall","HNF_","Riverine Escarpment Scrub","Highlands Northern FallRiverine Escarpment Scrub","HNF_0082",0,0,0,null,0,5,null,null,null,null,8,30,1,1,2,1,2,5,12,20,3,5,4,15,null,null,3,10,2,5,null,null,null,null,3,10,null,null,null,null,null,null,0,10,null,null,"Continuous",0,12,9,17,31,40,50,1.25,1.25,82,"Vu","Vulnerable",3,0,0,"HNF_0082","scrubs/shrublands/mallee without logs","Woody vegetation"]
["Highlands Northern Fall","HNF_","Rocky Outcrop Shrubland","Highlands Northern FallRocky Outcrop Shrubland","HNF_0028",0,0,0,null,null,null,null,null,null,null,7,25,2,5,null,null,2,5,5,5,2,1,2,5,null,null,4,10,null,null,null,null,null,null,2,5,null,null,null,null,null,null,0,20,"0","10","Continuous",0,10,9,9,30,40,0,1.36,1.36,28,"Ra","Rare",4,0,0,"HNF_0028","heathlands","Woody vegetation"]
["Highlands Northern Fall","HNF_","Shrubby Dry Forest","Highlands Northern FallShrubby Dry Forest","HNF_0021",70,20,25,30,0,5,2,10,null,null,8,15,3,5,2,5,2,1,7,5,2,1,1,1,1,1,6,10,null,null,null,null,null,null,2,5,null,null,null,null,2,1,0,10,"0","10","Episodic",20,15,13,11,30,20,200,1,1,21,"LC","Least Concern",1,0,0,"HNF_0021","Forest/Woodland","Woody vegetation"]
["Highlands Northern Fall","HNF_","Shrubby Foothill Forest","Highlands Northern FallShrubby Foothill Forest","HNF_0045",70,20,25,30,0,5,1,5,null,null,5,20,1,5,2,5,null,null,8,15,null,null,1,1,1,15,1,10,2,10,null,null,null,null,3,15,null,null,null,null,2,5,0,10,null,null,"Episodic",30,13,7,8,30,40,200,1,1,45,"D","Depleted",1,0,0,"HNF_0045","Forest/Woodland","Woody vegetation"]
["Highlands Northern Fall","HNF_","Shrubby Wet Forest","Highlands Northern FallShrubby Wet Forest","HNF_0201",90,20,30,40,0,5,2,20,null,null,7,25,3,10,null,null,2,1,8,15,2,1,1,1,null,null,6,15,1,1,null,null,null,null,2,5,null,null,null,null,null,null,0,20,null,null,"Continuous",0,12,12,12,55,50,300,1,1,201,"LC","Least Concern",1,0,0,"HNF_0201","Forest/Woodland","Woody vegetation"]
["Highlands Northern Fall","HNF_","Sub-alpine Dry Shrubland","Highlands Northern FallSub-alpine Dry Shrubland","HNF_1003",null,0,0,null,null,null,null,null,null,null,null,null,null,null,null,null,null,null,null,null,null,null,null,null,null,null,null,null,null,null,null,null,null,null,null,null,null,null,null,null,null,null,null,null,null,null,null,0,0,null,null,null,0,0,1.25,1.25,1003,"Ra","Rare",3,0,0,"HNF_1003","scrubs/shrublands/mallee without logs","Woody vegetation"]
["Highlands Northern Fall","HNF_","Sub-alpine Grassland","Highlands Northern FallSub-alpine Grassland","HNF_0206",0,0,0,null,null,null,null,null,null,null,1,5,3,5,1,1,3,5,11,20,3,10,1,1,null,null,5,20,2,10,null,null,null,null,null,null,null,null,null,null,null,null,0,20,"0","10","Continuous",0,11,4,17,10,10,0,1.36,{"$error":"#N/A"},{"$error":"#N/A"},{"$error":"#N/A"},{"$error":"#N/A"},{"$error":"#N/A"},{"$error":"#N/A"},{"$error":"#N/A"},{"$error":"#N/A"},{"$error":"#N/A"},{"$error":"#N/A"}]
["Highlands Northern Fall","HNF_","Sub-alpine Wet Heathland","Highlands Northern FallSub-alpine Wet Heathland","HNF_0210",0,0,0,null,null,null,null,null,null,null,6,30,2,10,null,null,5,5,10,15,4,10,1,1,null,null,10,20,4,15,null,null,null,null,null,null,null,null,null,null,null,null,0,20,null,null,"Episodic",30,9,8,19,40,10,0,1.36,1.36,210,"En","Endangered",4,0,0,"HNF_0210","heathlands","Woody vegetation"]
["Highlands Northern Fall","HNF_","Sub-alpine Woodland","Highlands Northern FallSub-alpine Woodland","HNF_0043",40,15,10,15,0,5,1,5,null,null,4,20,null,null,1,1,2,5,10,20,1,5,2,1,null,null,4,20,null,null,null,null,null,null,1,5,null,null,null,null,1,1,0,20,null,null,"Continuous",0,12,5,13,25,20,100,1,1,43,"LC","Least Concern",1,0,0,"HNF_0043","Forest/Woodland","Woody vegetation"]
["Highlands Northern Fall","HNF_","Swampy Riparian Woodland","Highlands Northern FallSwampy Riparian Woodland","HNF_0083",70,10,15,20,0,5,2,15,null,null,5,10,1,1,null,null,3,5,8,15,4,5,5,30,2,5,3,5,3,5,null,null,null,null,4,10,null,null,null,null,1,1,0,20,null,null,"Continuous",0,14,8,15,26,20,200,1,1,83,"Vu","Vulnerable",1,0,0,"HNF_0083","Forest/Woodland","Woody vegetation"]
["Highlands Northern Fall","HNF_","Swampy Woodland","Highlands Northern FallSwampy Woodland","HNF_0937",60,15,0,15,0,5,1,5,null,null,4,20,2,5,null,null,2,10,5,10,2,5,2,10,1,10,3,10,2,5,null,null,null,null,2,10,null,null,null,null,null,null,0,20,null,null,"Continuous",0,13,7,9,30,20,150,1,1,937,"En","Endangered",1,0,0,"HNF_0937","Forest/Woodland","Woody vegetation"]
["Highlands Northern Fall","HNF_","Tableland Damp Forest","Highlands Northern FallTableland Damp Forest","HNF_0035",90,20,30,40,0,5,3,20,null,null,7,20,2,10,null,null,2,5,8,15,2,15,1,5,1,1,3,15,1,5,null,null,null,null,2,5,null,null,null,null,null,null,0,20,null,null,"Continuous",0,13,12,12,50,50,300,1,1,35,"LC","Least Concern",1,0,0,"HNF_0035","Forest/Woodland","Woody vegetation"]
["Highlands Northern Fall","HNF_","Treed Clay Heathland","Highlands Northern FallTreed Clay Heathland","HNF_0007_61",40,10,8,10,null,null,null,null,null,null,9,30,6,10,3,5,2,1,8,10,null,null,4,10,1,5,7,10,2,5,null,null,null,null,null,null,null,null,null,null,null,null,0,10,"0","10","Episodic",30,11,15,10,40,20,50,1,{"$error":"#N/A"},{"$error":"#N/A"},{"$error":"#N/A"},{"$error":"#N/A"},{"$error":"#N/A"},{"$error":"#N/A"},{"$error":"#N/A"},{"$error":"#N/A"},{"$error":"#N/A"},{"$error":"#N/A"}]
["Highlands Northern Fall","HNF_","Treed Montane Grassy Shrubland","Highlands Northern FallTreed Montane Grassy Shrubland","HNF_0207_61",50,15,15,10,0,5,2,20,"1","1",6,20,2,5,null,null,2,5,9,20,2,5,2,5,null,null,6,15,1,5,null,null,null,null,1,5,null,null,null,null,null,null,0,10,"0","10","Continuous",0,14,10,13,45,20,150,1,{"$error":"#N/A"},{"$error":"#N/A"},{"$error":"#N/A"},{"$error":"#N/A"},{"$error":"#N/A"},{"$error":"#N/A"},{"$error":"#N/A"},{"$error":"#N/A"},{"$error":"#N/A"},{"$error":"#N/A"}]
["Highlands Northern Fall","HNF_","Valley Grassy Forest","Highlands Northern FallValley Grassy Forest","HNF_0047",70,20,25,20,0,5,2,10,null,null,6,10,5,5,3,5,3,1,16,20,4,5,3,5,null,null,12,25,3,10,null,null,null,null,1,5,null,null,null,null,2,5,0,20,null,null,"Continuous",0,14,13,23,25,40,200,1,1,47,"Vu","Vulnerable",1,0,0,"HNF_0047","Forest/Woodland","Woody vegetation"]
["Highlands Northern Fall","HNF_","Valley Heathy Forest","Highlands Northern FallValley Heathy Forest","HNF_0127",70,20,15,30,0,5,2,10,null,null,7,15,5,5,2,1,null,null,6,10,3,5,3,5,2,20,6,15,1,1,null,null,null,null,1,1,null,null,null,null,3,5,0,10,null,null,"Episodic",30,14,14,9,30,40,200,1,1,127,"En","Endangered",1,0,0,"HNF_0127","Forest/Woodland","Woody vegetation"]
["Highlands Northern Fall","HNF_","Warm Temperate Rainforest","Highlands Northern FallWarm Temperate Rainforest","HNF_0032",null,0,0,null,null,null,null,null,null,null,null,null,null,null,null,null,null,null,null,null,null,null,null,null,null,null,null,null,null,null,null,null,null,null,null,null,null,null,null,null,null,null,null,null,null,null,null,0,0,null,null,null,0,0,1,1,32,"Ra","Rare",1,0,0,"HNF_0032","Forest/Woodland","Woody vegetation"]
["Highlands Northern Fall","HNF_","Wet Forest","Highlands Northern FallWet Forest","HNF_0030",90,20,30,40,0,5,4,30,null,null,6,20,1,1,null,null,2,1,5,10,2,1,1,1,1,10,1,5,null,null,null,null,null,null,4,20,"2","10",null,null,2,5,0,20,null,null,"Continuous",0,14,11,9,51,50,300,1,1,30,"LC","Least Concern",1,0,0,"HNF_0030","Forest/Woodland","Woody vegetation"]
["Highlands Southern Fall","HSF_","Aquatic Herbland","Highlands Southern FallAquatic Herbland","HSF_0653",0,0,0,null,null,null,null,null,null,null,null,null,null,null,null,null,2,10,3,20,3,15,null,null,2,20,2,10,1,5,null,null,null,null,null,null,null,null,null,null,null,null,null,null,null,null,"Episodic",5,6,null,8,null,10,0,1.36,{"$error":"#N/A"},{"$error":"#N/A"},{"$error":"#N/A"},{"$error":"#N/A"},{"$error":"#N/A"},{"$error":"#N/A"},{"$error":"#N/A"},{"$error":"#N/A"},{"$error":"#N/A"},{"$error":"#N/A"}]
["Highlands Southern Fall","HSF_","Blackthorn Scrub","Highlands Southern FallBlackthorn Scrub","HSF_0027",0,0,0,null,0,5,null,null,null,null,5,20,null,null,null,null,null,null,2,1,null,null,null,null,null,null,3,5,1,1,null,null,null,null,2,5,null,null,null,null,2,1,0,10,"0","10","Continuous",0,9,5,2,20,40,100,1.1499999999999999,{"$error":"#N/A"},{"$error":"#N/A"},{"$error":"#N/A"},{"$error":"#N/A"},{"$error":"#N/A"},{"$error":"#N/A"},{"$error":"#N/A"},{"$error":"#N/A"},{"$error":"#N/A"},{"$error":"#N/A"}]
["Highlands Southern Fall","HSF_","Box Ironbark Forest","Highlands Southern FallBox Ironbark Forest","HSF_0061",70,15,20,30,0,5,null,null,null,null,4,20,3,10,2,1,2,5,10,15,2,1,1,1,null,null,5,10,null,null,null,null,null,null,1,1,null,null,null,null,null,null,0,10,"0","20","Continuous",0,12,7,14,30,20,200,1,1,61,"Vu","Vulnerable",1,0,0,"HSF_0061","Forest/Woodland","Woody vegetation"]
["Highlands Southern Fall","HSF_","Clay Heathland","Highlands Southern FallClay Heathland","HSF_0007",0,0,0,null,null,null,null,null,null,null,9,30,6,10,3,5,null,null,8,10,null,null,4,10,1,5,7,10,2,5,null,null,null,null,null,null,null,null,null,null,null,null,0,10,"0","10","Episodic",30,10,15,8,40,20,0,1.36,1.36,7,"D","Depleted",4,0,0,"HSF_0007","heathlands","Woody vegetation"]
["Highlands Southern Fall","HSF_","Coast Banksia Woodland","Highlands Southern FallCoast Banksia Woodland","HSF_0002",null,0,0,null,null,null,null,null,null,null,null,null,null,null,null,null,null,null,null,null,null,null,null,null,null,null,null,null,null,null,null,null,null,null,null,null,null,null,null,null,null,null,null,null,null,null,null,0,0,null,null,null,0,0,0,{"$error":"#N/A"},{"$error":"#N/A"},{"$error":"#N/A"},{"$error":"#N/A"},{"$error":"#N/A"},{"$error":"#N/A"},{"$error":"#N/A"},{"$error":"#N/A"},{"$error":"#N/A"},{"$error":"#N/A"}]
["Highlands Southern Fall","HSF_","Cool Temperate Rainforest","Highlands Southern FallCool Temperate Rainforest","HSF_0031",90,20,25,50,0,5,3,15,null,null,3,10,null,null,null,null,1,1,3,10,null,null,null,null,1,1,null,null,null,null,null,null,null,null,6,35,"2","25","4","5",2,1,0,20,null,null,"Continuous",0,11,6,4,25,80,200,1,1,31,"En","Endangered",1,0,0,"HSF_0031","Forest/Woodland","Woody vegetation"]
["Highlands Southern Fall","HSF_","Cool Temperate Rainforest/Warm Temperate Rainf","Highlands Southern FallCool Temperate Rainforest/Warm Temperate Rainf","HSF_0033",70,20,20,50,0,5,5,25,null,null,6,15,null,null,null,null,2,1,3,5,1,1,2,1,2,1,2,5,null,null,null,null,null,null,8,25,"3","20","4","5",7,20,0,20,null,null,"Continuous",0,14,11,6,40,50,200,1,1,33,"En","Endangered",1,0,0,"HSF_0033","Forest/Woodland","Woody vegetation"]
["Highlands Southern Fall","HSF_","Creekline Grassy Woodland","Highlands Southern FallCreekline Grassy Woodland","HSF_0068",null,null,null,null,null,null,null,null,null,null,null,null,null,null,null,null,null,null,null,null,null,null,null,null,null,null,null,null,null,null,null,null,null,null,null,null,null,null,null,null,null,null,null,null,null,null,null,null,0,null,null,null,null,0,1,1,68,"En","Endangered",1,0,0,"HSF_0068","Forest/Woodland","Woody vegetation"]
["Highlands Southern Fall","HSF_","Creekline Herb-rich Woodland","Highlands Southern FallCreekline Herb-rich Woodland","HSF_0164",70,10,15,20,0,5,2,10,null,null,3,10,2,5,2,5,2,1,8,15,3,5,2,10,2,10,8,20,1,5,null,null,null,null,2,10,null,null,null,null,5,5,0,20,null,null,"Continuous",0,15,7,13,25,20,100,1,1,164,"Vu","Vulnerable",1,0,0,"HSF_0164","Forest/Woodland","Woody vegetation"]
["Highlands Southern Fall","HSF_","Damp Forest","Highlands Southern FallDamp Forest","HSF_0029",90,20,30,40,0,5,4,20,null,null,7,25,1,1,null,null,null,null,4,5,2,1,2,5,1,10,1,1,1,1,null,null,null,null,3,15,"2","10",null,null,3,5,0,20,null,null,"Continuous",0,14,12,6,46,50,300,1,1,29,"LC","Least Concern",1,0,0,"HSF_0029","Forest/Woodland","Woody vegetation"]
["Highlands Southern Fall","HSF_","Damp Heathland","Highlands Southern FallDamp Heathland","HSF_0710",0,0,0,null,null,null,null,null,null,null,5,40,5,10,1,1,null,null,4,10,3,10,2,5,1,1,4,5,2,10,null,null,null,null,null,null,null,null,null,null,3,5,0,20,null,null,"Episodic",30,11,10,7,50,20,0,1.36,{"$error":"#N/A"},{"$error":"#N/A"},{"$error":"#N/A"},{"$error":"#N/A"},{"$error":"#N/A"},{"$error":"#N/A"},{"$error":"#N/A"},{"$error":"#N/A"},{"$error":"#N/A"},{"$error":"#N/A"}]
["Highlands Southern Fall","HSF_","Damp Heathy Woodland","Highlands Southern FallDamp Heathy Woodland","HSF_0793",60,10,10,15,0,5,null,null,null,null,5,30,4,5,2,1,null,null,3,5,3,5,2,5,null,null,3,10,1,5,null,null,null,null,1,5,null,null,null,null,null,null,0,20,"0","10","Episodic",30,12,9,6,35,20,100,1,1,793,"D","Depleted",1,0,0,"HSF_0793","Forest/Woodland","Woody vegetation"]
["Highlands Southern Fall","HSF_","Damp Sands Herb-rich Woodland","Highlands Southern FallDamp Sands Herb-rich Woodland","HSF_0003",70,15,15,20,0,5,2,10,null,null,4,20,null,null,1,1,2,5,6,15,5,10,1,1,null,null,7,20,1,5,null,null,null,null,1,10,null,null,null,null,2,5,0,10,null,null,"Continuous",0,13,6,13,30,40,150,1,1,3,"Vu","Vulnerable",1,0,0,"HSF_0003","Forest/Woodland","Woody vegetation"]
["Highlands Southern Fall","HSF_","Dry Rainforest","Highlands Southern FallDry Rainforest","HSF_0034",60,10,15,50,0,5,3,20,null,null,9,20,null,null,null,null,5,5,12,15,5,5,2,5,null,null,3,5,3,5,null,null,null,null,5,10,null,null,"2","1",6,10,0,20,null,null,"Continuous",0,13,12,22,40,50,100,1,1,34,"En","Endangered",1,0,0,"HSF_0034","Forest/Woodland","Woody vegetation"]
["Highlands Southern Fall","HSF_","Dry Valley Forest","Highlands Southern FallDry Valley Forest","HSF_0169",70,20,20,30,0,5,4,15,null,null,9,30,3,10,1,1,4,5,11,15,3,5,3,5,null,null,4,15,1,1,null,null,null,null,3,10,"1","5",null,null,2,5,0,10,null,null,"Continuous",0,15,16,18,55,40,200,1,1,169,"Vu","Vulnerable",1,0,0,"HSF_0169","Forest/Woodland","Woody vegetation"]
["Highlands Southern Fall","HSF_","Escarpment Shrubland","Highlands Southern FallEscarpment Shrubland","HSF_0895",0,0,0,null,null,null,null,null,null,null,3,10,2,5,null,null,3,5,4,10,5,5,1,5,1,5,9,25,3,5,null,null,null,null,1,5,null,null,null,null,1,5,0,20,"0","10","Continuous",0,13,5,12,15,20,50,1.1499999999999999,1,895,"En","Endangered",1,0,0,"HSF_0895","Forest/Woodland","Woody vegetation"]
["Highlands Southern Fall","HSF_","Floodplain Riparian Woodland","Highlands Southern FallFloodplain Riparian Woodland","HSF_0056",80,15,15,20,0,5,4,15,null,null,3,10,null,null,null,null,4,10,3,10,2,5,3,15,3,20,5,15,1,5,null,null,null,null,null,null,null,null,null,null,3,10,0,10,null,null,"Episodic",10,12,7,9,25,40,300,1,1,56,"En","Endangered",1,0,0,"HSF_0056","Forest/Woodland","Woody vegetation"]
["Highlands Southern Fall","HSF_","Grassy Dry Forest","Highlands Southern FallGrassy Dry Forest","HSF_0022",60,20,20,30,0,5,1,5,null,null,7,10,4,10,2,1,2,1,11,20,3,5,1,5,null,null,7,25,2,5,null,null,null,null,1,5,null,null,null,null,3,5,0,10,"0","10","Continuous",0,15,12,16,25,20,200,1,1,22,"LC","Least Concern",1,0,0,"HSF_0022","Forest/Woodland","Woody vegetation"]
["Highlands Southern Fall","HSF_","Grassy Forest","Highlands Southern FallGrassy Forest","HSF_0128",70,20,20,30,0,5,1,5,null,null,5,30,1,1,1,1,2,1,5,10,2,5,2,5,2,10,5,15,1,5,null,null,null,null,1,5,null,null,null,null,3,5,0,10,null,null,"Episodic",30,15,7,9,36,40,200,1,1,128,"Vu","Vulnerable",1,0,0,"HSF_0128","Forest/Woodland","Woody vegetation"]
["Highlands Southern Fall","HSF_","Grassy Woodland","Highlands Southern FallGrassy Woodland","HSF_0175",70,15,15,20,0,5,1,10,null,null,4,15,2,5,null,null,2,5,7,20,2,5,1,1,null,null,7,35,1,5,null,null,null,null,1,5,null,null,null,null,1,1,0,10,null,null,"Continuous",0,13,7,11,30,20,150,1,1,175,"D","Depleted",1,0,0,"HSF_0175","Forest/Woodland","Woody vegetation"]
["Highlands Southern Fall","HSF_","Gully Woodland","Highlands Southern FallGully Woodland","HSF_0902",70,10,20,20,0,5,4,15,null,null,6,15,1,1,null,null,2,1,6,10,2,5,2,10,1,5,7,15,2,10,null,null,null,null,3,10,null,null,null,null,4,10,0,20,null,null,"Continuous",0,14,11,10,31,20,100,1,1,902,"Vu","Vulnerable",1,0,0,"HSF_0902","Forest/Woodland","Woody vegetation"]
["Highlands Southern Fall","HSF_","Heathy Dry Forest","Highlands Southern FallHeathy Dry Forest","HSF_0020",60,20,20,30,0,5,null,null,null,null,9,30,4,15,2,5,2,5,5,10,1,5,null,null,1,1,6,20,null,null,null,null,null,null,2,5,null,null,null,null,2,5,0,10,"0","10","Episodic",20,13,13,8,45,20,200,1,1,20,"LC","Least Concern",1,0,0,"HSF_0020","Forest/Woodland","Woody vegetation"]
["Highlands Southern Fall","HSF_","Heathy Woodland",{"$f":"CONCATENATE(A579,C579)","v":"Highlands Southern FallHeathy Woodland"},"HSF_0048",50,15,10,10,0,5,null,null,null,null,5,30,5,20,null,null,null,null,2,5,2,5,1,5,1,1,1,1,2,5,null,null,null,null,1,5,null,null,null,null,null,null,0,10,"0","10","Episodic",20,12,10,4,50,40,150,1,1,48,"LC","Least Concern",1,0,0,"HSF_0048","Forest/Woodland","Woody vegetation"]
["Highlands Southern Fall","HSF_","Herb-rich Foothill Forest","Highlands Southern FallHerb-rich Foothill Forest","HSF_0023",70,20,25,40,0,5,2,10,null,null,7,20,2,5,1,1,4,5,11,20,3,5,2,5,2,5,5,20,2,5,null,null,null,null,3,10,null,null,null,null,2,5,0,20,null,null,"Continuous",0,15,11,18,35,40,200,1,1,23,"LC","Least Concern",1,0,0,"HSF_0023","Forest/Woodland","Woody vegetation"]
["Highlands Southern Fall","HSF_","Limestone Box Forest","Highlands Southern FallLimestone Box Forest","HSF_0015",70,20,20,30,0,5,3,15,null,null,5,15,1,1,null,null,2,1,8,10,3,5,2,5,2,5,4,5,3,5,null,null,null,null,3,15,null,null,null,null,6,10,0,10,null,null,"Continuous",0,14,9,13,31,20,150,1,1,15,"Vu","Vulnerable",1,0,0,"HSF_0015","Forest/Woodland","Woody vegetation"]
["Highlands Southern Fall","HSF_","Lowland Forest","Highlands Southern FallLowland Forest","HSF_0016",70,20,25,30,0,5,2,10,null,null,9,30,3,5,2,1,2,1,5,10,2,1,2,5,2,10,4,10,1,1,null,null,null,null,2,10,null,null,null,null,2,1,0,10,null,null,"Continuous",0,15,14,9,45,40,200,1,1,16,"LC","Least Concern",1,0,0,"HSF_0016","Forest/Woodland","Woody vegetation"]
["Highlands Southern Fall","HSF_","Lowland Herb-rich Forest","Highlands Southern FallLowland Herb-rich Forest","HSF_0877",70,20,20,30,0,5,2,10,null,null,3,30,2,5,null,null,2,5,8,15,3,5,2,10,null,null,3,10,2,5,null,null,null,null,3,20,null,null,null,null,2,5,0,10,null,null,"Continuous",0,13,7,13,45,40,200,1,1,877,"D","Depleted",1,0,0,"HSF_0877","Forest/Woodland","Woody vegetation"]
["Highlands Southern Fall","HSF_","Montane Damp Forest","Highlands Southern FallMontane Damp Forest","HSF_0038",90,20,30,40,0,5,3,25,null,null,7,25,3,10,1,1,3,5,10,15,2,5,1,5,null,null,4,10,1,1,null,null,null,null,2,10,null,null,null,null,1,5,0,20,null,null,"Continuous",0,14,13,15,60,50,300,1,1,38,"LC","Least Concern",1,0,0,"HSF_0038","Forest/Woodland","Woody vegetation"]
["Highlands Southern Fall","HSF_","Montane Dry Woodland","Highlands Southern FallMontane Dry Woodland","HSF_0036",50,15,15,20,0,5,2,20,"1","1",6,20,2,5,null,null,2,5,9,20,2,5,2,5,null,null,6,15,1,5,null,null,null,null,1,5,null,null,null,null,null,null,0,10,"0","10","Continuous",0,14,10,13,45,20,150,1,1,36,"LC","Least Concern",1,0,0,"HSF_0036","Forest/Woodland","Woody vegetation"]
["Highlands Southern Fall","HSF_","Montane Grassy Woodland","Highlands Southern FallMontane Grassy Woodland","HSF_0037",50,15,10,20,0,5,1,5,null,null,6,20,3,10,2,5,2,5,15,20,3,10,2,5,null,null,7,20,1,1,null,null,null,null,1,1,null,null,null,null,null,null,0,10,"0","10","Continuous",0,14,10,20,35,20,150,1,1,37,"D","Depleted",1,0,0,"HSF_0037","Forest/Woodland","Woody vegetation"]
["Highlands Southern Fall","HSF_","Montane Herb-rich Woodland","Highlands Southern FallMontane Herb-rich Woodland","HSF_0319",70,15,25,40,0,5,2,10,null,null,6,15,2,5,1,1,5,10,12,20,3,5,1,5,null,null,8,20,1,1,null,null,null,null,3,10,null,null,null,null,2,5,0,20,null,null,"Continuous",0,14,10,20,30,20,150,1,1,319,"LC","Least Concern",1,0,0,"HSF_0319","Forest/Woodland","Woody vegetation"]
["Highlands Southern Fall","HSF_","Montane Riparian Thicket","Highlands Southern FallMontane Riparian Thicket","HSF_0041",0,0,0,null,null,null,null,null,null,null,1,5,null,null,null,null,null,null,null,null,1,1,2,40,null,null,2,1,null,null,null,null,null,null,3,20,"1","5","2","1",null,null,0,20,null,null,"Continuous",0,8,1,1,5,40,50,1.25,1.25,41,"LC","Least Concern",3,0,0,"HSF_0041","scrubs/shrublands/mallee without logs","Woody vegetation"]
["Highlands Southern Fall","HSF_","Montane Riparian Woodland","Highlands Southern FallMontane Riparian Woodland","HSF_0040",60,15,15,15,0,5,3,15,null,null,5,10,null,null,null,null,6,10,10,15,4,5,3,25,1,5,3,10,null,null,null,null,null,null,4,15,"1","1",null,null,2,5,0,20,null,null,"Continuous",0,13,8,20,25,40,150,1,1,40,"En","Endangered",1,0,0,"HSF_0040","Forest/Woodland","Woody vegetation"]
["Highlands Southern Fall","HSF_","Montane Rocky Shrubland","Highlands Southern FallMontane Rocky Shrubland","HSF_0192",0,0,0,null,null,null,null,null,null,null,8,40,2,5,1,1,5,5,7,5,3,5,2,5,null,null,4,5,1,1,null,null,null,null,3,5,null,null,null,null,1,1,0,20,null,null,"Episodic",30,12,10,15,45,40,100,1.25,1.25,192,"Ra","Rare",3,0,0,"HSF_0192","scrubs/shrublands/mallee without logs","Woody vegetation"]
["Highlands Southern Fall","HSF_","Montane Wet Forest","Highlands Southern FallMontane Wet Forest","HSF_0039",90,20,30,40,0,5,5,20,null,null,5,25,null,null,null,null,2,5,5,15,2,1,1,1,1,1,1,5,null,null,null,null,null,null,3,25,"2","5",null,null,2,1,0,20,null,null,"Continuous",0,13,10,9,45,50,300,1,1,39,"LC","Least Concern",1,0,0,"HSF_0039","Forest/Woodland","Woody vegetation"]
["Highlands Southern Fall","HSF_","Plains Grassland","Highlands Southern FallPlains Grassland","HSF_0132",0,0,0,null,null,null,null,null,null,null,null,null,1,1,null,null,3,5,10,15,3,5,1,5,null,null,13,40,4,10,null,null,null,null,null,null,null,null,null,null,null,null,0,10,"0","10","Episodic",5,9,1,16,1,10,0,1.36,1.36,132,"En","Endangered",5,"y",0,"HSF_0132","grasslands","Other grassland vegetation"]
["Highlands Southern Fall","HSF_","Plains Grassy Forest","Highlands Southern FallPlains Grassy Forest","HSF_0151",70,20,20,30,0,5,3,15,null,null,6,20,3,5,2,5,3,5,6,10,2,5,2,10,1,5,4,15,2,1,null,null,null,null,2,10,null,null,null,null,null,null,0,10,null,null,"Continuous",0,14,12,11,40,20,200,1,1,151,"En","Endangered",1,0,0,"HSF_0151","Forest/Woodland","Woody vegetation"]
["Highlands Southern Fall","HSF_","Plains Grassy Wetland","Highlands Southern FallPlains Grassy Wetland","HSF_0125",null,0,0,null,null,null,null,null,null,null,null,null,null,null,null,null,null,null,null,null,null,null,null,null,null,null,null,null,null,null,null,null,null,null,null,null,null,null,null,null,null,null,null,null,null,null,null,0,0,null,null,null,0,0,1.36,1.36,125,"En","Endangered",6,"y",0,"HSF_0125","wetlands","Non-woody wetland vegetation"]
["Highlands Southern Fall","HSF_","Plains Grassy Woodland","Highlands Southern FallPlains Grassy Woodland","HSF_0055",80,10,15,20,0,5,1,5,null,null,2,10,1,1,1,1,1,5,10,20,3,5,2,5,1,10,9,35,2,10,null,null,null,null,null,null,null,null,null,null,null,null,0,10,null,null,"Continuous",0,13,4,14,16,10,100,1,1,55,"En","Endangered",1,0,0,"HSF_0055","Forest/Woodland","Woody vegetation"]
["Highlands Southern Fall","HSF_","Riparian Forest","Highlands Southern FallRiparian Forest","HSF_0018",90,20,30,40,0,5,4,20,null,null,8,20,1,1,1,1,2,1,6,10,2,1,3,10,2,5,3,5,2,5,null,null,null,null,5,20,"1","10",null,null,3,5,0,20,null,null,"Continuous",0,16,13,10,41,50,300,1,1,18,"LC","Least Concern",1,0,0,"HSF_0018","Forest/Woodland","Woody vegetation"]
["Highlands Southern Fall","HSF_","Riparian Scrub","Highlands Southern FallRiparian Scrub","HSF_0191",0,0,0,null,null,null,null,null,null,null,1,5,1,1,null,null,null,null,1,1,1,1,1,10,1,5,1,1,2,20,null,null,null,null,1,5,null,null,null,null,1,10,0,20,null,null,"Continuous",0,11,2,2,6,40,0,1.25,1.25,191,"Vu","Vulnerable",3,0,0,"HSF_0191","scrubs/shrublands/mallee without logs","Woody vegetation"]
["Highlands Southern Fall","HSF_","Riparian Shrubland","Highlands Southern FallRiparian Shrubland","HSF_0019",0,0,0,null,null,null,null,null,null,null,4,20,1,5,null,null,5,5,4,10,3,5,1,10,null,null,1,1,1,1,null,null,null,null,6,15,"1","1",null,null,2,5,0,20,null,null,"Continuous",0,12,5,12,25,40,100,1.25,1.25,19,"Ra","Rare",3,0,0,"HSF_0019","scrubs/shrublands/mallee without logs","Woody vegetation"]
["Highlands Southern Fall","HSF_","Riparian Thicket","Highlands Southern FallRiparian Thicket","HSF_0059",0,0,6,50,null,null,null,null,null,null,8,30,3,5,1,1,2,5,5,10,1,5,3,10,2,5,2,5,3,15,null,null,null,null,3,10,"1","5",null,null,2,5,0,20,null,null,"Continuous",0,14,11,8,35,40,0,1.25,1.36,59,"Vu","Vulnerable",4,0,0,"HSF_0059","heathlands","Woody vegetation"]
["Highlands Southern Fall","HSF_","Riparian Woodland","Highlands Southern FallRiparian Woodland","HSF_0641",80,15,20,20,0,5,2,10,null,null,4,10,1,5,null,null,4,15,5,10,1,5,3,15,1,5,4,20,2,5,null,null,null,null,null,null,null,null,null,null,1,5,0,10,null,null,"Continuous",0,13,7,10,25,30,200,1,{"$error":"#N/A"},{"$error":"#N/A"},{"$error":"#N/A"},{"$error":"#N/A"},{"$error":"#N/A"},{"$error":"#N/A"},{"$error":"#N/A"},{"$error":"#N/A"},{"$error":"#N/A"},{"$error":"#N/A"}]
["Highlands Southern Fall","HSF_","Riverine Escarpment Scrub","Highlands Southern FallRiverine Escarpment Scrub","HSF_0082",0,0,0,null,0,5,null,null,null,null,10,25,null,null,null,null,4,5,13,20,6,10,2,5,null,null,6,10,2,5,null,null,null,null,5,15,null,null,null,null,3,5,0,10,null,null,"Continuous",0,11,10,23,25,40,50,1.25,1.25,82,"LC","Least Concern",3,0,0,"HSF_0082","scrubs/shrublands/mallee without logs","Woody vegetation"]
["Highlands Southern Fall","HSF_","Rocky Outcrop Shrubland","Highlands Southern FallRocky Outcrop Shrubland","HSF_0028",0,0,0,null,null,null,null,null,null,null,7,25,2,5,1,5,2,5,2,1,null,null,1,5,null,null,4,10,null,null,null,null,null,null,1,1,null,null,null,null,null,null,0,20,"0","10","Continuous",0,10,9,4,30,40,100,1.36,1.36,28,"Ra","Rare",4,0,0,"HSF_0028","heathlands","Woody vegetation"]
["Highlands Southern Fall","HSF_","Shrubby Damp Forest","Highlands Southern FallShrubby Damp Forest","HSF_0316",90,20,25,40,0,5,4,20,null,null,8,20,2,10,1,1,4,5,8,15,2,5,2,5,1,1,3,10,1,5,null,null,null,null,2,15,"1","1",null,null,2,5,0,20,null,null,"Continuous",0,16,14,14,50,50,300,1,1,316,"LC","Least Concern",1,0,0,"HSF_0316","Forest/Woodland","Woody vegetation"]
["Highlands Southern Fall","HSF_","Shrubby Dry Forest","Highlands Southern FallShrubby Dry Forest","HSF_0021",70,20,25,30,0,5,2,10,null,null,8,30,3,15,1,1,4,5,8,10,null,null,2,5,1,1,4,15,1,5,null,null,null,null,2,10,null,null,null,null,2,5,0,10,"0","10","Episodic",20,15,13,12,55,30,200,1,1,21,"LC","Least Concern",1,0,0,"HSF_0021","Forest/Woodland","Woody vegetation"]
["Highlands Southern Fall","HSF_","Shrubby Foothill Forest","Highlands Southern FallShrubby Foothill Forest","HSF_0045",70,20,25,40,0,5,1,5,null,null,8,35,3,10,1,5,null,null,3,5,1,1,2,5,1,10,2,5,null,null,null,null,null,null,2,10,null,null,null,null,1,1,0,10,"0","10","Episodic",30,14,12,4,50,40,200,1,1,45,"LC","Least Concern",1,0,0,"HSF_0045","Forest/Woodland","Woody vegetation"]
["Highlands Southern Fall","HSF_","Shrubby Gully Forest","Highlands Southern FallShrubby Gully Forest","HSF_0938",70,20,20,30,0,5,2,10,null,null,5,20,null,null,null,null,null,null,5,10,3,5,3,15,2,10,3,10,1,5,null,null,null,null,4,20,null,null,null,null,2,1,0,20,null,null,"Continuous",0,12,7,8,30,20,150,1,{"$error":"#N/A"},{"$error":"#N/A"},{"$error":"#N/A"},{"$error":"#N/A"},{"$error":"#N/A"},{"$error":"#N/A"},{"$error":"#N/A"},{"$error":"#N/A"},{"$error":"#N/A"},{"$error":"#N/A"}]
["Highlands Southern Fall","HSF_","Shrubby Wet Forest","Highlands Southern FallShrubby Wet Forest","HSF_0201",90,20,30,40,0,5,4,30,null,null,7,25,2,1,null,null,2,1,6,10,null,null,null,null,null,null,2,5,1,1,null,null,null,null,3,10,"2","5",null,null,1,1,0,20,null,null,"Continuous",0,12,13,8,56,50,300,1,1,201,"LC","Least Concern",1,0,0,"HSF_0201","Forest/Woodland","Woody vegetation"]
["Highlands Southern Fall","HSF_","Stream Bank Shrubland","Highlands Southern FallStream Bank Shrubland","HSF_0851",0,0,15,null,null,null,2,10,null,null,4,20,null,null,null,null,3,5,12,20,4,10,3,10,3,10,10,15,5,10,null,null,null,null,null,null,null,null,null,null,2,5,null,null,null,null,"Continuous",0,10,6,19,30,40,0,1.36,{"$error":"#N/A"},{"$error":"#N/A"},{"$error":"#N/A"},{"$error":"#N/A"},{"$error":"#N/A"},{"$error":"#N/A"},{"$error":"#N/A"},{"$error":"#N/A"},{"$error":"#N/A"},{"$error":"#N/A"}]
["Highlands Southern Fall","HSF_","Sub-alpine Grassland","Highlands Southern FallSub-alpine Grassland","HSF_0206",0,0,0,null,null,null,null,null,null,null,1,5,3,5,1,1,3,5,11,20,3,10,1,1,null,null,5,20,2,10,null,null,null,null,null,null,null,null,null,null,null,null,0,20,"0","10","Continuous",0,11,4,17,10,10,0,1.36,1.36,206,"Ra","Rare",5,0,0,"HSF_0206","grasslands","Other grassland vegetation"]
["Highlands Southern Fall","HSF_","Sub-alpine Wet Heathland","Highlands Southern FallSub-alpine Wet Heathland","HSF_0210",0,0,0,null,null,null,null,null,null,null,4,15,3,10,1,1,1,1,8,15,4,10,1,1,null,null,4,10,2,15,null,null,null,null,1,1,null,null,null,null,null,null,0,40,null,null,"Episodic",30,11,7,13,25,10,0,1.36,1.36,210,"En","Endangered",4,0,0,"HSF_0210","heathlands","Woody vegetation"]
["Highlands Southern Fall","HSF_","Sub-alpine Woodland","Highlands Southern FallSub-alpine Woodland","HSF_0043",40,15,10,15,0,5,1,5,null,null,5,20,2,10,null,null,3,10,8,20,2,5,null,null,null,null,4,20,1,5,null,null,null,null,1,1,null,null,null,null,null,null,0,20,"0","10","Continuous",0,12,8,13,35,20,100,1,1,43,"LC","Least Concern",1,0,0,"HSF_0043","Forest/Woodland","Woody vegetation"]
["Highlands Southern Fall","HSF_","Swamp Scrub","Highlands Southern FallSwamp Scrub","HSF_0053",0,0,8,50,null,null,null,null,null,null,2,10,2,1,null,null,2,5,3,15,2,5,2,10,3,10,2,5,2,15,null,null,null,null,1,5,null,null,null,null,1,1,0,20,null,null,"Continuous",0,12,4,7,11,40,0,1.25,1.1499999999999999,53,"En","Endangered",3,0,0,"HSF_0053","scrubs/shrublands/mallee without logs","Woody vegetation"]
["Highlands Southern Fall","HSF_","Swampy Riparian Woodland","Highlands Southern FallSwampy Riparian Woodland","HSF_0083",60,10,15,20,0,5,4,25,null,null,4,20,1,1,1,1,3,5,6,10,2,5,3,15,2,10,6,15,2,5,null,null,null,null,2,5,null,null,null,null,2,5,0,10,null,null,"Continuous",0,15,9,11,46,20,200,1,1,83,"Vu","Vulnerable",1,0,0,"HSF_0083","Forest/Woodland","Woody vegetation"]
["Highlands Southern Fall","HSF_","Swampy Woodland","Highlands Southern FallSwampy Woodland","HSF_0937",60,15,15,15,0,5,1,5,null,null,4,20,2,5,1,1,2,10,5,15,2,5,2,10,1,10,3,10,2,5,null,null,null,null,2,10,null,null,null,null,null,null,0,20,null,null,"Continuous",0,14,7,9,30,20,150,1,1,937,"En","Endangered",1,0,0,"HSF_0937","Forest/Woodland","Woody vegetation"]
["Highlands Southern Fall","HSF_","Tableland Damp Forest","Highlands Southern FallTableland Damp Forest","HSF_0035",90,20,30,40,0,5,3,20,null,null,7,20,2,10,null,null,2,5,8,15,2,15,1,5,1,1,3,15,1,5,null,null,null,null,2,5,null,null,null,null,null,null,0,20,null,null,"Continuous",0,13,12,12,50,50,300,1,1,35,"LC","Least Concern",1,0,0,"HSF_0035","Forest/Woodland","Woody vegetation"]
["Highlands Southern Fall","HSF_","Treed Escarpment Shrubland","Highlands Southern FallTreed Escarpment Shrubland","HSF_0895_61",70,15,0,0,0,5,3,10,null,null,3,10,2,5,null,null,3,5,4,10,5,5,1,5,1,5,9,25,3,5,null,null,null,null,1,5,null,null,null,null,1,5,0,20,"0","10","Continuous",0,15,8,12,25,20,150,1,{"$error":"#N/A"},{"$error":"#N/A"},{"$error":"#N/A"},{"$error":"#N/A"},{"$error":"#N/A"},{"$error":"#N/A"},{"$error":"#N/A"},{"$error":"#N/A"},{"$error":"#N/A"},{"$error":"#N/A"}]
["Highlands Southern Fall","HSF_","Treed Stream Bank Shrubland","Highlands Southern FallTreed Stream Bank Shrubland","HSF_0851_61",70,10,15,10,0,5,2,10,null,null,4,20,null,null,null,null,3,5,12,20,4,10,3,10,3,10,10,15,5,10,null,null,null,null,null,null,null,null,null,null,2,5,null,null,null,null,"Continuous",0,11,6,19,30,40,100,1,{"$error":"#N/A"},{"$error":"#N/A"},{"$error":"#N/A"},{"$error":"#N/A"},{"$error":"#N/A"},{"$error":"#N/A"},{"$error":"#N/A"},{"$error":"#N/A"},{"$error":"#N/A"},{"$error":"#N/A"}]
["Highlands Southern Fall","HSF_","Valley Grassy Forest","Highlands Southern FallValley Grassy Forest","HSF_0047",70,20,20,20,0,5,2,15,null,null,6,20,3,5,2,1,3,5,12,20,3,10,2,5,2,10,7,20,2,5,null,null,null,null,1,5,null,null,null,null,null,null,0,20,null,null,"Continuous",0,14,11,18,40,20,200,1,1,47,"Vu","Vulnerable",1,0,0,"HSF_0047","Forest/Woodland","Woody vegetation"]
["Highlands Southern Fall","HSF_","Valley Heathy Forest","Highlands Southern FallValley Heathy Forest","HSF_0127",70,20,15,30,0,5,3,10,null,null,7,15,5,10,2,1,null,null,6,10,3,5,2,5,2,20,7,15,1,1,null,null,null,null,1,1,null,null,null,null,3,5,0,10,null,null,"Episodic",30,14,15,9,35,40,200,1,1,127,"Vu","Vulnerable",1,0,0,"HSF_0127","Forest/Woodland","Woody vegetation"]
["Highlands Southern Fall","HSF_","Valley Slopes Dry Forest","Highlands Southern FallValley Slopes Dry Forest","HSF_0177",70,20,20,30,0,5,4,15,null,null,6,20,1,5,null,null,5,10,8,15,3,5,2,5,null,null,6,15,2,5,null,null,null,null,3,5,null,null,null,null,2,5,0,10,"0","10","Continuous",0,14,11,16,40,40,200,1,1,177,"LC","Least Concern",1,0,0,"HSF_0177","Forest/Woodland","Woody vegetation"]
["Highlands Southern Fall","HSF_","Warm Temperate Rainforest","Highlands Southern FallWarm Temperate Rainforest","HSF_0032",70,20,25,50,0,5,3,30,null,null,2,10,null,null,null,null,2,5,3,5,1,5,1,1,null,null,1,1,2,5,null,null,null,null,4,25,null,null,"1","5",7,20,0,20,null,null,"Continuous",0,13,5,6,40,50,200,1,1,32,"Ra","Rare",1,0,0,"HSF_0032","Forest/Woodland","Woody vegetation"]
["Highlands Southern Fall","HSF_","Wet Forest","Highlands Southern FallWet Forest","HSF_0030",90,20,30,40,0,5,7,30,null,null,5,20,null,null,null,null,1,1,3,5,1,1,1,1,1,10,1,1,null,null,null,null,null,null,4,20,"2","20","1","1",2,5,0,20,null,null,"Continuous",0,14,12,5,50,50,300,1,1,30,"LC","Least Concern",1,0,0,"HSF_0030","Forest/Woodland","Woody vegetation"]
["Highlands Southern Fall","HSF_","Wet Heathland","Highlands Southern FallWet Heathland","HSF_0008",0,0,0,null,null,null,null,null,null,null,7,30,3,5,null,null,2,5,4,5,null,null,2,10,3,10,4,10,3,10,null,null,null,null,1,1,null,null,null,null,2,10,0,20,null,null,"Episodic",30,11,10,6,35,20,0,1.36,{"$error":"#N/A"},{"$error":"#N/A"},{"$error":"#N/A"},{"$error":"#N/A"},{"$error":"#N/A"},{"$error":"#N/A"},{"$error":"#N/A"},{"$error":"#N/A"},{"$error":"#N/A"},{"$error":"#N/A"}]
["Highlands Southern Fall","HSF_","Wetland Formation","Highlands Southern FallWetland Formation","HSF_0074",null,null,0,null,null,null,null,null,null,null,null,null,null,null,null,null,null,null,null,null,null,null,null,null,null,null,null,null,null,null,null,null,null,null,null,null,null,null,null,null,null,null,null,null,null,null,null,5,0,null,null,null,null,0,1.36,1.36,74,"En","Endangered",6,0,0,"HSF_0074","wetlands","Non-woody wetland vegetation"]
["Lowan Mallee","LoM_","Cane Grass Wetland","Lowan MalleeCane Grass Wetland","LoM_0291",0,0,0,null,null,null,null,null,null,null,null,null,null,null,null,null,null,null,null,null,2,10,null,null,null,null,null,null,2,40,null,null,null,null,null,null,null,null,null,null,null,null,null,null,null,null,"Episodic",5,2,null,2,null,10,0,1.36,1.36,291,"En","Endangered",6,0,0,"LoM_0291","wetlands","Non-woody wetland vegetation"]
["Lowan Mallee","LoM_","Chenopod Grassland","Lowan MalleeChenopod Grassland","LoM_0829",0,0,0,null,null,null,null,null,null,null,1,10,6,30,null,null,1,1,5,15,4,5,null,null,null,null,3,20,null,null,null,null,null,null,null,null,null,null,null,null,null,null,0,10,"0","20","Continuous",0,8,7,10,40,5,0,1.36,1.36,829,"D","Depleted",5,"y",0,"LoM_0829","grasslands","Other grassland vegetation"]
["Lowan Mallee","LoM_","Chenopod Mallee","Lowan MalleeChenopod Mallee","LoM_0158",20,20,12,20,null,null,null,null,null,null,1,5,9,45,null,null,null,null,3,5,2,10,null,null,null,null,null,null,null,null,null,null,null,null,null,null,null,null,null,null,null,null,0,10,"0","15","Continuous",0,6,10,5,50,10,100,1,1,158,"LC","Least Concern",1,0,"y","LoM_0158","Forest/Woodland","Woody vegetation"]
["Lowan Mallee","LoM_","Damp Heathland","Lowan MalleeDamp Heathland","LoM_0710",0,0,0,null,null,null,null,null,null,null,6,30,5,20,2,5,null,null,6,10,2,1,1,5,1,1,4,10,3,15,null,null,null,null,null,null,null,null,null,null,2,5,0,10,"0","10","Episodic",30,12,11,8,50,20,0,1.36,1.36,710,"LC","Least Concern",4,0,0,"LoM_0710","heathlands","Woody vegetation"]
["Lowan Mallee","LoM_","Dunefield Heathland","Lowan MalleeDunefield Heathland","LoM_0089",0,0,0,null,null,null,null,null,null,null,6,50,6,20,null,null,null,null,4,5,null,null,1,1,null,null,3,5,2,5,null,null,"1","1",null,null,null,null,null,null,null,null,null,null,"0","10","Episodic",20,8,12,4,70,5,0,1.36,1.36,89,"LC","Least Concern",4,0,0,"LoM_0089","heathlands","Woody vegetation"]
["Lowan Mallee","LoM_","Heathy Mallee","Lowan MalleeHeathy Mallee","LoM_0088",0,0,4,25,null,null,null,null,null,null,6,30,7,20,null,null,2,1,3,5,null,null,1,1,null,null,3,5,2,5,null,null,"1","5",null,null,null,null,null,null,null,null,null,null,"0","10","Episodic",20,9,13,5,50,10,50,1.1499999999999999,1.1499999999999999,88,"LC","Least Concern",2,0,0,"LoM_0088","scrubs/shrublands/mallee with logs","Woody vegetation"]
["Lowan Mallee","LoM_","Heathy Woodland","Lowan MalleeHeathy Woodland","LoM_0048",50,15,10,20,0,5,null,null,null,null,13,40,14,30,null,null,null,null,2,1,null,null,1,1,null,null,4,10,2,5,null,null,"1","5",null,null,null,null,null,null,1,1,0,10,"0","10","Episodic",20,11,27,2,70,40,150,1,1,48,"LC","Least Concern",1,0,"y","LoM_0048","Forest/Woodland","Woody vegetation"]
["Lowan Mallee","LoM_","Intermittent Swampy Woodland","Lowan MalleeIntermittent Swampy Woodland","LoM_0813",70,15,15,20,0,5,1,5,null,null,1,5,1,5,null,null,2,5,5,10,1,5,null,null,null,null,3,30,2,10,null,null,null,null,null,null,null,null,null,null,null,null,null,null,null,null,"Continuous",0,9,3,8,15,20,200,1,1,813,"Vu","Vulnerable",1,0,0,"LoM_0813","Forest/Woodland","Woody vegetation"]
["Lowan Mallee","LoM_","Lake Bed Herbland","Lowan MalleeLake Bed Herbland","LoM_0107",0,0,0,null,null,null,null,null,null,null,2,5,2,5,null,null,null,null,3,25,3,20,null,null,null,null,null,null,null,null,null,null,null,null,null,null,null,null,null,null,null,null,null,null,null,null,"Episodic",10,4,4,6,10,5,0,1.36,1.36,107,"D","Depleted",6,0,0,"LoM_0107","wetlands","Non-woody wetland vegetation"]
["Lowan Mallee","LoM_","Lignum Swampy Woodland","Lowan MalleeLignum Swampy Woodland","LoM_0823",70,15,15,20,0,5,null,null,null,null,2,30,1,5,null,null,2,1,8,10,4,10,null,null,1,5,2,5,3,15,null,null,null,null,null,null,null,null,null,null,null,null,null,null,"0","10","Continuous",0,10,3,14,35,10,100,1,1,823,"D","Depleted",1,0,0,"LoM_0823","Forest/Woodland","Woody vegetation"]
["Lowan Mallee","LoM_","Loamy Sands Mallee","Lowan MalleeLoamy Sands Mallee","LoM_0091",0,0,5,25,null,null,null,null,null,null,5,20,5,10,null,null,2,1,6,10,2,1,1,1,null,null,3,5,null,null,null,null,"1","5",null,null,null,null,null,null,null,null,0,10,"0","10","Episodic",20,10,10,10,30,15,50,1.1499999999999999,1.1499999999999999,91,"LC","Least Concern",2,0,0,"LoM_0091","scrubs/shrublands/mallee with logs","Woody vegetation"]
["Lowan Mallee","LoM_","Low Rises Woodland","Lowan MalleeLow Rises Woodland","LoM_0066",60,20,15,20,0,5,2,5,null,null,5,15,3,5,null,null,1,1,3,5,2,1,null,null,null,null,7,25,1,1,null,null,null,null,null,null,null,null,null,null,null,null,0,10,"0","10","Continuous",0,11,10,6,25,15,200,1,1,66,"En","Endangered",1,0,0,"LoM_0066","Forest/Woodland","Woody vegetation"]
["Lowan Mallee","LoM_","Lowan Sands Mallee","Lowan MalleeLowan Sands Mallee","LoM_0087",0,0,7,25,null,null,null,null,null,null,5,35,7,30,1,1,null,null,4,10,null,null,1,1,null,null,5,5,2,10,null,null,null,null,null,null,null,null,null,null,null,null,null,null,null,null,"Episodic",20,7,12,4,65,5,50,1.1499999999999999,1.1499999999999999,87,"LC","Least Concern",2,0,0,"LoM_0087","scrubs/shrublands/mallee with logs","Woody vegetation"]
["Lowan Mallee","LoM_","Non-treed Semi-arid Chenopod Woodland","Lowan MalleeNon-treed Semi-arid Chenopod Woodland","LoM_0098_61",0,0,0,null,null,null,null,null,null,null,2,40,4,15,1,1,2,5,6,15,8,15,null,null,1,5,2,5,1,1,null,null,null,null,null,null,null,null,null,null,null,null,0,10,"0","30","Continuous",0,11,6,16,55,5,0,1.36,{"$error":"#N/A"},{"$error":"#N/A"},{"$error":"#N/A"},{"$error":"#N/A"},{"$error":"#N/A"},{"$error":"#N/A"},{"$error":"#N/A"},{"$error":"#N/A"},{"$error":"#N/A"},{"$error":"#N/A"}]
["Lowan Mallee","LoM_","Parilla Mallee","Lowan MalleeParilla Mallee","LoM_0981",35,25,10,25,0,5,null,null,null,null,4,10,3,10,null,null,1,1,3,5,5,5,null,null,null,null,6,15,1,5,null,null,null,null,null,null,null,null,null,null,null,null,0,10,"0","10","Continuous",0,10,7,9,20,20,150,1,1,981,"En","Endangered",1,0,"y","LoM_0981","Forest/Woodland","Woody vegetation"]
["Lowan Mallee","LoM_","Plains Grassland","Lowan MalleePlains Grassland","LoM_0132",0,0,0,null,null,null,null,null,null,null,null,null,5,10,null,null,null,null,12,15,4,10,null,null,null,null,4,25,2,1,null,null,null,null,null,null,null,null,null,null,null,null,0,10,"0","20","Continuous",0,7,5,16,10,5,0,1.36,1.36,132,"En","Endangered",5,"y",0,"LoM_0132","grasslands","Other grassland vegetation"]
["Lowan Mallee","LoM_","Plains Savannah","Lowan MalleePlains Savannah","LoM_0826",0,0,0,null,null,null,null,null,null,null,null,null,2,5,null,null,3,5,6,20,3,10,1,5,1,5,5,35,2,5,null,null,null,null,null,null,null,null,null,null,null,null,0,10,"0","25","Continuous",0,10,2,12,5,5,0,1,1,826,"En","Endangered",1,0,0,"LoM_0826","Forest/Woodland","Woody vegetation"]
["Lowan Mallee","LoM_","Plains Woodland","Lowan MalleePlains Woodland","LoM_0803",70,15,15,15,0,5,null,null,null,null,2,5,2,5,1,1,1,1,20,25,4,10,1,5,1,1,16,30,3,5,null,null,null,null,null,null,null,null,null,null,null,null,0,10,"0","10","Continuous",0,13,4,25,10,10,100,1,1,803,"En","Endangered",1,0,0,"LoM_0803","Forest/Woodland","Woody vegetation"]
["Lowan Mallee","LoM_","Red Gum Swamp",{"$f":"CONCATENATE(A643,C643)","v":"Lowan MalleeRed Gum Swamp"},"LoM_0292",80,10,15,10,0,5,1,10,null,null,1,1,null,null,null,null,3,10,10,25,3,5,2,5,null,null,8,20,2,15,null,null,null,null,null,null,null,null,null,null,null,null,0,10,null,null,"Episodic",5,10,2,16,11,20,150,1,1,292,"En","Endangered",1,0,0,"LoM_0292","Forest/Woodland","Woody vegetation"]
["Lowan Mallee","LoM_","Red Swale Mallee","Lowan MalleeRed Swale Mallee","LoM_0095",0,0,6,30,null,null,null,null,null,null,4,10,3,5,null,null,1,1,7,10,2,1,1,1,null,null,3,5,null,null,null,null,null,null,null,null,null,null,null,null,null,null,0,10,"0","20","Episodic",30,9,7,10,15,15,50,1.1499999999999999,1.1499999999999999,95,"LC","Least Concern",2,0,0,"LoM_0095","scrubs/shrublands/mallee with logs","Woody vegetation"]
["Lowan Mallee","LoM_","Ridged Plains Mallee","Lowan MalleeRidged Plains Mallee","LoM_0096",40,15,10,10,0,5,null,null,null,null,3,5,3,10,1,1,2,5,5,10,5,15,1,5,1,1,3,20,1,1,null,null,null,null,null,null,null,null,null,null,null,null,0,10,"0","20","Continuous",0,13,6,12,15,5,50,1,1,96,"En","Endangered",1,0,"y","LoM_0096","Forest/Woodland","Woody vegetation"]
["Lowan Mallee","LoM_","Riparian Woodland","Lowan MalleeRiparian Woodland","LoM_0641",80,15,15,10,0,5,2,10,null,null,2,10,1,1,null,null,4,10,5,10,1,5,3,10,null,null,4,30,2,5,null,null,null,null,null,null,null,null,null,null,1,5,0,10,null,null,"Continuous",0,12,5,10,21,30,200,1,1,641,"Vu","Vulnerable",1,0,0,"LoM_0641","Forest/Woodland","Woody vegetation"]
["Lowan Mallee","LoM_","Riverine Chenopod Woodland","Lowan MalleeRiverine Chenopod Woodland","LoM_0103",40,5,15,10,0,5,null,null,null,null,3,30,5,25,1,1,null,null,5,5,5,10,null,null,null,null,2,5,null,null,null,null,null,null,null,null,null,null,null,null,null,null,null,null,null,null,"Continuous",0,7,8,10,55,5,50,1,1,103,"D","Depleted",1,0,0,"LoM_0103","Forest/Woodland","Woody vegetation"]
["Lowan Mallee","LoM_","Riverine Grassy Woodland","Lowan MalleeRiverine Grassy Woodland","LoM_0295",80,15,20,20,0,5,null,null,null,null,null,null,4,10,null,null,4,10,2,10,5,10,1,1,null,null,5,20,2,5,null,null,null,null,null,null,null,null,null,null,null,null,0,10,null,null,"Continuous",0,9,4,11,10,10,200,1,1,295,"D","Depleted",1,0,0,"LoM_0295","Forest/Woodland","Woody vegetation"]
["Lowan Mallee","LoM_","Salt Paperbark Woodland","Lowan MalleeSalt Paperbark Woodland","LoM_0676",0,0,8,20,null,null,null,null,null,null,null,null,null,null,1,10,null,null,3,15,3,10,null,null,null,null,1,1,null,null,null,null,null,null,null,null,null,null,null,null,null,null,null,null,"0","10","Continuous",0,5,null,6,null,0,100,1.1499999999999999,{"$error":"#N/A"},{"$error":"#N/A"},{"$error":"#N/A"},{"$error":"#N/A"},{"$error":"#N/A"},{"$error":"#N/A"},{"$error":"#N/A"},{"$error":"#N/A"},{"$error":"#N/A"},{"$error":"#N/A"}]
["Lowan Mallee","LoM_","Samphire Shrubland","Lowan MalleeSamphire Shrubland","LoM_0101",0,0,0,null,null,null,null,null,null,null,null,null,4,20,null,null,null,null,7,5,3,5,null,null,null,null,2,1,2,1,null,null,null,null,null,null,null,null,null,null,null,null,null,null,"0","10","Continuous",0,6,4,10,20,0,0,1.36,1.36,101,"LC","Least Concern",5,0,0,"LoM_0101","grasslands","Other grassland vegetation"]
["Lowan Mallee","LoM_","Sandstone Ridge Shrubland","Lowan MalleeSandstone Ridge Shrubland","LoM_0093",0,0,0,null,null,null,null,null,null,null,4,40,4,5,null,null,null,null,2,5,null,null,1,1,null,null,3,5,null,null,"1","1",null,null,null,null,null,null,null,null,null,null,0,10,"0","15","Episodic",20,8,8,2,45,10,0,1.1499999999999999,1.1499999999999999,93,"LC","Least Concern",2,0,0,"LoM_0093","scrubs/shrublands/mallee with logs","Woody vegetation"]
["Lowan Mallee","LoM_","Seasonally Inundated Shrubby Woodland","Lowan MalleeSeasonally Inundated Shrubby Woodland","LoM_0195",70,15,15,15,0,5,null,null,null,null,7,35,4,5,1,1,3,5,4,10,3,5,null,null,null,null,6,20,4,5,"3","1",null,null,null,null,null,null,"1","1",null,null,0,10,null,null,"Continuous",0,12,11,10,40,20,150,1,1,195,"LC","Least Concern",1,0,0,"LoM_0195","Forest/Woodland","Woody vegetation"]
["Lowan Mallee","LoM_","Semi-arid Chenopod Woodland","Lowan MalleeSemi-arid Chenopod Woodland","LoM_0098",40,15,12,15,0,5,3,10,null,null,2,40,4,15,1,1,2,5,6,15,8,15,null,null,1,5,2,5,1,1,null,null,null,null,null,null,null,null,null,null,null,null,0,10,"0","30","Continuous",0,13,9,16,65,15,50,1,1,98,"Vu","Vulnerable",1,0,"y","LoM_0098","Forest/Woodland","Woody vegetation"]
["Lowan Mallee","LoM_","Semi-arid Woodland","Lowan MalleeSemi-arid Woodland","LoM_0097",40,20,12,20,0,5,null,null,null,null,5,15,5,20,null,null,2,5,7,5,2,5,null,null,null,null,2,10,1,1,null,null,null,null,null,null,null,null,null,null,null,null,0,10,"0","20","Continuous",0,10,10,11,35,20,200,1,1,97,"D","Depleted",1,0,"y","LoM_0097","Forest/Woodland","Woody vegetation"]
["Lowan Mallee","LoM_","Shallow Sands Woodland","Lowan MalleeShallow Sands Woodland","LoM_0882",60,15,15,20,0,5,1,5,null,null,3,10,4,20,2,5,1,1,7,15,3,5,null,null,null,null,8,25,3,1,"2","1",null,null,null,null,null,null,null,null,null,null,0,10,"0","10","Continuous",0,13,8,11,35,20,200,1,1,882,"D","Depleted",1,0,0,"LoM_0882","Forest/Woodland","Woody vegetation"]
["Lowan Mallee","LoM_","Tea-tree Scrub","Lowan MalleeTea-tree Scrub","LoM_0090",0,0,0,null,null,null,null,null,null,null,5,55,5,15,null,null,null,null,4,5,null,null,2,5,null,null,5,10,1,1,null,null,null,null,null,null,null,null,null,null,1,1,0,10,"0","10","Continuous",0,9,10,4,70,20,0,1.36,1.36,90,"LC","Least Concern",4,0,0,"LoM_0090","heathlands","Woody vegetation"]
["Lowan Mallee","LoM_","Treed Plains Savannah","Lowan MalleeTreed Plains Savannah","LoM_0826_61",40,5,10,10,0,5,null,null,null,null,null,null,2,5,null,null,3,5,6,20,3,10,1,5,1,5,5,35,2,5,null,null,null,null,null,null,null,null,null,null,null,null,0,10,"0","25","Continuous",0,11,2,12,5,5,50,1,{"$error":"#N/A"},{"$error":"#N/A"},{"$error":"#N/A"},{"$error":"#N/A"},{"$error":"#N/A"},{"$error":"#N/A"},{"$error":"#N/A"},{"$error":"#N/A"},{"$error":"#N/A"},{"$error":"#N/A"}]
["Lowan Mallee","LoM_","Treed Sandstone Ridge Shrubland","Lowan MalleeTreed Sandstone Ridge Shrubland","LoM_0093_61",0,0,3,15,null,null,null,null,null,null,4,40,4,5,null,null,null,null,2,5,null,null,1,1,null,null,3,5,null,null,"1","1",null,null,null,null,null,null,null,null,null,null,0,10,"0","15","Episodic",20,8,8,2,45,10,50,1,{"$error":"#N/A"},{"$error":"#N/A"},{"$error":"#N/A"},{"$error":"#N/A"},{"$error":"#N/A"},{"$error":"#N/A"},{"$error":"#N/A"},{"$error":"#N/A"},{"$error":"#N/A"},{"$error":"#N/A"}]
["Lowan Mallee","LoM_","Woorinen Mallee","Lowan MalleeWoorinen Mallee","LoM_0824",15,30,12,25,null,null,null,null,null,null,6,10,6,20,null,null,null,null,6,10,7,10,null,null,null,null,1,1,null,null,null,null,null,null,null,null,null,null,null,null,null,null,0,10,"0","15","Continuous",0,7,12,13,30,20,200,1,1,824,"LC","Least Concern",1,0,"y","LoM_0824","Forest/Woodland","Woody vegetation"]
["Lowan Mallee","LoM_","Woorinen Sands Mallee","Lowan MalleeWoorinen Sands Mallee","LoM_0086",15,30,7,25,null,null,null,null,null,null,4,5,2,10,1,5,null,null,6,5,6,5,null,null,null,null,3,5,1,1,null,null,"1","15",null,null,null,null,null,null,null,null,0,10,"0","10","Continuous",0,10,6,12,15,15,100,1,1,86,"LC","Least Concern",1,0,"y","LoM_0086","Forest/Woodland","Woody vegetation"]
["Monaro Tablelands","MonT","Blackthorn Scrub","Monaro TablelandsBlackthorn Scrub","MonT0027",0,0,0,null,null,null,null,null,null,null,8,40,1,1,null,null,2,1,3,5,null,null,1,1,null,null,3,5,1,1,null,null,null,null,1,1,null,null,null,null,3,5,0,10,null,null,"Continuous",0,10,9,5,41,40,100,1.25,1.25,27,"Ra","Rare",3,0,0,"MonT0027","scrubs/shrublands/mallee without logs","Woody vegetation"]
["Monaro Tablelands","MonT","Cool Temperate Rainforest","Monaro TablelandsCool Temperate Rainforest","MonT0031",70,20,25,50,0,5,2,20,null,null,2,5,null,null,null,null,2,10,2,5,null,null,null,null,null,null,null,null,null,null,null,null,null,null,6,25,"2","25","2","5",2,1,0,20,null,null,"Continuous",0,10,4,4,25,50,200,1,1,31,"Ra","Rare",1,0,0,"MonT0031","Forest/Woodland","Woody vegetation"]
["Monaro Tablelands","MonT","Cool Temperate Rainforest/Warm Temperate Rainf","Monaro TablelandsCool Temperate Rainforest/Warm Temperate Rainf","MonT0033",70,20,20,50,4,5,5,25,null,null,6,15,null,null,null,null,2,1,3,5,1,1,2,1,2,1,2,5,null,null,null,null,null,null,8,25,"3","20","4","5",7,20,0,20,null,null,"Continuous",0,14,11,6,40,50,200,1,{"$error":"#N/A"},{"$error":"#N/A"},{"$error":"#N/A"},{"$error":"#N/A"},{"$error":"#N/A"},{"$error":"#N/A"},{"$error":"#N/A"},{"$error":"#N/A"},{"$error":"#N/A"},{"$error":"#N/A"}]
["Monaro Tablelands","MonT","Damp Forest","Monaro TablelandsDamp Forest","MonT0029",90,20,30,40,0,5,3,15,null,null,10,25,3,5,null,null,2,1,6,15,1,1,2,5,1,5,4,10,1,1,null,null,null,null,4,20,"1","5",null,null,3,10,0,20,null,null,"Continuous",0,15,16,9,45,50,300,1,1,29,"LC","Least Concern",1,0,0,"MonT0029","Forest/Woodland","Woody vegetation"]
["Monaro Tablelands","MonT","Grassy Dry Forest","Monaro TablelandsGrassy Dry Forest","MonT0022",60,20,20,30,0,5,1,10,null,null,7,20,3,5,1,5,3,1,11,20,2,1,2,5,1,5,6,25,1,1,null,null,null,null,2,5,null,null,null,null,3,5,0,10,"0","10","Continuous",0,16,11,16,35,20,200,1,1,22,"LC","Least Concern",1,0,0,"MonT0022","Forest/Woodland","Woody vegetation"]
["Monaro Tablelands","MonT","Montane Damp Forest","Monaro TablelandsMontane Damp Forest","MonT0038",90,20,30,40,0,5,3,20,null,null,7,25,2,5,null,null,3,5,8,15,2,5,1,1,null,null,6,15,1,1,null,null,null,null,2,10,"1","1",null,null,1,5,0,20,null,null,"Continuous",0,14,12,13,50,50,300,1,1,38,"LC","Least Concern",1,0,0,"MonT0038","Forest/Woodland","Woody vegetation"]
["Monaro Tablelands","MonT","Montane Dry Woodland","Monaro TablelandsMontane Dry Woodland","MonT0036",60,15,15,20,0,5,2,10,null,null,7,30,4,10,null,null,2,5,10,15,3,5,2,5,null,null,6,15,2,5,null,null,null,null,2,5,null,null,null,null,1,1,0,10,"0","10","Continuous",0,14,13,15,50,20,150,1,1,36,"LC","Least Concern",1,0,0,"MonT0036","Forest/Woodland","Woody vegetation"]
["Monaro Tablelands","MonT","Montane Grassy Woodland","Monaro TablelandsMontane Grassy Woodland","MonT0037",60,15,10,20,0,5,1,5,null,null,2,10,3,5,1,1,1,1,8,20,2,5,1,5,null,null,5,25,1,5,null,null,null,null,1,1,null,null,null,null,1,1,0,10,"0","10","Continuous",0,15,6,11,20,20,150,1,1,37,"Vu","Vulnerable",1,0,0,"MonT0037","Forest/Woodland","Woody vegetation"]
["Monaro Tablelands","MonT","Montane Riparian Woodland","Monaro TablelandsMontane Riparian Woodland","MonT0040",60,15,10,10,0,5,1,10,null,null,3,15,3,5,null,null,4,10,12,20,4,10,3,5,1,1,6,30,3,5,null,null,null,null,1,1,null,null,null,null,1,1,0,20,null,null,"Continuous",0,14,7,20,30,40,150,1,1,40,"Vu","Vulnerable",1,0,0,"MonT0040","Forest/Woodland","Woody vegetation"]
["Monaro Tablelands","MonT","Montane Wet Forest","Monaro TablelandsMontane Wet Forest","MonT0039",90,20,30,40,0,5,5,30,null,null,5,25,1,1,null,null,null,null,3,5,null,null,1,1,1,1,2,10,null,null,null,null,null,null,4,30,"2","10",null,null,1,1,0,20,null,null,"Continuous",0,12,11,3,56,50,300,1,1,39,"LC","Least Concern",1,0,0,"MonT0039","Forest/Woodland","Woody vegetation"]
["Monaro Tablelands","MonT","Riparian Forest","Monaro TablelandsRiparian Forest","MonT0018",80,20,30,40,0,5,2,20,null,null,3,5,3,5,1,1,2,5,21,15,9,10,3,5,null,null,5,10,3,10,null,null,null,null,3,10,null,null,null,null,3,1,0,20,null,null,"Continuous",0,14,8,32,30,50,300,1,1,18,"LC","Least Concern",1,0,0,"MonT0018","Forest/Woodland","Woody vegetation"]
["Monaro Tablelands","MonT","Rocky Outcrop Shrubland","Monaro TablelandsRocky Outcrop Shrubland","MonT0028",0,20,0,null,null,null,null,null,null,null,7,25,2,5,1,1,3,5,3,5,null,null,1,5,null,null,5,10,null,null,null,null,null,null,null,null,null,null,null,null,null,null,0,10,"0","10","Continuous",0,9,9,6,30,40,100,1.36,1.36,28,"Ra","Rare",4,0,0,"MonT0028","heathlands","Woody vegetation"]
["Monaro Tablelands","MonT","Shrubby Dry Forest","Monaro TablelandsShrubby Dry Forest","MonT0021",60,20,25,30,0,5,1,10,null,null,6,30,4,10,1,1,1,5,2,5,1,1,1,5,null,null,3,10,1,1,null,null,null,null,null,null,null,null,null,null,null,null,0,10,null,null,"Episodic",20,12,11,4,50,20,200,1,1,21,"LC","Least Concern",1,0,0,"MonT0021","Forest/Woodland","Woody vegetation"]
["Monaro Tablelands","MonT","Sub-alpine Woodland","Monaro TablelandsSub-alpine Woodland","MonT0043",50,15,10,15,0,5,1,5,null,null,5,20,2,10,null,null,3,10,8,20,2,5,null,null,null,null,4,20,1,5,null,null,null,null,1,1,null,null,null,null,null,null,0,20,"0","10","Continuous",0,12,8,13,35,20,100,1,1,43,"LC","Least Concern",1,0,0,"MonT0043","Forest/Woodland","Woody vegetation"]
["Monaro Tablelands","MonT","Tableland Damp Forest","Monaro TablelandsTableland Damp Forest","MonT0035",90,20,30,40,0,5,3,20,null,null,7,20,2,10,null,null,2,5,8,15,2,15,1,5,1,1,3,15,1,5,null,null,null,null,null,null,null,null,null,null,null,null,0,20,null,null,"Continuous",0,12,12,12,50,50,300,1,1,35,"LC","Least Concern",1,0,0,"MonT0035","Forest/Woodland","Woody vegetation"]
["Monaro Tablelands","MonT","Valley Grassy Forest","Monaro TablelandsValley Grassy Forest","MonT0047",70,20,25,20,0,5,3,15,null,null,7,25,1,1,2,1,3,5,10,20,3,5,3,15,null,null,5,20,2,5,null,null,null,null,2,5,null,null,null,null,5,5,0,20,null,null,"Continuous",0,14,11,16,41,20,200,1,1,47,"D","Depleted",1,0,0,"MonT0047","Forest/Woodland","Woody vegetation"]
["Monaro Tablelands","MonT","Wet Forest","Monaro TablelandsWet Forest","MonT0030",90,20,0,40,0,5,4,20,null,null,7,25,3,5,null,null,1,1,5,15,1,1,1,1,1,1,3,5,1,1,null,null,null,null,4,30,"2","15",null,null,4,10,0,20,null,null,"Continuous",0,15,14,7,50,50,300,1,1,30,"LC","Least Concern",1,0,0,"MonT0030","Forest/Woodland","Woody vegetation"]
["Murray Fans","MuF_","Aquatic Herbland","Murray FansAquatic Herbland","MuF_0653",null,0,0,null,null,null,null,null,null,null,null,null,null,null,null,null,null,null,null,null,null,null,null,null,null,null,null,null,null,null,null,null,null,null,null,null,null,null,null,null,null,null,null,null,null,null,null,0,0,null,null,null,0,0,1.36,1.36,653,"D","Depleted",6,0,0,"MuF_0653","wetlands","Non-woody wetland vegetation"]
["Murray Fans","MuF_","Chenopod Grassland","Murray FansChenopod Grassland","MuF_0829",0,0,0,null,null,null,null,null,null,null,1,10,6,30,null,null,1,1,5,15,4,5,null,null,null,null,3,20,null,null,null,null,null,null,null,null,null,null,null,null,null,null,0,10,"0","20","Continuous",0,8,7,10,40,5,0,1.36,1.36,829,"En","Endangered",5,"y",0,"MuF_0829","grasslands","Other grassland vegetation"]
["Murray Fans","MuF_","Chenopod Mallee","Murray FansChenopod Mallee","MuF_0158",20,20,12,20,null,null,null,null,null,null,1,5,9,45,null,null,null,null,3,5,2,10,null,null,null,null,null,null,null,null,null,null,null,null,null,null,null,null,null,null,null,null,0,10,"0","15","Continuous",0,6,10,5,50,10,100,1,1,158,"Vu","Vulnerable",1,0,"y","MuF_0158","Forest/Woodland","Woody vegetation"]
["Murray Fans","MuF_","Creekline Grassy Woodland","Murray FansCreekline Grassy Woodland","MuF_0068",80,15,15,15,0,5,null,null,null,null,2,5,2,1,null,null,null,null,5,10,1,1,2,15,null,null,7,25,null,null,null,null,null,null,null,null,null,null,null,null,null,null,0,10,null,null,"Continuous",0,8,4,6,6,40,200,1,1,68,"En","Endangered",1,0,0,"MuF_0068","Forest/Woodland","Woody vegetation"]
["Murray Fans","MuF_","Dunefield Heathland","Murray FansDunefield Heathland","MuF_0089",null,0,0,null,null,null,null,null,null,null,null,null,null,null,null,null,null,null,null,null,null,null,null,null,null,null,null,null,null,null,null,null,null,null,null,null,null,null,null,null,null,null,null,null,"0","10",null,0,1,null,null,null,0,0,0,{"$error":"#N/A"},{"$error":"#N/A"},{"$error":"#N/A"},{"$error":"#N/A"},{"$error":"#N/A"},{"$error":"#N/A"},{"$error":"#N/A"},{"$error":"#N/A"},{"$error":"#N/A"},{"$error":"#N/A"}]
["Murray Fans","MuF_","Floodplain Grassy Wetland","Murray FansFloodplain Grassy Wetland","MuF_0809",0,0,0,null,null,null,null,null,null,null,null,null,null,null,null,null,null,null,5,10,3,5,1,5,null,null,3,5,4,60,null,null,null,null,null,null,null,null,null,null,null,null,null,null,null,null,"Episodic",5,5,null,8,null,10,50,1.36,1.36,809,"En","Endangered",6,0,0,"MuF_0809","wetlands","Non-woody wetland vegetation"]
["Murray Fans","MuF_","Floodplain Riparian Woodland","Murray FansFloodplain Riparian Woodland","MuF_0056",80,15,20,20,0,5,1,5,null,null,2,5,1,1,null,null,null,null,4,10,2,1,2,10,1,5,6,35,2,10,null,null,null,null,null,null,null,null,null,null,null,null,0,10,null,null,"Episodic",10,11,4,6,11,40,300,1,1,56,"D","Depleted",1,0,0,"MuF_0056","Forest/Woodland","Woody vegetation"]
["Murray Fans","MuF_","Floodway Pond Herbland","Murray FansFloodway Pond Herbland","MuF_0810",0,0,0,null,null,null,null,null,null,null,null,null,null,null,null,null,1,1,5,20,4,15,null,null,null,null,2,10,3,20,null,null,null,null,null,null,null,null,null,null,null,null,null,null,null,null,"Episodic",5,5,null,10,null,5,50,1.36,1.36,810,"D","Depleted",6,0,0,"MuF_0810","wetlands","Non-woody wetland vegetation"]
["Murray Fans","MuF_","Grassy Riverine Forest","Murray FansGrassy Riverine Forest","MuF_0106",90,20,25,30,0,5,1,10,null,null,null,null,null,null,null,null,2,10,3,10,null,null,null,null,null,null,3,25,3,10,null,null,null,null,null,null,null,null,null,null,null,null,0,10,null,null,"Continuous",0,7,1,5,10,40,300,1,1,106,"D","Depleted",1,0,0,"MuF_0106","Forest/Woodland","Woody vegetation"]
["Murray Fans","MuF_","Grassy Woodland","Murray FansGrassy Woodland","MuF_0175",70,15,15,15,0,5,1,5,null,null,3,10,4,5,null,null,3,5,12,20,null,null,1,5,1,5,19,40,4,5,null,null,null,null,null,null,null,null,null,null,null,null,0,10,"0","10","Continuous",0,12,8,15,20,20,150,1,1,175,"En","Endangered",1,0,0,"MuF_0175","Forest/Woodland","Woody vegetation"]
["Murray Fans","MuF_","Intermittent Swampy Woodland","Murray FansIntermittent Swampy Woodland","MuF_0813",70,15,15,20,0,5,1,5,null,null,1,5,1,5,null,null,2,5,5,10,1,5,null,null,null,null,3,30,2,10,null,null,null,null,null,null,null,null,null,null,null,null,null,null,null,null,"Continuous",0,9,3,8,15,20,200,1,1,813,"D","Depleted",1,0,0,"MuF_0813","Forest/Woodland","Woody vegetation"]
["Murray Fans","MuF_","Lake Bed Herbland","Murray FansLake Bed Herbland","MuF_0107",0,0,0,null,null,null,null,null,null,null,2,5,2,5,null,null,null,null,3,25,3,20,null,null,null,null,2,5,null,null,null,null,null,null,null,null,null,null,null,null,null,null,null,null,null,null,"Episodic",10,5,4,6,10,5,0,1.36,1.36,107,"Vu","Vulnerable",6,0,0,"MuF_0107","wetlands","Non-woody wetland vegetation"]
["Murray Fans","MuF_","Lignum Shrubland","Murray FansLignum Shrubland","MuF_0808",0,0,0,null,null,null,null,null,null,null,2,30,3,10,null,null,1,1,6,10,5,5,null,null,1,10,2,20,null,null,null,null,null,null,null,null,null,null,null,null,null,null,null,null,"0","10","Continuous",0,8,5,12,40,10,0,1.36,1.36,808,"Vu","Vulnerable",6,0,0,"MuF_0808","wetlands","Non-woody wetland vegetation"]
["Murray Fans","MuF_","Lignum Swamp","Murray FansLignum Swamp","MuF_0104",0,0,0,null,null,null,null,null,null,null,1,20,null,null,null,null,4,5,8,25,2,10,null,null,1,5,2,5,2,5,null,null,null,null,null,null,null,null,null,null,1,1,null,null,"0","10","Continuous",0,9,1,14,20,5,0,1.36,1.36,104,"Vu","Vulnerable",6,0,0,"MuF_0104","wetlands","Non-woody wetland vegetation"]
["Murray Fans","MuF_","Lignum Swampy Woodland","Murray FansLignum Swampy Woodland","MuF_0823",70,15,15,20,0,5,null,null,null,null,2,30,1,5,null,null,2,1,8,10,5,10,null,null,1,5,4,10,3,15,null,null,null,null,null,null,null,null,null,null,1,0,null,null,"0","10","Continuous",0,10,3,10,35,10,100,1,1,823,"Vu","Vulnerable",1,0,0,"MuF_0823","Forest/Woodland","Woody vegetation"]
["Murray Fans","MuF_","Loamy Sands Mallee","Murray FansLoamy Sands Mallee","MuF_0091",0,0,5,25,null,null,null,null,null,null,5,20,5,10,null,null,2,1,6,10,2,1,1,1,null,null,3,5,null,null,null,null,"1","5",null,null,null,null,null,null,1,0,0,10,"0","10","Episodic",20,11,10,10,30,15,50,1.1499999999999999,1.1499999999999999,91,"LC","Least Concern",2,0,0,"MuF_0091","scrubs/shrublands/mallee with logs","Woody vegetation"]
["Murray Fans","MuF_","Low Chenopod Shrubland","Murray FansLow Chenopod Shrubland","MuF_0102",null,0,0,null,null,null,null,null,null,null,null,null,null,null,null,null,null,null,null,null,null,null,null,null,null,null,null,null,null,null,null,null,null,null,null,null,null,null,null,null,null,null,null,null,null,null,null,0,0,null,null,null,0,0,1.36,1.36,102,"D","Depleted",5,0,0,"MuF_0102","grasslands","Other grassland vegetation"]
["Murray Fans","MuF_","Low Rises Woodland","Murray FansLow Rises Woodland","MuF_0066",60,20,15,20,0,5,2,5,null,null,5,15,3,5,null,null,1,1,3,5,2,1,null,null,null,null,7,25,1,1,null,null,null,null,null,null,null,null,null,null,null,null,0,10,"0","10","Continuous",0,11,10,6,25,15,200,1,1,66,"En","Endangered",1,0,0,"MuF_0066","Forest/Woodland","Woody vegetation"]
["Murray Fans","MuF_","Lunette Woodland","Murray FansLunette Woodland","MuF_0652",80,8,15,10,2,5,1,5,null,null,3,10,1,1,null,null,3,5,8,15,2,5,2,5,null,null,12,45,2,5,null,null,null,null,null,null,null,null,null,null,null,null,0,10,"0","10","Continuous",0,12,5,13,16,10,100,1,{"$error":"#N/A"},{"$error":"#N/A"},{"$error":"#N/A"},{"$error":"#N/A"},{"$error":"#N/A"},{"$error":"#N/A"},{"$error":"#N/A"},{"$error":"#N/A"},{"$error":"#N/A"},{"$error":"#N/A"}]
["Murray Fans","MuF_","Plains Grassland","Murray FansPlains Grassland","MuF_0132",0,0,0,null,null,null,null,null,null,null,null,null,2,5,null,null,3,5,10,20,3,5,1,5,1,5,10,30,2,5,null,null,null,null,null,null,null,null,null,null,null,null,0,10,"0","20","Episodic",5,10,2,16,5,10,0,1.36,1.36,132,"En","Endangered",5,"y",0,"MuF_0132","grasslands","Other grassland vegetation"]
["Murray Fans","MuF_","Plains Grassy Wetland","Murray FansPlains Grassy Wetland","MuF_0125",0,0,0,null,null,null,null,null,null,null,null,null,null,null,null,null,5,5,11,20,6,10,2,5,null,null,7,20,3,30,null,null,null,null,null,null,null,null,null,null,null,null,0,10,null,null,"Episodic",5,7,null,22,null,10,50,1.36,1.36,125,"En","Endangered",6,"y",0,"MuF_0125","wetlands","Non-woody wetland vegetation"]
["Murray Fans","MuF_","Plains Savannah","Murray FansPlains Savannah","MuF_0826",0,0,0,null,null,null,null,null,null,null,null,null,2,5,null,null,3,5,6,20,3,10,1,5,1,5,5,35,2,5,null,null,null,null,null,null,null,null,null,null,null,null,0,10,"0","25","Continuous",0,10,2,12,5,5,0,1,1,826,"En","Endangered",1,0,0,"MuF_0826","Forest/Woodland","Woody vegetation"]
["Murray Fans","MuF_","Plains Woodland","Murray FansPlains Woodland","MuF_0803",60,15,15,15,null,5,null,null,null,null,3,10,1,5,2,10,2,1,9,10,5,10,1,1,null,null,6,20,2,1,null,null,null,null,null,null,null,null,null,null,1,1,0,10,"0","10","Continuous",0,12,4,16,15,10,100,1,1,803,"En","Endangered",1,0,0,"MuF_0803","Forest/Woodland","Woody vegetation"]
["Murray Fans","MuF_","Red Gum Swamp","Murray FansRed Gum Swamp","MuF_0292",80,10,15,10,0,5,null,null,null,null,null,null,null,null,null,null,null,null,8,25,null,null,2,5,null,null,2,5,2,40,null,null,null,null,null,null,null,null,null,null,null,null,0,10,"0","10","Episodic",5,7,null,8,null,20,150,1,1,292,"Vu","Vulnerable",1,0,0,"MuF_0292","Forest/Woodland","Woody vegetation"]
["Murray Fans","MuF_","Ridged Plains Mallee","Murray FansRidged Plains Mallee","MuF_0096",40,15,10,10,0,5,null,null,null,null,3,5,3,10,1,1,2,5,5,10,5,15,1,5,1,1,3,20,1,1,null,null,null,null,null,null,null,null,null,null,null,null,0,10,"0","20","Continuous",0,13,6,12,15,5,50,1,1,96,"En","Endangered",1,0,"y","MuF_0096","Forest/Woodland","Woody vegetation"]
["Murray Fans","MuF_","Riparian Woodland","Murray FansRiparian Woodland","MuF_0641",80,15,15,10,1,5,2,10,null,null,2,10,null,null,null,null,4,10,5,10,1,1,3,10,null,null,4,30,2,5,null,null,null,null,null,null,null,null,null,null,1,5,0,10,null,null,"Continuous",0,11,4,10,20,30,200,1,{"$error":"#N/A"},{"$error":"#N/A"},{"$error":"#N/A"},{"$error":"#N/A"},{"$error":"#N/A"},{"$error":"#N/A"},{"$error":"#N/A"},{"$error":"#N/A"},{"$error":"#N/A"},{"$error":"#N/A"}]
["Murray Fans","MuF_","Riverine Chenopod Woodland","Murray FansRiverine Chenopod Woodland","MuF_0103",40,5,15,10,0,5,null,null,null,null,3,30,5,25,1,1,null,null,5,5,5,10,null,null,null,null,2,5,null,null,null,null,null,null,null,null,null,null,null,null,null,null,null,null,null,null,"Continuous",0,7,8,10,55,5,50,1,1,103,"En","Endangered",1,0,0,"MuF_0103","Forest/Woodland","Woody vegetation"]
["Murray Fans","MuF_","Riverine Ephemeral Wetland","Murray FansRiverine Ephemeral Wetland","MuF_0975",null,0,0,null,null,null,null,null,null,null,null,null,null,null,null,null,null,null,null,null,null,null,null,null,null,null,null,null,null,null,null,null,null,null,null,null,null,null,null,null,null,null,null,null,null,null,null,0,0,null,null,null,0,0,1.36,1.36,975,"Vu","Vulnerable",6,0,0,"MuF_0975","wetlands","Non-woody wetland vegetation"]
["Murray Fans","MuF_","Riverine Grassland","Murray FansRiverine Grassland","MuF_1088",null,0,0,null,null,null,null,null,null,null,null,null,null,null,null,null,null,null,null,null,null,null,null,null,null,null,null,null,null,null,null,null,null,null,null,null,null,null,null,null,null,null,null,null,null,null,null,0,0,null,null,null,0,0,1.36,1.36,1088,"En","Endangered",5,0,0,"MuF_1088","grasslands","Other grassland vegetation"]
["Murray Fans","MuF_","Riverine Grassy Woodland",{"$f":"CONCATENATE(A707,C707)","v":"Murray FansRiverine Grassy Woodland"},"MuF_0295",80,15,20,20,0,5,null,null,null,null,null,null,4,10,null,null,4,10,2,10,5,10,1,1,null,null,5,20,2,5,null,null,null,null,null,null,null,null,null,null,null,null,0,10,null,null,"Continuous",0,9,4,11,10,10,200,1,1,295,"Vu","Vulnerable",1,0,0,"MuF_0295","Forest/Woodland","Woody vegetation"]
["Murray Fans","MuF_","Riverine Swamp Forest","Murray FansRiverine Swamp Forest","MuF_0814",90,20,25,30,0,5,null,null,null,null,null,null,null,null,null,null,2,5,6,15,null,null,null,null,1,5,1,5,2,30,null,null,null,null,null,null,null,null,null,null,null,null,null,null,null,null,"Continuous",0,6,null,8,null,20,200,1,1,814,"D","Depleted",1,0,0,"MuF_0814","Forest/Woodland","Woody vegetation"]
["Murray Fans","MuF_","Riverine Swampy Woodland","Murray FansRiverine Swampy Woodland","MuF_0815",70,15,15,20,0,5,null,null,null,null,null,null,null,null,null,null,2,5,3,10,1,5,3,10,null,null,2,10,3,20,null,null,null,null,null,null,null,null,null,null,null,null,null,null,null,null,"Episodic",5,7,null,6,null,10,100,1,1,815,"Vu","Vulnerable",1,0,0,"MuF_0815","Forest/Woodland","Woody vegetation"]
["Murray Fans","MuF_","Rushy Riverine Swamp","Murray FansRushy Riverine Swamp","MuF_0804",null,0,0,null,null,null,null,null,null,null,null,null,null,null,null,null,null,null,null,null,null,null,null,null,null,null,null,null,null,null,null,null,null,null,null,null,null,null,null,null,null,null,null,null,null,null,null,0,0,null,null,null,0,0,1.36,1.36,804,"D","Depleted",6,0,0,"MuF_0804","wetlands","Non-woody wetland vegetation"]
["Murray Fans","MuF_","Samphire Shrubland","Murray FansSamphire Shrubland","MuF_0101",0,0,0,null,null,null,null,null,null,null,null,null,4,20,null,null,null,null,7,5,3,5,null,null,null,null,2,1,2,1,null,null,null,null,null,null,null,null,null,null,null,null,null,null,"0","10","Continuous",0,6,4,10,20,0,0,1.36,1.36,101,"LC","Least Concern",5,0,0,"MuF_0101","grasslands","Other grassland vegetation"]
["Murray Fans","MuF_","Sand Ridge Woodland","Murray FansSand Ridge Woodland","MuF_0264",70,15,15,15,0,5,null,null,null,null,4,20,3,10,2,5,2,5,10,15,5,5,3,10,null,null,8,15,null,null,null,null,null,null,1,5,null,null,null,null,1,5,0,10,"0","10","Continuous",0,13,7,17,30,10,150,1,1,264,"En","Endangered",1,0,0,"MuF_0264","Forest/Woodland","Woody vegetation"]
["Murray Fans","MuF_","Sedgy Riverine Forest","Murray FansSedgy Riverine Forest","MuF_0816",80,20,25,30,0,5,null,null,null,null,1,10,null,null,null,null,null,null,2,5,2,5,1,50,null,null,2,10,2,10,null,null,null,null,null,null,null,null,null,null,null,null,null,null,null,null,"Episodic",10,7,1,4,10,10,200,1,1,816,"D","Depleted",1,0,0,"MuF_0816","Forest/Woodland","Woody vegetation"]
["Murray Fans","MuF_","Semi-arid Chenopod Woodland","Murray FansSemi-arid Chenopod Woodland","MuF_0098",40,15,12,15,0,5,3,10,null,null,2,40,4,15,1,1,2,5,6,15,8,15,null,null,1,5,2,5,1,1,null,null,null,null,null,null,null,null,null,null,null,null,0,10,"0","30","Continuous",0,13,9,16,65,5,50,1,1,98,"En","Endangered",1,0,"y","MuF_0098","Forest/Woodland","Woody vegetation"]
["Murray Fans","MuF_","Semi-arid Woodland","Murray FansSemi-arid Woodland","MuF_0097",40,20,12,20,0,5,null,null,null,null,5,15,5,20,null,null,2,5,7,5,2,5,null,null,null,null,2,10,1,1,null,null,null,null,null,null,null,null,null,null,null,null,0,10,"0","20","Continuous",0,10,10,11,35,20,200,1,1,97,"Vu","Vulnerable",1,0,"y","MuF_0097","Forest/Woodland","Woody vegetation"]
["Murray Fans","MuF_","Shallow Freshwater Marsh","Murray FansShallow Freshwater Marsh","MuF_0200",null,null,0,null,null,null,null,null,null,null,null,null,null,null,null,null,null,null,null,null,null,null,null,null,null,null,null,null,null,null,null,null,null,null,null,null,null,null,null,null,null,null,null,null,null,null,null,5,0,null,null,null,null,0,1.36,1.36,200,"Vu","Vulnerable",6,0,0,"MuF_0200","wetlands","Non-woody wetland vegetation"]
["Murray Fans","MuF_","Shallow Sands Woodland","Murray FansShallow Sands Woodland","MuF_0882",70,15,15,15,0,5,1,5,null,null,4,15,3,10,1,5,null,null,10,20,2,5,1,1,null,null,13,30,3,5,null,null,null,null,null,null,null,null,null,null,null,null,0,10,"0","10","Continuous",0,12,8,12,30,20,150,1,1,882,"Vu","Vulnerable",1,0,0,"MuF_0882","Forest/Woodland","Woody vegetation"]
["Murray Fans","MuF_","Shrubby Riverine Woodland","Murray FansShrubby Riverine Woodland","MuF_0818",80,5,15,10,0,5,1,5,null,null,2,10,2,5,null,null,4,10,5,10,2,1,null,null,null,null,2,10,null,null,null,null,null,null,null,null,null,null,null,null,null,null,null,null,null,null,"Continuous",0,8,5,11,20,10,100,1,1,818,"LC","Least Concern",1,0,0,"MuF_0818","Forest/Woodland","Woody vegetation"]
["Murray Fans","MuF_","Spike-sedge Wetland","Murray FansSpike-sedge Wetland","MuF_0819",0,0,0,null,null,null,null,null,null,null,null,null,null,null,null,null,1,5,6,15,4,5,null,null,null,null,2,10,2,50,null,null,null,null,null,null,null,null,null,null,null,null,null,null,null,null,"Episodic",5,5,null,11,null,20,50,1.36,1.36,819,"Vu","Vulnerable",6,0,0,"MuF_0819","wetlands","Non-woody wetland vegetation"]
["Murray Fans","MuF_","Tall Marsh","Murray FansTall Marsh","MuF_0821",0,0,0,null,null,null,null,null,null,null,null,null,null,null,null,null,null,null,6,20,3,10,1,10,3,40,null,null,2,10,null,null,null,null,null,null,null,null,null,null,null,null,null,null,null,null,"Episodic",1,5,null,9,null,10,50,1.36,1.36,821,"LC","Least Concern",6,0,0,"MuF_0821","wetlands","Non-woody wetland vegetation"]
["Murray Fans","MuF_","Treed Plains Savannah","Murray FansTreed Plains Savannah","MuF_0826_61",40,5,10,10,0,5,null,null,null,null,null,null,2,5,null,null,3,5,6,20,3,10,1,5,1,5,5,35,2,5,null,null,null,null,null,null,null,null,null,null,null,null,0,10,"0","25","Continuous",0,11,2,12,5,5,50,1,{"$error":"#N/A"},{"$error":"#N/A"},{"$error":"#N/A"},{"$error":"#N/A"},{"$error":"#N/A"},{"$error":"#N/A"},{"$error":"#N/A"},{"$error":"#N/A"},{"$error":"#N/A"},{"$error":"#N/A"}]
["Murray Fans","MuF_","Wetland Formation","Murray FansWetland Formation","MuF_0074",null,null,0,null,null,null,null,null,null,null,null,null,null,null,null,null,null,null,null,null,null,null,null,null,null,null,null,null,null,null,null,null,null,null,null,null,null,null,null,null,null,null,null,null,null,null,null,5,0,null,null,null,null,0,1.36,1.36,74,"En","Endangered",6,0,0,"MuF_0074","wetlands","Non-woody wetland vegetation"]
["Murray Fans","MuF_","Woorinen Mallee","Murray FansWoorinen Mallee","MuF_0824",15,30,12,25,null,null,null,null,null,null,6,10,6,20,null,null,null,null,6,10,7,10,null,null,null,null,1,1,null,null,null,null,null,null,null,null,null,null,null,null,null,null,0,10,"0","15","Continuous",0,7,12,13,30,20,200,1,1,824,"Vu","Vulnerable",1,0,"y","MuF_0824","Forest/Woodland","Woody vegetation"]
["Murray Fans","MuF_","Woorinen Sands Mallee","Murray FansWoorinen Sands Mallee","MuF_0086",15,30,7,25,null,null,null,null,null,null,4,5,2,10,1,5,null,null,6,5,6,5,null,null,null,null,3,5,1,1,null,null,"1","15",null,null,null,null,null,null,null,null,0,10,"0","10","Continuous",0,10,6,12,15,15,100,1,1,86,"D","Depleted",1,0,"y","MuF_0086","Forest/Woodland","Woody vegetation"]
["Murray Mallee","MuM_","Chenopod Grassland","Murray MalleeChenopod Grassland","MuM_0829",0,0,0,null,null,null,null,null,null,null,1,10,6,30,null,null,1,1,5,15,4,5,null,null,null,null,3,20,null,null,null,null,null,null,null,null,null,null,null,null,null,null,0,10,"0","20","Continuous",0,8,7,10,40,5,0,1.36,1.36,829,"En","Endangered",5,"y",0,"MuM_0829","grasslands","Other grassland vegetation"]
["Murray Mallee","MuM_","Chenopod Mallee","Murray MalleeChenopod Mallee","MuM_0158",20,20,12,20,null,null,null,null,null,null,1,5,9,45,null,null,null,null,3,5,2,10,null,null,null,null,null,null,null,null,null,null,null,null,null,null,null,null,null,null,null,null,0,10,"0","15","Continuous",0,6,10,5,50,10,200,1,1,158,"Vu","Vulnerable",1,0,"y","MuM_0158","Forest/Woodland","Woody vegetation"]
["Murray Mallee","MuM_","Dunefield Heathland","Murray MalleeDunefield Heathland","MuM_0089",0,0,0,null,null,null,null,null,null,null,6,50,6,20,null,null,null,null,4,5,null,null,1,1,null,null,3,5,2,5,null,null,"1","1",null,null,null,null,null,null,null,null,null,null,"0","10","Episodic",20,8,12,4,70,5,0,1.36,1.36,89,"LC","Least Concern",4,0,0,"MuM_0089","heathlands","Woody vegetation"]
["Murray Mallee","MuM_","Floodplain Grassy Wetland","Murray MalleeFloodplain Grassy Wetland","MuM_0809",0,0,0,null,null,null,null,null,null,null,null,null,null,null,null,null,null,null,5,10,3,5,1,5,null,null,3,5,4,60,null,null,null,null,null,null,null,null,null,null,null,null,null,null,null,null,"Episodic",5,5,null,8,null,10,50,1.36,1.36,809,"En","Endangered",6,0,0,"MuM_0809","wetlands","Non-woody wetland vegetation"]
["Murray Mallee","MuM_","Floodway Pond Herbland","Murray MalleeFloodway Pond Herbland","MuM_0810",0,0,0,null,null,null,null,null,null,null,null,null,null,null,null,null,1,1,5,20,4,15,null,null,null,null,2,10,3,20,null,null,null,null,null,null,null,null,null,null,null,null,null,null,"0","10","Episodic",5,6,null,10,null,5,50,1.36,1.36,810,"Vu","Vulnerable",6,0,0,"MuM_0810","wetlands","Non-woody wetland vegetation"]
["Murray Mallee","MuM_","Grassy Riverine Forest","Murray MalleeGrassy Riverine Forest","MuM_0106",90,20,25,30,0,5,1,10,null,null,null,null,null,null,null,null,2,10,3,10,null,null,null,null,null,null,3,25,3,10,null,null,null,null,null,null,null,null,null,null,null,null,0,10,null,null,"Continuous",0,7,1,5,10,40,300,1,1,106,"D","Depleted",1,0,0,"MuM_0106","Forest/Woodland","Woody vegetation"]
["Murray Mallee","MuM_","Heathy Mallee","Murray MalleeHeathy Mallee","MuM_0088",0,0,4,25,null,null,null,null,null,null,6,30,7,20,null,null,2,1,3,5,null,null,1,1,null,null,3,5,2,5,null,null,"1","5",null,null,null,null,null,null,null,null,null,null,"0","10","Episodic",20,9,13,5,50,10,50,1.1499999999999999,1.1499999999999999,88,"LC","Least Concern",2,0,0,"MuM_0088","scrubs/shrublands/mallee with logs","Woody vegetation"]
["Murray Mallee","MuM_","Intermittent Swampy Woodland","Murray MalleeIntermittent Swampy Woodland","MuM_0813",70,15,15,20,0,5,1,5,null,null,1,5,1,5,null,null,2,5,5,10,1,5,null,null,null,null,3,30,2,10,null,null,null,null,null,null,null,null,null,null,null,null,null,null,null,null,"Continuous",0,9,3,8,15,20,200,1,1,813,"Vu","Vulnerable",1,0,0,"MuM_0813","Forest/Woodland","Woody vegetation"]
["Murray Mallee","MuM_","Lake Bed Herbland","Murray MalleeLake Bed Herbland","MuM_0107",0,0,0,null,null,null,null,null,null,null,2,5,2,5,null,null,null,null,3,25,3,20,null,null,null,null,null,null,null,null,null,null,null,null,null,null,null,null,null,null,null,null,null,null,null,null,"Episodic",10,4,4,6,10,5,0,1.36,1.36,107,"D","Depleted",6,0,0,"MuM_0107","wetlands","Non-woody wetland vegetation"]
["Murray Mallee","MuM_","Lignum Shrubland","Murray MalleeLignum Shrubland","MuM_0808",0,0,0,null,null,null,null,null,null,null,2,30,3,10,null,null,1,1,6,10,5,5,null,null,1,10,2,20,null,null,null,null,null,null,null,null,null,null,null,null,null,null,null,null,"0","10","Continuous",0,8,5,12,40,10,0,1.36,1.36,808,"LC","Least Concern",6,0,0,"MuM_0808","wetlands","Non-woody wetland vegetation"]
["Murray Mallee","MuM_","Lignum Swamp","Murray MalleeLignum Swamp","MuM_0104",0,0,0,null,null,null,null,null,null,null,1,20,null,null,null,null,4,5,8,25,2,10,null,null,1,5,2,5,2,5,null,null,null,null,null,null,null,null,null,null,1,1,null,null,"0","10","Continuous",0,9,1,14,20,5,0,1.36,1.36,104,"Vu","Vulnerable",6,0,0,"MuM_0104","wetlands","Non-woody wetland vegetation"]
["Murray Mallee","MuM_","Lignum Swampy Woodland","Murray MalleeLignum Swampy Woodland","MuM_0823",70,15,15,30,0,5,null,null,null,null,2,30,1,5,null,null,2,1,8,10,5,10,null,null,1,5,3,10,3,15,null,null,null,null,null,null,null,null,null,null,null,null,null,null,"0","10","Continuous",0,10,3,15,35,5,100,1,1,823,"Vu","Vulnerable",1,0,0,"MuM_0823","Forest/Woodland","Woody vegetation"]
["Murray Mallee","MuM_","Loamy Sands Mallee","Murray MalleeLoamy Sands Mallee","MuM_0091",0,0,5,25,null,null,null,null,null,null,5,20,5,10,null,null,2,1,6,10,2,1,1,1,null,null,3,5,null,null,null,null,"1","5",null,null,null,null,null,null,null,null,0,10,"0","10","Episodic",20,10,10,10,30,15,50,1.1499999999999999,1.1499999999999999,91,"LC","Least Concern",2,0,0,"MuM_0091","scrubs/shrublands/mallee with logs","Woody vegetation"]
["Murray Mallee","MuM_","Low Chenopod Shrubland","Murray MalleeLow Chenopod Shrubland","MuM_0102",0,0,0,null,null,null,null,null,null,null,1,5,4,25,2,5,2,1,6,25,4,20,null,null,null,null,3,5,2,1,null,null,null,null,null,null,null,null,null,null,null,null,0,10,"0","20","Continuous",0,10,5,12,30,5,0,1.36,1.36,102,"D","Depleted",5,0,0,"MuM_0102","grasslands","Other grassland vegetation"]
["Murray Mallee","MuM_","Low Rises Woodland","Murray MalleeLow Rises Woodland","MuM_0066",60,20,15,20,0,5,2,5,null,null,5,15,3,5,null,null,1,1,3,5,2,1,null,null,null,null,7,25,1,1,null,null,null,null,null,null,null,null,null,null,null,null,0,10,"0","10","Continuous",0,11,10,6,25,15,200,1,1,66,"En","Endangered",1,0,0,"MuM_0066","Forest/Woodland","Woody vegetation"]
["Murray Mallee","MuM_","Lowan Sands Mallee","Murray MalleeLowan Sands Mallee","MuM_0087",0,0,7,25,null,null,null,null,null,null,5,35,7,30,1,1,null,null,4,10,null,null,1,1,null,null,5,5,2,10,null,null,null,null,null,null,null,null,null,null,null,null,null,null,null,null,"Episodic",20,7,12,4,65,5,50,1.1499999999999999,1.1499999999999999,87,"LC","Least Concern",2,0,0,"MuM_0087","scrubs/shrublands/mallee with logs","Woody vegetation"]
["Murray Mallee","MuM_","Non-treed Semi-arid Chenopod Woodland","Murray MalleeNon-treed Semi-arid Chenopod Woodland","MuM_0098_61",0,0,0,null,null,null,null,null,null,null,2,40,4,15,1,1,2,5,6,15,8,15,null,null,1,5,2,5,1,1,null,null,null,null,null,null,null,null,null,null,null,null,0,10,"0","30","Continuous",0,11,6,16,55,5,0,1.36,{"$error":"#N/A"},{"$error":"#N/A"},{"$error":"#N/A"},{"$error":"#N/A"},{"$error":"#N/A"},{"$error":"#N/A"},{"$error":"#N/A"},{"$error":"#N/A"},{"$error":"#N/A"},{"$error":"#N/A"}]
["Murray Mallee","MuM_","Parilla Mallee","Murray MalleeParilla Mallee","MuM_0981",35,25,10,25,0,5,null,null,null,null,4,10,3,10,null,null,1,1,3,5,5,5,null,null,null,null,6,15,1,5,null,null,null,null,null,null,null,null,null,null,null,null,0,10,"0","10","Continuous",0,10,7,9,20,20,150,1,1,981,"En","Endangered",1,0,"y","MuM_0981","Forest/Woodland","Woody vegetation"]
["Murray Mallee","MuM_","Plains Grassland","Murray MalleePlains Grassland","MuM_0132",0,0,0,null,null,null,null,null,null,null,null,null,2,5,null,null,3,5,6,20,3,10,1,5,1,5,5,35,2,5,null,null,null,null,null,null,null,null,null,null,null,null,0,10,"0","25","Episodic",5,10,2,12,5,10,0,1.36,1.36,132,"En","Endangered",5,"y",0,"MuM_0132","grasslands","Other grassland vegetation"]
["Murray Mallee","MuM_","Plains Savannah","Murray MalleePlains Savannah","MuM_0826",0,0,0,null,null,null,null,null,null,null,null,null,2,5,null,null,3,5,6,20,3,10,1,5,1,5,5,35,2,5,null,null,null,null,null,null,null,null,null,null,null,null,0,10,"0","25","Continuous",0,10,2,12,5,5,0,1,1,826,"En","Endangered",1,0,0,"MuM_0826","Forest/Woodland","Woody vegetation"]
["Murray Mallee","MuM_","Plains Woodland","Murray MalleePlains Woodland","MuM_0803",60,15,15,15,null,null,null,null,null,null,3,10,1,5,2,10,3,1,9,10,5,10,1,1,null,null,4,20,2,1,null,null,null,null,null,null,null,null,null,null,1,1,0,10,"0","10","Continuous",0,12,4,17,15,10,100,1,1,803,"En","Endangered",1,0,0,"MuM_0803","Forest/Woodland","Woody vegetation"]
["Murray Mallee","MuM_","Red Swale Mallee","Murray MalleeRed Swale Mallee","MuM_0095",0,0,6,30,null,null,null,null,null,null,4,10,3,5,null,null,1,1,7,10,2,1,1,1,null,null,3,5,null,null,null,null,null,null,null,null,null,null,null,null,null,null,0,10,"0","20","Episodic",30,9,7,10,15,15,50,1.1499999999999999,1.1499999999999999,95,"LC","Least Concern",2,0,0,"MuM_0095","scrubs/shrublands/mallee with logs","Woody vegetation"]
["Murray Mallee","MuM_","Ridged Plains Mallee","Murray MalleeRidged Plains Mallee","MuM_0096",40,15,10,10,0,5,null,null,null,null,3,5,3,10,1,1,2,5,5,10,5,15,1,5,1,1,3,20,1,1,null,null,null,null,null,null,null,null,null,null,null,null,0,10,"0","20","Continuous",0,13,6,12,15,5,50,1,1,96,"En","Endangered",1,0,"y","MuM_0096","Forest/Woodland","Woody vegetation"]
["Murray Mallee","MuM_","Riparian Woodland","Murray MalleeRiparian Woodland","MuM_0641",80,15,15,10,0,5,null,null,null,null,2,10,1,1,null,null,4,10,5,10,1,5,3,10,null,null,4,30,2,5,null,null,null,null,null,null,null,null,null,null,1,5,0,10,null,null,"Continuous",0,11,3,10,11,30,200,1,1,641,"Vu","Vulnerable",1,0,0,"MuM_0641","Forest/Woodland","Woody vegetation"]
["Murray Mallee","MuM_","Riverine Chenopod Woodland","Murray MalleeRiverine Chenopod Woodland","MuM_0103",40,5,15,10,0,5,null,null,null,null,3,30,5,25,1,1,null,null,5,5,5,10,null,null,null,null,null,null,null,null,null,null,null,null,null,null,null,null,null,null,null,null,null,null,null,null,"Continuous",0,6,8,10,55,5,50,1,1,103,"D","Depleted",1,0,0,"MuM_0103","Forest/Woodland","Woody vegetation"]
["Murray Mallee","MuM_","Riverine Grassy Woodland","Murray MalleeRiverine Grassy Woodland","MuM_0295",80,15,20,20,0,5,null,null,null,null,null,null,4,10,null,null,4,10,2,10,5,10,1,1,null,null,5,20,2,5,null,null,null,null,null,null,null,null,null,null,null,null,0,10,null,null,"Continuous",0,9,4,11,10,10,200,1,1,295,"D","Depleted",1,0,0,"MuM_0295","Forest/Woodland","Woody vegetation"]
["Murray Mallee","MuM_","Rocky Outcrop Shrubland","Murray MalleeRocky Outcrop Shrubland","MuM_0028",null,null,0,null,null,null,null,null,null,null,null,null,null,null,null,null,null,null,null,null,null,null,null,null,null,null,null,null,null,null,null,null,null,null,null,null,null,null,null,null,null,null,null,null,null,null,null,0,0,null,null,null,null,0,0,{"$error":"#N/A"},{"$error":"#N/A"},{"$error":"#N/A"},{"$error":"#N/A"},{"$error":"#N/A"},{"$error":"#N/A"},{"$error":"#N/A"},{"$error":"#N/A"},{"$error":"#N/A"},{"$error":"#N/A"}]
["Murray Mallee","MuM_","Salt Paperbark Woodland","Murray MalleeSalt Paperbark Woodland","MuM_0676",0,0,8,20,null,null,null,null,null,null,null,null,null,null,1,10,null,null,3,15,3,10,null,null,null,null,1,1,null,null,null,null,null,null,null,null,null,null,null,null,null,null,null,null,"0","10","Continuous",0,5,null,6,null,0,0,1.1499999999999999,1.1499999999999999,676,"Vu","Vulnerable",2,0,0,"MuM_0676","scrubs/shrublands/mallee with logs","Woody vegetation"]
["Murray Mallee","MuM_","Samphire Shrubland","Murray MalleeSamphire Shrubland","MuM_0101",0,0,0,null,null,null,null,null,null,null,null,null,4,20,null,null,null,null,7,5,3,5,null,null,null,null,2,1,2,1,null,null,null,null,null,null,null,null,null,null,null,null,null,null,"0","10","Continuous",0,6,4,10,20,0,0,1.36,1.36,101,"LC","Least Concern",5,0,0,"MuM_0101","grasslands","Other grassland vegetation"]
["Murray Mallee","MuM_","Sandstone Ridge Shrubland","Murray MalleeSandstone Ridge Shrubland","MuM_0093",0,0,0,null,null,null,null,null,null,null,4,40,4,5,null,null,null,null,2,5,null,null,1,1,null,null,3,5,null,null,"1","1",null,null,null,null,null,null,null,null,null,null,0,10,"0","15","Episodic",20,8,8,2,45,10,0,1.1499999999999999,1.1499999999999999,93,"LC","Least Concern",2,0,0,"MuM_0093","scrubs/shrublands/mallee with logs","Woody vegetation"]
["Murray Mallee","MuM_","Sedgy Riverine Forest","Murray MalleeSedgy Riverine Forest","MuM_0816",80,20,25,30,0,5,null,null,null,null,1,0,null,null,null,null,null,null,2,5,2,5,1,50,null,null,2,10,2,10,null,null,null,null,null,null,null,null,null,null,null,null,null,null,null,null,"Episodic",10,7,1,4,0,10,200,1,1,816,"Vu","Vulnerable",1,0,0,"MuM_0816","Forest/Woodland","Woody vegetation"]
["Murray Mallee","MuM_","Semi-arid Chenopod Woodland","Murray MalleeSemi-arid Chenopod Woodland","MuM_0098",40,15,12,15,0,5,3,10,null,null,2,40,4,15,1,1,2,5,6,15,8,15,null,null,1,5,2,5,1,1,null,null,null,null,null,null,null,null,null,null,null,null,0,10,"0","30","Continuous",0,13,9,16,65,15,50,1,1,98,"Vu","Vulnerable",1,0,"y","MuM_0098","Forest/Woodland","Woody vegetation"]
["Murray Mallee","MuM_","Semi-arid Parilla Woodland","Murray MalleeSemi-arid Parilla Woodland","MuM_0828",40,20,15,20,0,5,null,null,null,null,4,10,4,10,null,null,2,5,10,10,null,null,null,null,1,1,2,15,1,5,null,null,null,null,null,null,null,null,"1","1",null,null,0,5,"0","30","Continuous",0,11,8,12,20,10,120,1,1,828,"Vu","Vulnerable",1,0,0,"MuM_0828","Forest/Woodland","Woody vegetation"]
["Murray Mallee","MuM_","Semi-arid Woodland","Murray MalleeSemi-arid Woodland","MuM_0097",40,20,12,20,0,5,null,null,null,null,5,15,5,20,null,null,2,5,7,5,2,5,null,null,null,null,2,10,1,1,null,null,null,null,null,null,null,null,null,null,null,null,0,10,"0","20","Continuous",0,10,10,11,35,20,200,1,1,97,"Vu","Vulnerable",1,0,"y","MuM_0097","Forest/Woodland","Woody vegetation"]
["Murray Mallee","MuM_","Shallow Freshwater Marsh","Murray MalleeShallow Freshwater Marsh","MuM_0200",null,null,0,null,null,null,null,null,null,null,null,null,null,null,null,null,null,null,null,null,null,null,null,null,null,null,null,null,null,null,null,null,null,null,null,null,null,null,null,null,null,null,null,null,null,null,null,5,0,null,null,null,null,0,1.36,1.36,200,"Vu","Vulnerable",6,0,0,"MuM_0200","wetlands","Non-woody wetland vegetation"]
["Murray Mallee","MuM_","Shallow Sands Woodland","Murray MalleeShallow Sands Woodland","MuM_0882",60,15,15,20,0,5,1,5,null,null,3,10,4,20,2,5,1,1,7,15,3,5,null,null,null,null,8,25,3,1,"2","1",null,null,null,null,null,null,null,null,null,null,0,10,"0","10","Continuous",0,13,8,11,35,20,200,1,1,882,"En","Endangered",1,0,0,"MuM_0882","Forest/Woodland","Woody vegetation"]
["Murray Mallee","MuM_","Shrubby Riverine Woodland","Murray MalleeShrubby Riverine Woodland","MuM_0818",80,5,15,10,0,5,1,5,null,null,2,10,2,5,null,null,4,10,5,10,2,1,null,null,null,null,2,10,null,null,null,null,null,null,null,null,null,null,null,null,null,null,null,null,null,null,"Continuous",0,8,5,11,20,10,100,1,1,818,"LC","Least Concern",1,0,0,"MuM_0818","Forest/Woodland","Woody vegetation"]
["Murray Mallee","MuM_","Tall Marsh","Murray MalleeTall Marsh","MuM_0821",0,0,0,null,null,null,null,null,null,null,null,null,null,null,null,null,null,null,6,20,3,10,1,10,3,40,null,null,2,10,null,null,null,null,null,null,null,null,null,null,null,null,null,null,null,null,"Episodic",1,5,null,9,null,10,50,1.36,1.36,821,"LC","Least Concern",6,0,0,"MuM_0821","wetlands","Non-woody wetland vegetation"]
["Murray Mallee","MuM_","Treed Plains Savannah","Murray MalleeTreed Plains Savannah","MuM_0826_61",40,5,10,10,0,5,1,5,null,null,null,null,2,5,null,null,3,5,6,20,3,10,1,5,1,5,5,35,2,5,null,null,null,null,null,null,null,null,null,null,null,null,0,10,"0","25","Continuous",0,12,3,12,10,5,50,1,{"$error":"#N/A"},{"$error":"#N/A"},{"$error":"#N/A"},{"$error":"#N/A"},{"$error":"#N/A"},{"$error":"#N/A"},{"$error":"#N/A"},{"$error":"#N/A"},{"$error":"#N/A"},{"$error":"#N/A"}]
["Murray Mallee","MuM_","Treed Sandstone Ridge Shrubland","Murray MalleeTreed Sandstone Ridge Shrubland","MuM_0093_61",0,0,3,15,null,null,null,null,null,null,4,40,4,5,null,null,null,null,2,5,null,null,1,1,null,null,3,5,null,null,"1","1",null,null,null,null,null,null,null,null,null,null,0,10,"0","15","Episodic",20,8,8,2,45,10,50,1,{"$error":"#N/A"},{"$error":"#N/A"},{"$error":"#N/A"},{"$error":"#N/A"},{"$error":"#N/A"},{"$error":"#N/A"},{"$error":"#N/A"},{"$error":"#N/A"},{"$error":"#N/A"},{"$error":"#N/A"}]
["Murray Mallee","MuM_","Woorinen Mallee","Murray MalleeWoorinen Mallee","MuM_0824",15,30,12,25,null,null,null,null,null,null,6,10,6,20,null,null,null,null,6,10,7,10,null,null,null,null,1,1,null,null,null,null,null,null,null,null,null,null,null,null,null,null,0,10,"0","15","Continuous",0,7,12,13,30,20,200,1,1,824,"Vu","Vulnerable",1,0,"y","MuM_0824","Forest/Woodland","Woody vegetation"]
["Murray Mallee","MuM_","Woorinen Sands Mallee","Murray MalleeWoorinen Sands Mallee","MuM_0086",15,30,7,25,null,null,null,null,null,null,4,5,2,10,1,5,null,null,6,5,6,5,null,null,null,null,3,5,1,1,null,null,"1","15",null,null,null,null,null,null,null,null,0,10,"0","10","Continuous",0,10,6,12,15,15,100,1,1,86,"D","Depleted",1,0,"y","MuM_0086","Forest/Woodland","Woody vegetation"]
["Murray Scroll Belt","MSB_","Alluvial Plains Semi-arid Grassland","Murray Scroll BeltAlluvial Plains Semi-arid Grassland","MSB_0806",0,0,0,null,null,null,null,null,null,null,1,5,3,5,null,null,3,5,6,10,3,5,null,null,null,null,3,50,null,null,null,null,null,null,null,null,null,null,null,null,null,null,null,null,"0","10","Episodic",5,7,4,12,10,5,0,1.36,1.36,806,"Vu","Vulnerable",5,"y",0,"MSB_0806","grasslands","Other grassland vegetation"]
["Murray Scroll Belt","MSB_","Chenopod Mallee","Murray Scroll BeltChenopod Mallee","MSB_0158",20,20,12,20,null,null,null,null,null,null,1,5,9,45,null,null,null,null,3,5,2,10,null,null,null,null,null,null,null,null,null,null,null,null,null,null,null,null,null,null,null,null,0,10,"0","15","Continuous",0,6,10,5,50,10,100,1,1,158,"Vu","Vulnerable",1,0,"y","MSB_0158","Forest/Woodland","Woody vegetation"]
["Murray Scroll Belt","MSB_","Disused Floodway Shrubby Herbland","Murray Scroll BeltDisused Floodway Shrubby Herbland","MSB_0807",0,0,0,null,null,null,null,null,null,null,null,null,4,25,1,5,1,5,3,10,2,10,null,null,null,null,null,null,null,null,null,null,null,null,null,null,null,null,null,null,null,null,null,null,null,null,"Continuous",0,5,4,6,25,10,0,1.36,1.36,807,"En","Endangered",6,0,0,"MSB_0807","wetlands","Non-woody wetland vegetation"]
["Murray Scroll Belt","MSB_","Floodplain Grassy Wetland","Murray Scroll BeltFloodplain Grassy Wetland","MSB_0809",0,0,0,null,null,null,null,null,null,null,null,null,null,null,null,null,null,null,5,10,3,5,1,5,null,null,3,5,4,60,null,null,null,null,null,null,null,null,null,null,null,null,null,null,null,null,"Episodic",5,5,null,8,null,10,50,1.36,1.36,809,"En","Endangered",6,0,0,"MSB_0809","wetlands","Non-woody wetland vegetation"]
["Murray Scroll Belt","MSB_","Floodway Pond Herbland",{"$f":"CONCATENATE(A771,C771)","v":"Murray Scroll BeltFloodway Pond Herbland"},"MSB_0810",0,0,0,null,null,null,null,null,null,null,null,null,null,null,null,null,1,1,5,20,4,15,null,null,null,null,2,10,3,20,null,null,null,null,null,null,null,null,null,null,null,null,null,null,null,null,"Episodic",5,5,null,10,null,5,50,1.36,1.36,810,"D","Depleted",6,0,0,"MSB_0810","wetlands","Non-woody wetland vegetation"]
["Murray Scroll Belt","MSB_","Grassy Riverine Forest","Murray Scroll BeltGrassy Riverine Forest","MSB_0106",90,20,25,30,0,5,null,null,null,null,null,null,2,1,null,null,7,10,10,15,2,1,1,0,null,null,3,20,1,1,null,null,null,null,null,null,null,null,null,null,null,null,0,10,null,null,"Continuous",0,9,2,19,1,40,300,1,1,106,"D","Depleted",1,0,0,"MSB_0106","Forest/Woodland","Woody vegetation"]
["Murray Scroll Belt","MSB_","Intermittent Swampy Woodland","Murray Scroll BeltIntermittent Swampy Woodland","MSB_0813",70,15,15,20,0,5,1,5,null,null,1,5,1,5,null,null,2,5,5,10,1,5,null,null,null,null,3,30,2,10,null,null,null,null,null,null,null,null,null,null,null,null,null,null,null,null,"Continuous",0,9,3,8,15,20,200,1,1,813,"D","Depleted",1,0,0,"MSB_0813","Forest/Woodland","Woody vegetation"]
["Murray Scroll Belt","MSB_","Lake Bed Herbland","Murray Scroll BeltLake Bed Herbland","MSB_0107",0,0,0,null,null,null,null,null,null,null,2,5,2,5,null,null,null,null,3,25,3,20,null,null,null,null,null,null,null,null,null,null,null,null,null,null,null,null,null,null,null,null,null,null,null,null,"Episodic",10,4,4,6,10,5,0,1.36,1.36,107,"Vu","Vulnerable",6,0,0,"MSB_0107","wetlands","Non-woody wetland vegetation"]
["Murray Scroll Belt","MSB_","Lignum Shrubland","Murray Scroll BeltLignum Shrubland","MSB_0808",0,0,0,null,null,null,null,null,null,null,2,30,3,10,null,null,1,1,6,10,5,5,null,null,1,10,2,20,null,null,null,null,null,null,null,null,null,null,null,null,null,null,null,null,"0","10","Continuous",0,8,5,12,40,10,0,1.36,1.36,808,"LC","Least Concern",6,0,0,"MSB_0808","wetlands","Non-woody wetland vegetation"]
["Murray Scroll Belt","MSB_","Lignum Swamp","Murray Scroll BeltLignum Swamp","MSB_0104",0,0,0,null,null,null,null,null,null,null,1,20,null,null,null,null,4,5,8,25,2,10,null,null,1,5,2,5,2,5,null,null,null,null,null,null,null,null,null,null,1,1,null,null,"0","10","Continuous",0,9,1,14,20,5,0,1.36,1.36,104,"Vu","Vulnerable",6,0,0,"MSB_0104","wetlands","Non-woody wetland vegetation"]
["Murray Scroll Belt","MSB_","Lignum Swampy Woodland","Murray Scroll BeltLignum Swampy Woodland","MSB_0823",70,15,15,20,0,5,null,null,null,null,2,30,1,5,null,null,2,1,8,10,5,10,null,null,1,5,2,5,3,15,null,null,null,null,null,null,null,null,null,null,null,null,null,null,"0","10","Continuous",0,10,3,15,35,5,100,1,1,823,"D","Depleted",1,0,0,"MSB_0823","Forest/Woodland","Woody vegetation"]
["Murray Scroll Belt","MSB_","Low Chenopod Shrubland","Murray Scroll BeltLow Chenopod Shrubland","MSB_0102",0,0,0,null,null,null,null,null,null,null,1,5,4,25,2,5,2,1,6,25,4,20,null,null,null,null,3,5,2,1,null,null,null,null,null,null,null,null,null,null,null,null,0,10,"0","20","Continuous",0,10,5,12,30,5,0,1.36,1.36,102,"D","Depleted",5,0,0,"MSB_0102","grasslands","Other grassland vegetation"]
["Murray Scroll Belt","MSB_","Non-treed Semi-arid Chenopod Woodland","Murray Scroll BeltNon-treed Semi-arid Chenopod Woodland","MSB_0098_61",0,0,0,null,null,null,null,null,null,null,2,40,4,15,1,1,2,5,6,15,8,15,null,null,1,5,2,5,1,1,null,null,null,null,null,null,null,null,null,null,null,null,0,10,"0","30","Continuous",0,11,6,16,55,5,0,1.36,{"$error":"#N/A"},{"$error":"#N/A"},{"$error":"#N/A"},{"$error":"#N/A"},{"$error":"#N/A"},{"$error":"#N/A"},{"$error":"#N/A"},{"$error":"#N/A"},{"$error":"#N/A"},{"$error":"#N/A"}]
["Murray Scroll Belt","MSB_","Riverine Chenopod Woodland","Murray Scroll BeltRiverine Chenopod Woodland","MSB_0103",40,5,15,10,0,5,null,null,null,null,3,30,5,25,1,1,null,null,5,5,5,10,null,null,null,null,2,5,null,null,null,null,null,null,null,null,null,null,null,null,null,null,null,null,"0","10","Continuous",0,8,8,10,55,10,50,1,1,103,"D","Depleted",1,0,0,"MSB_0103","Forest/Woodland","Woody vegetation"]
["Murray Scroll Belt","MSB_","Riverine Grassy Woodland","Murray Scroll BeltRiverine Grassy Woodland","MSB_0295",null,0,0,null,null,null,null,null,null,null,null,null,null,null,null,null,null,null,null,null,null,null,null,null,null,null,null,null,null,null,null,null,null,null,null,null,null,null,null,null,null,null,null,null,null,null,null,0,0,null,null,null,0,0,0,{"$error":"#N/A"},{"$error":"#N/A"},{"$error":"#N/A"},{"$error":"#N/A"},{"$error":"#N/A"},{"$error":"#N/A"},{"$error":"#N/A"},{"$error":"#N/A"},{"$error":"#N/A"},{"$error":"#N/A"}]
["Murray Scroll Belt","MSB_","Riverine Swampy Woodland","Murray Scroll BeltRiverine Swampy Woodland","MSB_0815",null,0,0,null,null,null,null,null,null,null,null,null,null,null,null,null,null,null,null,null,null,null,null,null,null,null,null,null,null,null,null,null,null,null,null,null,null,null,null,null,null,null,null,null,null,null,null,0,0,null,null,null,0,0,0,{"$error":"#N/A"},{"$error":"#N/A"},{"$error":"#N/A"},{"$error":"#N/A"},{"$error":"#N/A"},{"$error":"#N/A"},{"$error":"#N/A"},{"$error":"#N/A"},{"$error":"#N/A"},{"$error":"#N/A"}]
["Murray Scroll Belt","MSB_","Semi-arid Chenopod Woodland","Murray Scroll BeltSemi-arid Chenopod Woodland","MSB_0098",40,15,3,15,0,5,3,10,null,null,2,40,4,15,1,1,2,5,6,15,8,15,null,null,1,5,2,5,1,1,null,null,null,null,null,null,null,null,null,null,null,null,0,10,"0","30","Continuous",0,13,9,16,65,15,50,1,1,98,"D","Depleted",1,0,"y","MSB_0098","Forest/Woodland","Woody vegetation"]
["Murray Scroll Belt","MSB_","Semi-arid Woodland","Murray Scroll BeltSemi-arid Woodland","MSB_0097",40,20,12,20,0,5,null,null,null,null,5,15,5,20,null,null,2,5,7,5,2,5,null,null,null,null,2,10,1,1,null,null,null,null,null,null,null,null,null,null,null,null,0,10,"0","20","Continuous",0,10,10,11,35,20,100,1,1,97,"Vu","Vulnerable",1,0,"y","MSB_0097","Forest/Woodland","Woody vegetation"]
["Murray Scroll Belt","MSB_","Shallow Freshwater Marsh","Murray Scroll BeltShallow Freshwater Marsh","MSB_0200",null,null,0,null,null,null,null,null,null,null,null,null,null,null,null,null,null,null,null,null,null,null,null,null,null,null,null,null,null,null,null,null,null,null,null,null,null,null,null,null,null,null,null,null,null,null,null,5,0,null,null,null,null,0,1.36,1.36,200,"Vu","Vulnerable",6,0,0,"MSB_0200","wetlands","Non-woody wetland vegetation"]
["Murray Scroll Belt","MSB_","Shrubby Riverine Woodland","Murray Scroll BeltShrubby Riverine Woodland","MSB_0818",80,5,15,10,0,5,1,5,null,null,2,10,2,5,null,null,4,10,5,10,2,1,null,null,null,null,2,10,null,null,null,null,null,null,null,null,null,null,null,null,null,null,null,null,null,null,"Continuous",0,8,5,11,20,10,100,1,1,818,"LC","Least Concern",1,0,0,"MSB_0818","Forest/Woodland","Woody vegetation"]
["Murray Scroll Belt","MSB_","Spike-sedge Wetland","Murray Scroll BeltSpike-sedge Wetland","MSB_0819",0,0,0,null,null,null,null,null,null,null,null,null,null,null,null,null,1,5,6,15,4,5,null,null,null,null,2,10,2,50,null,null,null,null,null,null,null,null,null,null,null,null,null,null,null,null,"Episodic",5,5,null,11,null,20,50,1.36,1.36,819,"Vu","Vulnerable",6,0,0,"MSB_0819","wetlands","Non-woody wetland vegetation"]
["Murray Scroll Belt","MSB_","Sub-saline Depression Shrubland","Murray Scroll BeltSub-saline Depression Shrubland","MSB_0820",0,0,0,null,null,null,null,null,null,null,null,null,4,25,2,5,null,null,6,25,4,20,null,null,null,null,null,null,null,null,null,null,null,null,null,null,null,null,null,null,null,null,0,10,"0","20","Continuous",0,6,4,10,25,5,0,1.36,1.36,820,"Vu","Vulnerable",6,0,0,"MSB_0820","wetlands","Non-woody wetland vegetation"]
["Murray Scroll Belt","MSB_","Woorinen Mallee","Murray Scroll BeltWoorinen Mallee","MSB_0824",15,30,12,25,null,null,null,null,null,null,6,10,6,20,null,null,null,null,6,10,7,10,null,null,null,null,1,1,null,null,null,null,null,null,null,null,null,null,null,null,null,null,0,10,"0","15","Continuous",0,7,12,13,30,20,200,1,{"$error":"#N/A"},{"$error":"#N/A"},{"$error":"#N/A"},{"$error":"#N/A"},{"$error":"#N/A"},{"$error":"#N/A"},{"$error":"#N/A"},{"$error":"#N/A"},{"$error":"#N/A"},{"$error":"#N/A"}]
["Murray Scroll Belt","MSB_","Woorinen Sands Mallee","Murray Scroll BeltWoorinen Sands Mallee","MSB_0086",15,30,7,25,null,null,null,null,null,null,4,5,2,10,1,5,2,0,6,5,6,5,null,null,null,null,3,5,1,1,null,null,"1","15",null,null,null,null,null,null,null,null,0,10,"0","10","Continuous",0,11,6,14,15,15,100,1,1,86,"D","Depleted",1,0,"y","MSB_0086","Forest/Woodland","Woody vegetation"]
["Northern Inland Slopes","NIS_","Alluvial Terraces Herb-rich Woodland","Northern Inland SlopesAlluvial Terraces Herb-rich Woodland","NIS_0067",70,15,15,15,0,5,1,5,null,null,3,5,2,5,1,1,3,5,7,25,1,1,1,1,null,null,9,20,null,null,null,null,null,null,null,null,null,null,null,null,null,null,0,10,"0","10","Continuous",0,12,6,11,15,10,150,1,1,67,"En","Endangered",1,0,0,"NIS_0067","Forest/Woodland","Woody vegetation"]
["Northern Inland Slopes","NIS_","Box Ironbark Forest","Northern Inland SlopesBox Ironbark Forest","NIS_0061",70,15,20,30,0,5,null,null,null,null,5,10,5,15,1,1,2,5,6,15,1,1,1,5,null,null,8,20,null,null,null,null,null,null,null,null,null,null,null,null,1,1,0,10,"0","10","Continuous",0,12,10,9,25,20,200,1,1,61,"Vu","Vulnerable",1,0,0,"NIS_0061","Forest/Woodland","Woody vegetation"]
["Northern Inland Slopes","NIS_","Cane Grass Wetland","Northern Inland SlopesCane Grass Wetland","NIS_0291",0,0,0,null,null,null,null,null,null,null,null,null,null,null,null,null,null,null,null,null,2,10,null,null,null,null,null,null,2,40,null,null,null,null,null,null,null,null,null,null,null,null,null,null,null,null,"Episodic",5,2,null,2,null,10,0,1.36,1.36,291,"Vu","Vulnerable",6,0,0,"NIS_0291","wetlands","Non-woody wetland vegetation"]
["Northern Inland Slopes","NIS_","Clay Heathland","Northern Inland SlopesClay Heathland","NIS_0007",0,0,0,null,null,null,null,null,null,null,9,30,6,10,3,5,null,null,8,10,null,null,4,10,1,5,7,10,2,5,null,null,null,null,null,null,null,null,null,null,null,null,0,10,"0","10","Episodic",30,10,15,8,40,20,0,1.36,1.36,7,"Vu","Vulnerable",4,0,0,"NIS_0007","heathlands","Woody vegetation"]
["Northern Inland Slopes","NIS_","Creekline Grassy Woodland","Northern Inland SlopesCreekline Grassy Woodland","NIS_0068",80,15,15,15,0,5,1,5,null,null,4,10,3,5,null,null,2,5,9,15,3,5,2,5,1,5,16,35,3,5,null,null,null,null,null,null,null,null,null,null,null,null,0,10,null,null,"Continuous",0,12,8,14,20,40,300,1,1,68,"En","Endangered",1,0,0,"NIS_0068","Forest/Woodland","Woody vegetation"]
["Northern Inland Slopes","NIS_","Damp Forest","Northern Inland SlopesDamp Forest","NIS_0029",90,20,30,25,0,5,4,10,null,null,3,5,1,1,null,null,2,5,8,15,2,5,3,1,null,null,2,1,1,1,null,null,null,null,7,20,"2","50",null,null,3,5,0,20,null,null,"Continuous",0,14,8,12,16,50,300,1,{"$error":"#N/A"},{"$error":"#N/A"},{"$error":"#N/A"},{"$error":"#N/A"},{"$error":"#N/A"},{"$error":"#N/A"},{"$error":"#N/A"},{"$error":"#N/A"},{"$error":"#N/A"},{"$error":"#N/A"}]
["Northern Inland Slopes","NIS_","Floodplain Riparian Woodland","Northern Inland SlopesFloodplain Riparian Woodland","NIS_0056",80,15,20,15,0,5,2,10,null,null,6,15,1,1,null,null,4,10,4,10,1,1,2,5,2,10,4,15,3,10,null,null,null,null,1,5,null,null,null,null,null,null,0,10,null,null,"Episodic",10,13,9,9,26,40,300,1,1,56,"En","Endangered",1,0,0,"NIS_0056","Forest/Woodland","Woody vegetation"]
["Northern Inland Slopes","NIS_","Granitic Hills Woodland","Northern Inland SlopesGranitic Hills Woodland","NIS_0072",50,15,10,15,0,5,1,5,null,null,7,20,3,5,null,null,4,5,11,15,2,1,null,null,null,null,6,5,2,1,null,null,null,null,2,1,null,null,null,null,null,null,0,10,"0","10","Continuous",0,12,11,17,30,20,150,1,1,72,"LC","Least Concern",1,0,"y","NIS_0072","Forest/Woodland","Woody vegetation"]
["Northern Inland Slopes","NIS_","Grassy Dry Forest","Northern Inland SlopesGrassy Dry Forest","NIS_0022",60,20,20,30,0,5,2,5,null,null,5,10,4,5,1,1,3,1,5,15,2,1,1,1,null,null,8,25,1,1,null,null,null,null,2,1,null,null,null,null,1,1,0,10,"0","10","Continuous",0,15,11,10,20,20,200,1,1,22,"D","Depleted",1,0,0,"NIS_0022","Forest/Woodland","Woody vegetation"]
["Northern Inland Slopes","NIS_","Grassy Woodland","Northern Inland SlopesGrassy Woodland","NIS_0175",null,null,null,null,null,null,null,null,null,null,null,null,null,null,null,null,null,null,null,null,null,null,null,null,null,null,null,null,null,null,null,null,null,null,null,null,null,null,null,null,null,null,null,null,null,null,null,null,0,null,null,null,null,0,1,1,175,"En","Endangered",1,0,0,"NIS_0175","Forest/Woodland","Woody vegetation"]
["Northern Inland Slopes","NIS_","Heathy Dry Forest","Northern Inland SlopesHeathy Dry Forest","NIS_0020",60,20,20,30,0,5,1,5,null,null,6,20,6,20,1,1,3,5,7,15,2,1,1,1,null,null,7,25,1,1,null,null,null,null,null,null,null,null,null,null,null,null,0,10,"0","10","Episodic",20,13,13,12,45,20,200,1,1,20,"LC","Least Concern",1,0,0,"NIS_0020","Forest/Woodland","Woody vegetation"]
["Northern Inland Slopes","NIS_","Herb-rich Foothill Forest","Northern Inland SlopesHerb-rich Foothill Forest","NIS_0023",70,20,30,40,0,5,2,10,null,null,3,10,3,5,2,5,3,5,13,25,4,5,2,5,null,null,6,20,1,1,null,null,null,null,1,5,null,null,null,null,2,1,0,20,null,null,"Continuous",0,14,8,20,25,40,200,1,1,23,"LC","Least Concern",1,0,0,"NIS_0023","Forest/Woodland","Woody vegetation"]
["Northern Inland Slopes","NIS_","Lignum Swampy Woodland","Northern Inland SlopesLignum Swampy Woodland","NIS_0823",70,15,15,20,0,5,null,null,null,null,2,30,1,5,null,null,2,1,8,10,4,10,null,null,1,5,2,5,3,15,null,null,null,null,null,null,null,null,null,null,null,null,null,null,"0","10","Continuous",0,10,3,14,35,10,100,1,1,823,"Vu","Vulnerable",1,0,0,"NIS_0823","Forest/Woodland","Woody vegetation"]
["Northern Inland Slopes","NIS_","Low Rises Grassy Woodland","Northern Inland SlopesLow Rises Grassy Woodland","NIS_0175_61",70,15,15,15,0,5,1,5,null,null,3,10,4,5,1,1,3,5,12,20,null,null,1,5,1,5,19,40,4,5,null,null,null,null,1,1,null,null,null,null,null,null,0,10,"0","10","Continuous",0,14,8,15,20,20,150,1,{"$error":"#N/A"},{"$error":"#N/A"},{"$error":"#N/A"},{"$error":"#N/A"},{"$error":"#N/A"},{"$error":"#N/A"},{"$error":"#N/A"},{"$error":"#N/A"},{"$error":"#N/A"},{"$error":"#N/A"}]
["Northern Inland Slopes","NIS_","Montane Damp Forest","Northern Inland SlopesMontane Damp Forest","NIS_0038",90,20,30,40,0,5,3,15,null,null,7,20,2,1,1,5,4,5,12,20,2,5,1,1,null,null,6,20,1,5,null,null,null,null,2,15,null,null,null,null,2,5,0,20,null,null,"Continuous",0,14,12,18,36,50,300,1,1,38,"LC","Least Concern",1,0,0,"NIS_0038","Forest/Woodland","Woody vegetation"]
["Northern Inland Slopes","NIS_","Montane Dry Woodland","Northern Inland SlopesMontane Dry Woodland","NIS_0036",50,15,15,20,0,5,2,20,null,null,5,20,2,5,2,5,3,5,9,15,null,null,2,5,null,null,6,15,null,null,null,null,null,null,1,5,null,null,null,null,2,1,0,10,"0","10","Continuous",0,13,9,12,45,20,150,1,1,36,"LC","Least Concern",1,0,0,"NIS_0036","Forest/Woodland","Woody vegetation"]
["Northern Inland Slopes","NIS_","Mountain Valley Riparian Woodland","Northern Inland SlopesMountain Valley Riparian Woodland","NIS_1085",null,0,0,null,null,null,null,null,null,null,null,null,null,null,null,null,null,null,null,null,null,null,null,null,null,null,null,null,null,null,null,null,null,null,null,null,null,null,null,null,null,null,null,null,null,null,null,0,0,null,null,null,0,0,1,1,1085,"Vu","Vulnerable",1,0,0,"NIS_1085","Forest/Woodland","Woody vegetation"]
["Northern Inland Slopes","NIS_","Plains Grassland","Northern Inland SlopesPlains Grassland","NIS_0132",0,0,0,null,null,null,null,null,null,null,null,null,2,5,null,null,3,5,10,20,3,5,1,5,1,5,10,30,2,5,null,null,null,null,null,null,null,null,null,null,null,null,0,10,"0","20","Episodic",5,10,2,16,5,10,0,1.36,1.36,132,"En","Endangered",5,"y",0,"NIS_0132","grasslands","Other grassland vegetation"]
["Northern Inland Slopes","NIS_","Plains Grassy Wetland","Northern Inland SlopesPlains Grassy Wetland","NIS_0125",null,null,null,null,null,null,null,null,null,null,null,null,null,null,null,null,null,null,null,null,null,null,null,null,null,null,null,null,null,null,null,null,null,null,null,null,null,null,null,null,null,null,null,null,null,null,null,null,0,null,null,null,null,0,1.36,1.36,125,"En","Endangered",6,"y",0,"NIS_0125","wetlands","Non-woody wetland vegetation"]
["Northern Inland Slopes","NIS_","Plains Grassy Woodland","Northern Inland SlopesPlains Grassy Woodland","NIS_0055",80,15,15,15,0,5,1,5,null,null,2,10,1,1,null,null,2,5,15,40,5,10,null,null,null,null,8,30,2,5,null,null,null,null,1,1,null,null,null,null,null,null,0,10,"0","10","Continuous",0,12,4,22,16,10,150,1,1,55,"En","Endangered",1,0,0,"NIS_0055","Forest/Woodland","Woody vegetation"]
["Northern Inland Slopes","NIS_","Plains Savannah","Northern Inland SlopesPlains Savannah","NIS_0826",0,0,0,null,null,null,null,null,null,null,null,null,2,5,null,null,3,5,6,20,3,10,1,5,1,5,5,35,2,5,null,null,null,null,null,null,null,null,null,null,null,null,0,10,"0","25","Continuous",0,10,2,12,5,5,0,1,1,826,"En","Endangered",1,0,0,"NIS_0826","Forest/Woodland","Woody vegetation"]
["Northern Inland Slopes","NIS_","Plains Woodland","Northern Inland SlopesPlains Woodland","NIS_0803",70,15,15,15,0,5,null,null,null,null,2,1,1,1,null,null,1,5,11,25,2,5,1,5,null,null,15,45,2,5,null,null,null,null,null,null,null,null,null,null,null,null,0,10,null,null,"Continuous",0,10,3,14,2,10,100,1,1,803,"En","Endangered",1,0,0,"NIS_0803","Forest/Woodland","Woody vegetation"]
["Northern Inland Slopes","NIS_","Rainshadow Grassy Woodland","Northern Inland SlopesRainshadow Grassy Woodland","NIS_0175_62",70,15,15,15,0,5,2,10,null,null,1,5,1,1,2,5,2,5,13,20,3,5,1,1,null,null,15,40,3,5,null,null,null,null,null,null,null,null,null,null,null,null,0,10,null,null,"Continuous",0,12,4,18,16,20,100,1,{"$error":"#N/A"},{"$error":"#N/A"},{"$error":"#N/A"},{"$error":"#N/A"},{"$error":"#N/A"},{"$error":"#N/A"},{"$error":"#N/A"},{"$error":"#N/A"},{"$error":"#N/A"},{"$error":"#N/A"}]
["Northern Inland Slopes","NIS_","Red Gum Swamp","Northern Inland SlopesRed Gum Swamp","NIS_0292",80,10,15,10,0,5,null,null,null,null,null,null,null,null,null,null,2,30,1,1,null,null,2,10,null,null,3,15,2,5,null,null,null,null,null,null,null,null,null,null,null,null,0,10,"0","10","Episodic",5,8,null,3,null,10,150,1,1,292,"En","Endangered",1,0,0,"NIS_0292","Forest/Woodland","Woody vegetation"]
["Northern Inland Slopes","NIS_","Riparian Forest","Northern Inland SlopesRiparian Forest","NIS_0018",80,20,30,40,0,5,3,15,null,null,5,20,1,1,1,1,2,5,11,20,2,5,4,15,2,5,4,10,2,5,null,null,null,null,4,15,"1","5",null,null,2,5,0,20,null,null,"Continuous",0,16,9,15,36,50,300,1,1,18,"D","Depleted",1,0,0,"NIS_0018","Forest/Woodland","Woody vegetation"]
["Northern Inland Slopes","NIS_","Riparian Shrubland","Northern Inland SlopesRiparian Shrubland","NIS_0019",0,0,0,null,null,null,null,null,null,null,4,5,1,1,null,null,5,5,8,10,3,5,3,5,2,1,8,10,4,5,null,null,null,null,1,1,null,null,null,null,null,null,0,20,null,null,"Continuous",0,11,5,16,6,10,100,1.25,1.25,19,"D","Depleted",3,0,0,"NIS_0019","scrubs/shrublands/mallee without logs","Woody vegetation"]
["Northern Inland Slopes","NIS_","Riverine Chenopod Woodland","Northern Inland SlopesRiverine Chenopod Woodland","NIS_0103",null,0,0,null,null,null,null,null,null,null,null,null,null,null,null,null,null,null,null,null,null,null,null,null,null,null,null,null,null,null,null,null,null,null,null,null,null,null,null,null,null,null,null,null,null,null,null,0,0,null,null,null,0,0,1,1,103,"Vu","Vulnerable",1,0,0,"NIS_0103","Forest/Woodland","Woody vegetation"]
["Northern Inland Slopes","NIS_","Riverine Escarpment Scrub","Northern Inland SlopesRiverine Escarpment Scrub","NIS_0082",0,0,0,null,0,5,null,null,null,null,8,30,1,1,2,1,2,5,12,20,3,5,3,10,null,null,4,15,2,5,null,null,null,null,3,10,null,null,null,null,1,5,0,10,null,null,"Continuous",0,13,9,17,31,40,50,1.25,1.25,82,"En","Endangered",3,0,0,"NIS_0082","scrubs/shrublands/mallee without logs","Woody vegetation"]
["Northern Inland Slopes","NIS_","Riverine Grassy Woodland","Northern Inland SlopesRiverine Grassy Woodland","NIS_0295",null,0,0,null,null,null,null,null,null,null,null,null,null,null,null,null,null,null,null,null,null,null,null,null,null,null,null,null,null,null,null,null,null,null,null,null,null,null,null,null,null,null,null,null,null,null,null,0,0,null,null,null,0,0,1,1,295,"En","Endangered",1,0,0,"NIS_0295","Forest/Woodland","Woody vegetation"]
["Northern Inland Slopes","NIS_","Riverine Swampy Woodland","Northern Inland SlopesRiverine Swampy Woodland","NIS_0815",null,0,0,null,null,null,null,null,null,null,null,null,null,null,null,null,null,null,null,null,null,null,null,null,null,null,null,null,null,null,null,null,null,null,null,null,null,null,null,null,null,null,null,null,null,null,null,0,0,null,null,null,0,0,1,1,815,"En","Endangered",1,0,0,"NIS_0815","Forest/Woodland","Woody vegetation"]
["Northern Inland Slopes","NIS_","Rocky Outcrop Shrubland","Northern Inland SlopesRocky Outcrop Shrubland","NIS_0028",0,0,0,null,null,null,null,null,null,null,7,25,2,5,null,null,2,5,5,5,2,1,2,5,null,null,4,10,null,null,null,null,null,null,2,5,null,null,null,null,null,null,0,20,"0","10","Continuous",0,10,9,9,30,40,0,1.36,1.36,28,"Vu","Vulnerable",4,0,0,"NIS_0028","heathlands","Woody vegetation"]
["Northern Inland Slopes","NIS_","Samphire Shrubland","Northern Inland SlopesSamphire Shrubland","NIS_0101",0,0,0,null,null,null,null,null,null,null,null,null,4,20,null,null,null,null,7,5,3,5,null,null,null,null,2,1,2,1,null,null,null,null,null,null,null,null,null,null,null,null,null,null,null,null,"Continuous",0,5,4,10,20,0,0,1.36,1.36,101,"LC","Least Concern",5,0,0,"NIS_0101","grasslands","Other grassland vegetation"]
["Northern Inland Slopes","NIS_","Sandstone Ridge Shrubland","Northern Inland SlopesSandstone Ridge Shrubland","NIS_0093",0,0,0,null,null,null,null,null,null,null,9,30,5,10,1,1,1,1,6,15,null,null,null,null,null,null,3,5,null,null,null,null,null,null,null,null,null,null,null,null,null,null,0,20,"0","20","Episodic",30,8,14,7,40,20,0,1.1499999999999999,1.1499999999999999,93,"Vu","Vulnerable",2,0,0,"NIS_0093","scrubs/shrublands/mallee with logs","Woody vegetation"]
["Northern Inland Slopes","NIS_","Shallow Sands Woodland","Northern Inland SlopesShallow Sands Woodland","NIS_0882",null,null,0,null,null,null,null,null,null,null,null,null,null,null,null,null,null,null,null,null,null,null,null,null,null,null,null,null,null,null,null,null,null,null,null,null,null,null,null,null,null,null,null,null,null,null,null,0,0,null,null,null,null,0,1,1,882,"En","Endangered",1,0,0,"NIS_0882","Forest/Woodland","Woody vegetation"]
["Northern Inland Slopes","NIS_","Shrubby Dry Forest","Northern Inland SlopesShrubby Dry Forest","NIS_0021",70,20,25,30,0,5,2,10,null,null,8,15,3,5,2,5,2,1,7,5,2,1,1,1,1,1,6,10,null,null,null,null,null,null,2,5,null,null,null,null,2,1,0,10,"0","10","Episodic",20,15,13,11,30,20,200,1,1,21,"LC","Least Concern",1,0,0,"NIS_0021","Forest/Woodland","Woody vegetation"]
["Northern Inland Slopes","NIS_","Shrubby Granitic-outwash Grassy Woodland","Northern Inland SlopesShrubby Granitic-outwash Grassy Woodland","NIS_0175_63",70,15,15,15,0,5,2,10,null,null,2,5,7,15,1,1,null,null,8,10,null,null,1,5,null,null,10,20,5,10,null,null,null,null,1,1,null,null,null,null,1,1,0,10,"0","10","Continuous",0,13,11,8,30,20,150,1,{"$error":"#N/A"},{"$error":"#N/A"},{"$error":"#N/A"},{"$error":"#N/A"},{"$error":"#N/A"},{"$error":"#N/A"},{"$error":"#N/A"},{"$error":"#N/A"},{"$error":"#N/A"},{"$error":"#N/A"}]
["Northern Inland Slopes","NIS_","Spring Soak Woodland","Northern Inland SlopesSpring Soak Woodland","NIS_0080",50,5,10,10,0,5,2,1,null,null,2,5,null,null,null,null,2,1,6,10,3,10,2,10,3,5,9,35,1,5,null,null,null,null,null,null,null,null,null,null,null,null,0,20,null,null,"Continuous",0,11,4,11,6,20,50,1,1,80,"En","Endangered",1,0,0,"NIS_0080","Forest/Woodland","Woody vegetation"]
["Northern Inland Slopes","NIS_","Swampy Riparian Woodland","Northern Inland SlopesSwampy Riparian Woodland","NIS_0083",70,10,15,15,0,5,2,15,null,null,4,10,1,1,null,null,3,5,8,15,4,5,4,20,2,5,4,15,3,5,null,null,null,null,4,10,null,null,null,null,1,1,0,20,null,null,"Continuous",0,14,7,15,26,20,200,1,1,83,"En","Endangered",1,0,0,"NIS_0083","Forest/Woodland","Woody vegetation"]
["Northern Inland Slopes","NIS_","Swampy Woodland","Northern Inland SlopesSwampy Woodland","NIS_0937",null,null,0,null,null,null,null,null,null,null,null,null,null,null,null,null,null,null,null,null,null,null,null,null,null,null,null,null,null,null,null,null,null,null,null,null,null,null,null,null,null,null,null,null,null,null,null,0,0,null,null,null,null,0,1,1,937,"En","Endangered",1,0,0,"NIS_0937","Forest/Woodland","Woody vegetation"]
["Northern Inland Slopes","NIS_","Treed Clay Heathland","Northern Inland SlopesTreed Clay Heathland","NIS_0007_61",40,10,8,10,null,null,null,null,null,null,9,30,6,10,3,5,null,null,8,10,null,null,4,10,1,5,7,10,2,5,null,null,null,null,null,null,null,null,null,null,null,null,0,10,"0","10","Episodic",30,10,15,8,40,20,50,1,{"$error":"#N/A"},{"$error":"#N/A"},{"$error":"#N/A"},{"$error":"#N/A"},{"$error":"#N/A"},{"$error":"#N/A"},{"$error":"#N/A"},{"$error":"#N/A"},{"$error":"#N/A"},{"$error":"#N/A"}]
["Northern Inland Slopes","NIS_","Treed Plains Savannah","Northern Inland SlopesTreed Plains Savannah","NIS_0826_61",40,5,10,10,0,5,null,null,null,null,null,null,2,5,null,null,3,5,6,20,3,10,1,5,1,5,5,35,2,5,null,null,null,null,null,null,null,null,null,null,null,null,0,10,"0","25","Continuous",0,11,2,12,5,5,50,1,{"$error":"#N/A"},{"$error":"#N/A"},{"$error":"#N/A"},{"$error":"#N/A"},{"$error":"#N/A"},{"$error":"#N/A"},{"$error":"#N/A"},{"$error":"#N/A"},{"$error":"#N/A"},{"$error":"#N/A"}]
["Northern Inland Slopes","NIS_","Treed Sandstone Ridge Shrubland","Northern Inland SlopesTreed Sandstone Ridge Shrubland","NIS_0093_61",0,0,3,30,null,null,null,null,null,null,9,30,5,10,1,1,1,1,6,15,null,null,null,null,null,null,3,5,null,null,null,null,null,null,null,null,null,null,null,null,null,null,0,20,"0","20","Episodic",30,8,14,7,40,20,50,1,{"$error":"#N/A"},{"$error":"#N/A"},{"$error":"#N/A"},{"$error":"#N/A"},{"$error":"#N/A"},{"$error":"#N/A"},{"$error":"#N/A"},{"$error":"#N/A"},{"$error":"#N/A"},{"$error":"#N/A"}]
["Northern Inland Slopes","NIS_","Valley Grassy Forest","Northern Inland SlopesValley Grassy Forest","NIS_0047",70,20,20,20,0,5,3,10,null,null,3,10,3,5,null,null,1,1,8,20,3,1,1,1,null,null,12,25,1,5,null,null,null,null,null,null,null,null,null,null,null,null,0,20,null,null,"Continuous",0,11,9,12,25,20,200,1,1,47,"En","Endangered",1,0,0,"NIS_0047","Forest/Woodland","Woody vegetation"]
["Northern Inland Slopes","NIS_","Wet Forest","Northern Inland SlopesWet Forest","NIS_0030",90,20,30,40,0,5,4,30,null,null,6,20,1,1,null,null,2,1,5,10,2,1,1,1,1,10,1,5,null,null,null,null,null,null,4,20,"2","10",null,null,2,5,0,20,null,null,"Continuous",0,14,11,9,51,50,300,1,1,30,"LC","Least Concern",1,0,0,"NIS_0030","Forest/Woodland","Woody vegetation"]
["Northern Inland Slopes","NIS_","Wetland Formation",{"$f":"CONCATENATE(A835,C835)","v":"Northern Inland SlopesWetland Formation"},"NIS_0074",null,null,0,null,null,null,null,null,null,null,null,null,null,null,null,null,null,null,null,null,null,null,null,null,null,null,null,null,null,null,null,null,null,null,null,null,null,null,null,null,null,null,null,null,null,null,null,5,0,null,null,null,null,0,1.36,1.36,74,"En","Endangered",6,0,0,"NIS_0074","wetlands","Non-woody wetland vegetation"]
["Otway Plain","OtP_","Berm Grassy Shrubland","Otway PlainBerm Grassy Shrubland","OtP_0311",0,0,0,null,null,null,null,null,null,null,2,20,2,5,null,null,2,5,2,10,2,5,1,1,null,null,2,25,2,10,null,null,null,null,null,null,null,null,null,null,null,null,null,null,null,null,"Continuous",0,8,4,6,25,10,0,1.36,1.36,311,"En","Endangered",5,0,0,"OtP_0311","grasslands","Other grassland vegetation"]
["Otway Plain","OtP_","Bird Colony Shrubland","Otway PlainBird Colony Shrubland","OtP_0154",0,0,0,null,null,null,null,null,null,null,3,10,null,null,null,null,1,10,null,null,null,null,null,null,null,null,null,null,1,5,null,null,null,null,null,null,null,null,null,null,null,null,null,null,null,null,"Continuous",0,3,3,1,10,10,0,1.36,1.36,154,"Ra","Rare",5,0,0,"OtP_0154","grasslands","Other grassland vegetation"]
["Otway Plain","OtP_","Cane Grass-Lignum Halophytic Herbland","Otway PlainCane Grass-Lignum Halophytic Herbland","OtP_0898",0,0,0,null,null,null,null,null,null,null,1,10,null,null,null,null,null,null,4,5,5,20,null,null,1,10,null,null,3,20,null,null,null,null,null,null,null,null,null,null,null,null,null,null,"0","10","Continuous",0,6,1,9,10,10,0,1.36,1.36,898,"Vu","Vulnerable",6,0,0,"OtP_0898","wetlands","Non-woody wetland vegetation"]
["Otway Plain","OtP_","Clay Heathland","Otway PlainClay Heathland","OtP_0007",0,0,0,null,null,null,null,null,null,null,8,40,5,10,3,5,null,null,7,10,null,null,null,null,1,5,6,15,1,10,null,null,null,null,null,null,null,null,null,null,null,null,0,10,"0","10","Episodic",30,9,13,7,50,20,0,1.36,1.36,7,"Vu","Vulnerable",4,0,0,"OtP_0007","heathlands","Woody vegetation"]
["Otway Plain","OtP_","Coastal Alkaline Scrub","Otway PlainCoastal Alkaline Scrub","OtP_0858",0,0,8,30,null,null,null,null,null,null,3,20,1,1,1,5,2,1,5,10,2,5,1,5,null,null,4,10,1,5,null,null,null,null,null,null,null,null,null,null,2,1,0,20,null,null,"Continuous",0,11,4,9,21,40,50,1.1499999999999999,1.1499999999999999,858,"En","Endangered",2,0,0,"OtP_0858","scrubs/shrublands/mallee with logs","Woody vegetation"]
["Otway Plain","OtP_","Coastal Dune Grassland","Otway PlainCoastal Dune Grassland","OtP_0879",0,0,0,null,null,null,null,null,null,null,1,5,1,5,null,null,2,5,4,5,3,10,null,null,null,null,3,10,2,25,null,null,null,null,null,null,null,null,null,null,1,1,null,null,null,null,"Continuous",0,8,2,9,10,10,0,0,{"$error":"#N/A"},{"$error":"#N/A"},{"$error":"#N/A"},{"$error":"#N/A"},{"$error":"#N/A"},{"$error":"#N/A"},{"$error":"#N/A"},{"$error":"#N/A"},{"$error":"#N/A"},{"$error":"#N/A"}]
["Otway Plain","OtP_","Coastal Dune Scrub","Otway PlainCoastal Dune Scrub","OtP_0160",0,0,0,null,null,null,null,null,null,null,7,50,1,1,null,null,3,5,7,15,3,10,null,null,null,null,2,15,2,5,null,null,null,null,null,null,null,null,null,null,3,5,0,10,null,null,"Episodic",30,9,8,13,51,40,0,0,{"$error":"#N/A"},{"$error":"#N/A"},{"$error":"#N/A"},{"$error":"#N/A"},{"$error":"#N/A"},{"$error":"#N/A"},{"$error":"#N/A"},{"$error":"#N/A"},{"$error":"#N/A"},{"$error":"#N/A"}]
["Otway Plain","OtP_","Coastal Headland Scrub","Otway PlainCoastal Headland Scrub","OtP_0161",0,0,0,null,null,null,null,null,null,null,8,60,1,1,2,5,null,null,2,5,null,null,null,null,null,null,1,5,null,null,null,null,null,null,null,null,null,null,null,null,null,null,0,10,"0","10","Episodic",30,7,9,2,61,40,0,1.36,1.36,161,"Vu","Vulnerable",4,0,0,"OtP_0161","heathlands","Woody vegetation"]
["Otway Plain","OtP_","Coastal Saltmarsh","Otway PlainCoastal Saltmarsh","OtP_0009",0,0,0,null,null,null,null,null,null,null,1,10,1,5,1,5,null,null,3,15,1,5,1,5,1,5,1,1,2,5,null,null,null,null,null,null,null,null,null,null,null,null,null,null,"0","10","Continuous",0,10,2,4,15,10,0,1.36,1.36,9,"En","Endangered",5,"y",0,"OtP_0009","grasslands","Other grassland vegetation"]
["Otway Plain","OtP_","Coastal Tussock Grassland","Otway PlainCoastal Tussock Grassland","OtP_0163",0,0,0,null,null,null,null,null,null,null,3,10,1,5,null,null,1,10,3,10,2,5,3,10,1,5,4,20,2,10,null,null,null,null,null,null,null,null,null,null,null,null,0,10,null,null,"Continuous",0,10,4,6,15,20,0,1.36,1.36,163,"Vu","Vulnerable",5,0,0,"OtP_0163","grasslands","Other grassland vegetation"]
["Otway Plain","OtP_","Creekline Grassy Woodland","Otway PlainCreekline Grassy Woodland","OtP_0068",80,15,15,15,0,5,2,15,null,null,5,10,1,1,null,null,2,5,6,10,3,5,2,10,1,5,10,30,3,10,null,null,null,null,null,null,null,null,null,null,3,10,0,10,null,null,"Continuous",0,13,8,11,26,40,200,1,1,68,"En","Endangered",1,0,0,"OtP_0068","Forest/Woodland","Woody vegetation"]
["Otway Plain","OtP_","Damp Heath Scrub","Otway PlainDamp Heath Scrub","OtP_0165",0,0,0,null,null,null,null,null,null,null,7,50,2,5,2,5,1,1,2,5,1,1,1,5,null,null,2,10,2,10,null,null,null,null,1,1,null,null,null,null,null,null,0,20,"0","10","Episodic",20,12,9,4,55,40,0,1.36,1.36,165,"En","Endangered",4,0,0,"OtP_0165","heathlands","Woody vegetation"]
["Otway Plain","OtP_","Damp Sands Herb-rich Woodland","Otway PlainDamp Sands Herb-rich Woodland","OtP_0003",70,15,15,15,0,5,2,10,null,null,8,20,1,1,2,5,2,5,9,20,2,5,2,10,1,1,4,10,2,5,null,null,null,null,2,10,null,null,null,null,2,5,0,10,null,null,"Continuous",0,15,11,13,31,40,150,1,1,3,"Vu","Vulnerable",1,0,0,"OtP_0003","Forest/Woodland","Woody vegetation"]
["Otway Plain","OtP_","Estuarine Reedbed","Otway PlainEstuarine Reedbed","OtP_0952",0,0,0,null,null,null,null,null,null,null,null,null,null,null,null,null,null,null,2,5,1,5,null,null,1,50,null,null,null,null,null,null,null,null,null,null,null,null,null,null,null,null,null,null,null,null,"Continuous",0,3,null,3,null,0,0,0,{"$error":"#N/A"},{"$error":"#N/A"},{"$error":"#N/A"},{"$error":"#N/A"},{"$error":"#N/A"},{"$error":"#N/A"},{"$error":"#N/A"},{"$error":"#N/A"},{"$error":"#N/A"},{"$error":"#N/A"}]
["Otway Plain","OtP_","Estuarine Swamp Scrub","Otway PlainEstuarine Swamp Scrub","OtP_0053_62",0,0,0,null,null,null,null,null,null,null,2,10,null,null,null,null,null,null,3,20,2,5,null,null,null,null,2,10,2,15,null,null,null,null,null,null,null,null,null,null,null,null,null,null,null,null,"Continuous",0,5,2,5,10,20,0,1.25,{"$error":"#N/A"},{"$error":"#N/A"},{"$error":"#N/A"},{"$error":"#N/A"},{"$error":"#N/A"},{"$error":"#N/A"},{"$error":"#N/A"},{"$error":"#N/A"},{"$error":"#N/A"},{"$error":"#N/A"}]
["Otway Plain","OtP_","Estuarine Wetland","Otway PlainEstuarine Wetland","OtP_0010",0,0,0,null,null,null,null,null,null,null,1,10,null,null,null,null,3,10,4,10,4,15,1,10,1,25,2,10,1,1,null,null,null,null,null,null,null,null,null,null,1,5,null,null,null,null,"Episodic",5,9,1,11,10,10,0,1.36,1.36,10,"En","Endangered",6,0,0,"OtP_0010","wetlands","Non-woody wetland vegetation"]
["Otway Plain","OtP_","Floodplain Reedbed","Otway PlainFloodplain Reedbed","OtP_0863",null,null,0,null,null,null,null,null,null,null,null,null,null,null,null,null,null,null,null,null,null,null,null,null,null,null,null,null,null,null,null,null,null,null,null,null,null,null,null,null,null,null,null,null,null,null,null,0,0,null,null,null,null,0,1.36,1.36,863,"En","Endangered",6,0,0,"OtP_0863","wetlands","Non-woody wetland vegetation"]
["Otway Plain","OtP_","Floodplain Riparian Woodland","Otway PlainFloodplain Riparian Woodland","OtP_0056",80,15,15,20,0,5,1,5,null,null,3,10,null,null,null,null,3,5,4,10,3,10,2,15,1,5,5,15,3,10,null,null,null,null,null,null,null,null,null,null,1,5,0,10,null,null,"Episodic",10,12,4,10,15,40,300,1,1,56,"En","Endangered",1,0,0,"OtP_0056","Forest/Woodland","Woody vegetation"]
["Otway Plain","OtP_","Grassy Forest","Otway PlainGrassy Forest","OtP_0128",70,20,20,30,0,5,2,10,null,null,3,10,4,5,2,1,3,5,10,15,null,null,1,5,null,null,9,30,null,null,null,null,null,null,null,null,null,null,null,null,2,1,0,10,null,null,"Continuous",0,11,9,13,25,20,200,1,1,128,"En","Endangered",1,0,0,"OtP_0128","Forest/Woodland","Woody vegetation"]
["Otway Plain","OtP_","Grassy Woodland","Otway PlainGrassy Woodland","OtP_0175",70,15,15,15,0,5,2,10,null,null,6,20,2,5,2,1,3,5,8,15,3,5,3,10,1,5,10,20,2,10,null,null,null,null,1,5,null,null,null,null,2,5,0,10,null,null,"Continuous",0,15,10,14,35,20,150,1,1,175,"En","Endangered",1,0,0,"OtP_0175","Forest/Woodland","Woody vegetation"]
["Otway Plain","OtP_","Heathy Woodland","Otway PlainHeathy Woodland","OtP_0048",60,15,10,15,0,5,null,null,null,null,7,30,7,20,2,5,null,null,5,5,2,5,2,5,1,5,4,15,2,10,null,null,null,null,1,5,null,null,null,null,null,null,0,10,"0","10","Episodic",20,13,14,7,50,40,150,1,1,48,"LC","Least Concern",1,0,0,"OtP_0048","Forest/Woodland","Woody vegetation"]
["Otway Plain","OtP_","Herb-rich Foothill Forest","Otway PlainHerb-rich Foothill Forest","OtP_0023",70,20,25,40,0,5,2,10,null,null,4,20,null,null,null,null,3,5,12,20,4,10,2,20,1,5,3,10,2,5,null,null,null,null,1,5,null,null,null,null,1,1,0,20,null,null,"Continuous",0,13,6,19,30,40,200,1,1,23,"Vu","Vulnerable",1,0,0,"OtP_0023","Forest/Woodland","Woody vegetation"]
["Otway Plain","OtP_","Lignum Swamp","Otway PlainLignum Swamp","OtP_0104",80,0,0,10,null,null,null,null,null,null,1,20,null,null,null,null,2,5,4,20,3,10,1,5,null,null,5,20,3,10,null,null,null,null,null,null,null,null,null,null,null,null,0,10,"0","10","Episodic",10,9,1,9,20,10,50,1.36,1.36,104,"En","Endangered",6,0,0,"OtP_0104","wetlands","Non-woody wetland vegetation"]
["Otway Plain","OtP_","Lowland Forest","Otway PlainLowland Forest","OtP_0016",70,20,25,30,0,5,null,null,null,null,6,35,4,10,2,1,null,null,4,5,2,5,1,5,2,10,3,10,2,5,null,null,null,null,2,10,null,null,null,null,null,null,0,10,null,null,"Continuous",0,12,10,6,45,40,200,1,1,16,"D","Depleted",1,0,0,"OtP_0016","Forest/Woodland","Woody vegetation"]
["Otway Plain","OtP_","Mangrove Shrubland","Otway PlainMangrove Shrubland","OtP_0140",0,0,0,null,null,null,null,null,null,null,1,40,null,null,null,null,null,null,null,null,null,null,null,null,null,null,null,null,1,5,null,null,null,null,null,null,null,null,null,null,null,null,null,null,null,null,"Continuous",0,2,1,null,40,0,0,1.36,1.36,140,"Vu","Vulnerable",4,0,0,"OtP_0140","heathlands","Woody vegetation"]
["Otway Plain","OtP_","Plains Brackish Sedge Wetland","Otway PlainPlains Brackish Sedge Wetland","OtP_0891",0,0,0,null,null,null,null,null,null,null,null,null,null,null,null,null,1,5,3,15,3,10,1,10,2,10,2,5,3,15,null,null,null,null,null,null,null,null,null,null,1,1,null,null,"0","10","Episodic",5,9,null,7,null,10,0,1.36,1.36,891,"Vu","Vulnerable",6,0,0,"OtP_0891","wetlands","Non-woody wetland vegetation"]
["Otway Plain","OtP_","Plains Freshwater Sedge Wetland","Otway PlainPlains Freshwater Sedge Wetland","OtP_0899",0,0,0,null,null,null,null,null,null,null,null,null,null,null,null,null,2,5,5,40,5,10,2,5,1,5,4,25,2,5,null,null,null,null,null,null,null,null,null,null,null,null,null,null,null,null,"Episodic",5,7,null,12,null,10,50,1.36,1.36,899,"Vu","Vulnerable",6,0,0,"OtP_0899","wetlands","Non-woody wetland vegetation"]
["Otway Plain","OtP_","Plains Grassland","Otway PlainPlains Grassland","OtP_0132",0,0,0,null,null,null,null,null,null,null,null,null,null,null,null,null,3,10,10,20,3,5,1,1,null,null,13,40,4,10,null,null,null,null,null,null,null,null,null,null,null,null,0,10,"0","10","Episodic",5,8,null,16,null,10,0,1.36,1.36,132,"En","Endangered",5,"y",0,"OtP_0132","grasslands","Other grassland vegetation"]
["Otway Plain","OtP_","Plains Grassy Wetland","Otway PlainPlains Grassy Wetland","OtP_0125",null,null,null,null,null,null,null,null,null,null,null,null,null,null,null,null,null,null,null,null,null,null,null,null,null,null,null,null,null,null,null,null,null,null,null,null,null,null,null,null,null,null,null,null,null,null,null,null,0,null,null,null,null,0,1.36,1.36,125,"En","Endangered",6,"y",0,"OtP_0125","wetlands","Non-woody wetland vegetation"]
["Otway Plain","OtP_","Plains Grassy Woodland","Otway PlainPlains Grassy Woodland","OtP_0055",80,10,15,20,0,5,2,10,null,null,null,null,1,1,2,5,1,5,10,20,3,5,1,5,1,5,9,35,2,10,null,null,null,null,null,null,null,null,null,null,null,null,0,10,null,null,"Continuous",0,12,3,14,11,10,100,1,1,55,"En","Endangered",1,0,0,"OtP_0055","Forest/Woodland","Woody vegetation"]
["Otway Plain","OtP_","Plains Sedgy Wetland","Otway PlainPlains Sedgy Wetland","OtP_0647",0,0,0,null,null,null,null,null,null,null,null,null,null,null,null,null,2,5,5,40,5,10,2,5,1,5,4,25,2,5,null,null,null,null,null,null,null,null,null,null,null,null,null,null,null,null,"Episodic",5,7,null,12,null,10,50,1.36,1.36,647,"En","Endangered",6,0,0,"OtP_0647","wetlands","Non-woody wetland vegetation"]
["Otway Plain","OtP_","Riparian Forest","Otway PlainRiparian Forest","OtP_0018",80,20,30,40,0,5,4,20,null,null,6,20,null,null,null,null,2,5,7,15,2,1,2,5,1,5,2,1,1,5,null,null,null,null,5,20,"2","15",null,null,2,5,0,20,null,null,"Continuous",0,14,10,11,40,50,300,1,1,18,"Vu","Vulnerable",1,0,0,"OtP_0018","Forest/Woodland","Woody vegetation"]
["Otway Plain","OtP_","Saline Aquatic Meadow","Otway PlainSaline Aquatic Meadow","OtP_0842",null,0,0,null,null,null,null,null,null,null,null,null,null,null,null,null,null,null,null,null,null,null,null,null,null,null,null,null,null,null,null,null,null,null,null,null,null,null,null,null,null,null,null,null,null,null,null,0,0,null,null,null,0,0,0,{"$error":"#N/A"},{"$error":"#N/A"},{"$error":"#N/A"},{"$error":"#N/A"},{"$error":"#N/A"},{"$error":"#N/A"},{"$error":"#N/A"},{"$error":"#N/A"},{"$error":"#N/A"},{"$error":"#N/A"}]
["Otway Plain","OtP_","Sand Heathland","Otway PlainSand Heathland","OtP_0006",0,0,0,null,null,null,null,null,null,null,6,30,8,20,3,5,null,null,3,5,2,5,2,10,1,5,6,15,1,1,null,null,null,null,1,1,null,null,null,null,3,5,0,10,"0","10","Episodic",30,13,14,5,50,20,0,1.36,1.36,6,"Ra","Rare",4,0,0,"OtP_0006","heathlands","Woody vegetation"]
["Otway Plain","OtP_","Seasonally Inundated Sub-saline Herbland","Otway PlainSeasonally Inundated Sub-saline Herbland","OtP_0196",0,0,0,null,null,null,null,null,null,null,null,null,null,null,2,20,null,null,2,30,null,null,null,null,null,null,null,null,1,5,null,null,null,null,null,null,null,null,null,null,null,null,null,null,"0","10","Episodic",5,4,null,2,null,10,150,1.36,1.36,196,"Ra","Rare",6,0,0,"OtP_0196","wetlands","Non-woody wetland vegetation"]
["Otway Plain","OtP_","Sedgy Riparian Woodland","Otway PlainSedgy Riparian Woodland","OtP_0198",70,15,15,20,0,5,1,10,null,null,5,20,null,null,null,null,null,null,6,10,3,5,3,25,2,15,3,10,2,10,null,null,null,null,2,10,null,null,null,null,null,null,0,10,null,null,"Continuous",0,11,6,9,30,30,200,1,1,198,"D","Depleted",1,0,0,"OtP_0198","Forest/Woodland","Woody vegetation"]
["Otway Plain","OtP_","Shallow Freshwater Marsh","Otway PlainShallow Freshwater Marsh","OtP_0200",null,null,0,null,null,null,null,null,null,null,null,null,null,null,null,null,null,null,null,null,null,null,null,null,null,null,null,null,null,null,null,null,null,null,null,null,null,null,null,null,null,null,null,null,null,null,null,5,0,null,null,null,null,0,1.36,1.36,200,"En","Endangered",6,0,0,"OtP_0200","wetlands","Non-woody wetland vegetation"]
["Otway Plain","OtP_","Shrubby Dry Forest","Otway PlainShrubby Dry Forest","OtP_0021",60,20,20,30,0,5,1,5,null,null,5,25,2,1,1,1,null,null,3,5,2,1,2,10,null,null,4,10,null,null,null,null,null,null,1,1,null,null,null,null,3,5,0,10,"0","10","Episodic",20,13,8,5,31,20,200,1,1,21,"LC","Least Concern",1,0,0,"OtP_0021","Forest/Woodland","Woody vegetation"]
["Otway Plain","OtP_","Shrubby Foothill Forest","Otway PlainShrubby Foothill Forest","OtP_0045",70,20,25,40,0,5,1,10,null,null,8,40,1,1,null,null,1,1,5,10,1,1,2,10,1,15,2,5,null,null,null,null,null,null,3,15,"1","1",null,null,2,1,0,10,null,null,"Episodic",30,14,10,7,51,40,200,1,1,45,"LC","Least Concern",1,0,0,"OtP_0045","Forest/Woodland","Woody vegetation"]
["Otway Plain","OtP_","Shrubby Wet Forest","Otway PlainShrubby Wet Forest","OtP_0201",90,20,30,40,0,5,2,10,null,null,9,20,null,null,1,1,2,1,5,10,2,5,2,10,1,10,2,5,1,1,null,null,null,null,3,20,"1","15",null,null,1,1,0,20,null,null,"Continuous",0,15,11,9,30,50,300,1,1,201,"LC","Least Concern",1,0,0,"OtP_0201","Forest/Woodland","Woody vegetation"]
["Otway Plain","OtP_","Stony Rises Woodland","Otway PlainStony Rises Woodland","OtP_0203",70,15,15,15,0,5,1,10,null,null,1,5,1,5,null,null,3,5,8,15,4,10,1,5,null,null,4,20,1,5,null,null,null,null,2,20,null,null,null,null,1,1,0,10,null,null,"Continuous",0,13,3,15,20,20,150,1,1,203,"Vu","Vulnerable",1,0,0,"OtP_0203","Forest/Woodland","Woody vegetation"]
["Otway Plain","OtP_","Stream Bank Shrubland","Otway PlainStream Bank Shrubland","OtP_0851",70,10,15,10,0,5,2,10,null,null,4,20,null,null,null,null,3,5,12,25,4,10,3,10,3,10,12,20,5,10,null,null,null,null,null,null,null,null,null,null,2,5,0,10,null,null,"Continuous",0,12,6,19,30,40,100,1,1,851,"En","Endangered",1,0,0,"OtP_0851","Forest/Woodland","Woody vegetation"]
["Otway Plain","OtP_","Swamp Scrub","Otway PlainSwamp Scrub","OtP_0053",0,0,0,null,null,null,null,null,null,null,2,10,null,null,null,null,3,10,7,20,1,5,2,5,3,15,3,10,1,5,null,null,null,null,null,null,null,null,null,null,1,1,0,20,null,null,"Continuous",0,10,2,11,10,40,0,1.25,1.1499999999999999,53,"Vu","Vulnerable",3,0,0,"OtP_0053","scrubs/shrublands/mallee without logs","Woody vegetation"]
["Otway Plain","OtP_","Swamp Scrub","Otway PlainSwamp Scrub","OtP_0053_61",0,0,0,null,null,null,null,null,null,null,2,10,null,null,null,null,3,10,7,20,1,5,2,5,3,15,3,10,1,5,null,null,null,null,null,null,null,null,null,null,1,1,0,20,null,null,"Continuous",0,10,2,11,10,40,0,1.25,{"$error":"#N/A"},{"$error":"#N/A"},{"$error":"#N/A"},{"$error":"#N/A"},{"$error":"#N/A"},{"$error":"#N/A"},{"$error":"#N/A"},{"$error":"#N/A"},{"$error":"#N/A"},{"$error":"#N/A"}]
["Otway Plain","OtP_","Swampy Riparian Woodland","Otway PlainSwampy Riparian Woodland","OtP_0083",70,10,15,10,0,5,2,10,null,null,3,10,null,null,null,null,3,5,9,15,4,5,5,25,1,5,8,20,2,5,null,null,null,null,1,1,null,null,null,null,2,5,0,20,null,null,"Continuous",0,13,5,16,20,20,200,1,1,83,"En","Endangered",1,0,0,"OtP_0083","Forest/Woodland","Woody vegetation"]
["Otway Plain","OtP_","Tall Marsh","Otway PlainTall Marsh","OtP_0821",0,0,0,null,null,null,null,null,null,null,null,null,null,null,null,null,3,10,3,5,5,20,1,5,2,40,null,null,2,1,null,null,null,null,null,null,null,null,null,null,null,null,null,null,null,null,"Episodic",5,6,null,11,null,10,0,1.36,{"$error":"#N/A"},{"$error":"#N/A"},{"$error":"#N/A"},{"$error":"#N/A"},{"$error":"#N/A"},{"$error":"#N/A"},{"$error":"#N/A"},{"$error":"#N/A"},{"$error":"#N/A"},{"$error":"#N/A"}]
["Otway Plain","OtP_","Wet Forest","Otway PlainWet Forest","OtP_0030",90,20,30,40,0,5,4,30,null,null,5,20,null,null,null,null,null,null,2,5,null,null,2,5,1,5,2,1,2,5,null,null,null,null,3,35,"1","5",null,null,2,5,0,20,null,null,"Continuous",0,12,9,2,50,50,300,1,1,30,"LC","Least Concern",1,0,0,"OtP_0030","Forest/Woodland","Woody vegetation"]
["Otway Plain","OtP_","Wet Heathland","Otway PlainWet Heathland","OtP_0008",0,0,0,null,null,null,null,null,null,null,5,40,3,5,null,null,1,1,2,5,null,null,2,10,null,null,1,10,2,20,null,null,null,null,2,1,null,null,null,null,1,1,0,20,null,null,"Episodic",30,10,8,3,45,20,0,1.36,1.36,8,"LC","Least Concern",4,0,0,"OtP_0008","heathlands","Woody vegetation"]
["Otway Plain","OtP_","Wet Sands Thicket","Otway PlainWet Sands Thicket","OtP_0233",0,0,0,null,null,null,null,null,null,null,5,50,4,10,null,null,null,null,2,1,1,1,1,5,null,null,1,1,1,1,null,null,null,null,1,1,null,null,null,null,1,1,0,10,null,null,"Episodic",30,10,9,3,60,40,0,1.36,1.36,233,"Ra","Rare",4,0,0,"OtP_0233","heathlands","Woody vegetation"]
["Otway Plain","OtP_","Wetland Formation","Otway PlainWetland Formation","OtP_0074",0,0,0,null,null,null,null,null,null,null,null,null,null,null,null,null,2,10,3,20,2,15,1,5,null,null,2,10,2,10,null,null,null,null,null,null,null,null,null,null,null,null,null,null,null,null,"Episodic",5,6,null,7,null,20,0,1.36,1.36,74,"En","Endangered",6,0,0,"OtP_0074","wetlands","Non-woody wetland vegetation"]
["Otway Ranges","OtR_","Coastal Headland Scrub","Otway RangesCoastal Headland Scrub","OtR_0161",0,0,0,null,null,null,null,null,null,null,9,50,null,null,null,null,6,10,8,20,3,5,2,1,2,5,6,10,3,5,null,null,null,null,null,null,null,null,null,null,2,5,0,10,null,null,"Episodic",30,10,9,17,50,40,50,1.36,1.36,161,"D","Depleted",4,0,0,"OtR_0161","heathlands","Woody vegetation"]
["Otway Ranges","OtR_","Coastal Tussock Grassland","Otway RangesCoastal Tussock Grassland","OtR_0163",0,0,0,null,null,null,null,null,null,null,3,10,1,5,null,null,1,10,3,10,2,5,3,10,1,5,4,20,2,10,null,null,null,null,null,null,null,null,null,null,null,null,0,10,null,null,"Continuous",0,10,4,6,15,20,0,1.36,1.36,163,"Vu","Vulnerable",5,0,0,"OtR_0163","grasslands","Other grassland vegetation"]
["Otway Ranges","OtR_","Cool Temperate Rainforest","Otway RangesCool Temperate Rainforest","OtR_0031",70,20,25,50,0,5,2,20,null,null,3,10,null,null,null,null,null,null,2,1,null,null,null,null,null,null,null,null,null,null,null,null,null,null,7,40,"2","30","6","5",1,1,0,20,null,null,"Continuous",0,9,5,2,30,50,200,1,1,31,"En","Endangered",1,0,0,"OtR_0031","Forest/Woodland","Woody vegetation"]
["Otway Ranges","OtR_","Damp Heath Scrub","Otway RangesDamp Heath Scrub","OtR_0165",0,0,0,null,null,null,null,null,null,null,9,50,5,15,2,5,null,null,2,5,null,null,3,10,1,5,null,null,2,5,null,null,null,null,3,10,null,null,null,null,null,null,0,20,"0","10","Episodic",20,10,14,2,65,40,0,1.36,1.36,165,"En","Endangered",4,0,0,"OtR_0165","heathlands","Woody vegetation"]
["Otway Ranges","OtR_","Damp Sands Herb-rich Woodland","Otway RangesDamp Sands Herb-rich Woodland","OtR_0003",70,15,15,20,0,5,1,5,null,null,9,30,null,null,1,1,3,5,6,15,2,5,2,5,1,5,4,15,1,1,null,null,null,null,2,5,null,null,null,null,1,5,0,10,null,null,"Continuous",0,14,10,11,35,40,150,1,1,3,"Vu","Vulnerable",1,0,0,"OtR_0003","Forest/Woodland","Woody vegetation"]
["Otway Ranges","OtR_","Estuarine Wetland","Otway RangesEstuarine Wetland","OtR_0010",0,0,0,null,null,null,null,null,null,null,1,10,null,null,null,null,3,10,4,10,4,15,1,10,1,25,2,10,1,1,null,null,null,null,null,null,null,null,null,null,1,5,null,null,null,null,"Episodic",5,9,1,11,10,10,0,1.36,1.36,10,"En","Endangered",6,0,0,"OtR_0010","wetlands","Non-woody wetland vegetation"]
["Otway Ranges","OtR_","Floodplain Reedbed","Otway RangesFloodplain Reedbed","OtR_0863",0,0,0,null,null,null,null,null,null,null,1,5,null,null,null,null,2,10,2,5,2,5,null,null,2,30,1,5,null,null,null,null,null,null,null,null,null,null,null,null,1,1,null,null,null,null,null,0,7,1,6,5,10,0,1.36,1.36,863,"En","Endangered",6,0,0,"OtR_0863","wetlands","Non-woody wetland vegetation"]
["Otway Ranges","OtR_","Grassy Dry Forest","Otway RangesGrassy Dry Forest","OtR_0022",60,20,20,30,1,5,1,5,null,null,5,5,null,null,2,5,2,5,4,5,null,null,2,10,null,null,9,30,1,5,null,null,null,null,null,null,null,null,null,null,1,1,0,10,"0","10","Continuous",0,12,6,6,10,20,200,1,1,22,"D","Depleted",1,0,0,"OtR_0022","Forest/Woodland","Woody vegetation"]
["Otway Ranges","OtR_","Grassy Forest","Otway RangesGrassy Forest","OtR_0128",70,20,20,30,0,5,2,10,null,null,3,10,4,5,2,1,3,5,10,15,null,null,1,5,null,null,9,30,null,null,null,null,null,null,null,null,null,null,null,null,2,1,0,10,null,null,"Continuous",0,11,9,13,25,20,200,1,1,128,"En","Endangered",1,0,0,"OtR_0128","Forest/Woodland","Woody vegetation"]
["Otway Ranges","OtR_","Grassy Woodland","Otway RangesGrassy Woodland","OtR_0175",70,15,15,15,0,5,2,10,null,null,6,20,2,5,2,1,3,5,8,15,3,5,3,10,1,5,10,20,2,10,null,null,null,null,1,5,null,null,null,null,2,5,0,10,null,null,"Continuous",0,15,10,14,35,20,150,1,1,175,"En","Endangered",1,0,0,"OtR_0175","Forest/Woodland","Woody vegetation"]
["Otway Ranges","OtR_","Heathy Woodland","Otway RangesHeathy Woodland","OtR_0048",60,15,10,15,0,5,null,null,null,null,10,40,6,15,2,5,null,null,4,5,2,5,2,5,1,5,3,10,2,5,null,null,null,null,1,1,null,null,null,null,2,1,0,10,"0","10","Episodic",20,14,16,6,55,40,150,1,1,48,"LC","Least Concern",1,0,0,"OtR_0048","Forest/Woodland","Woody vegetation"]
["Otway Ranges","OtR_","Herb-rich Foothill Forest","Otway RangesHerb-rich Foothill Forest","OtR_0023",70,20,25,40,0,5,1,5,null,null,7,30,null,null,null,null,3,5,7,20,2,5,1,10,1,5,2,10,2,5,null,null,null,null,2,10,null,null,null,null,1,1,0,20,null,null,"Continuous",0,13,8,12,35,40,200,1,1,23,"D","Depleted",1,0,0,"OtR_0023","Forest/Woodland","Woody vegetation"]
["Otway Ranges","OtR_","Lowland Forest","Otway RangesLowland Forest","OtR_0016",70,20,25,20,0,5,1,10,null,null,8,45,3,5,1,1,null,null,3,5,null,null,2,5,1,15,1,1,1,5,null,null,null,null,2,10,null,null,null,null,1,1,0,10,null,null,"Continuous",0,13,12,3,60,40,200,1,1,16,"D","Depleted",1,0,0,"OtR_0016","Forest/Woodland","Woody vegetation"]
["Otway Ranges","OtR_","Riparian Forest",{"$f":"CONCATENATE(A899,C899)","v":"Otway RangesRiparian Forest"},"OtR_0018",80,20,30,40,0,5,4,30,null,null,4,20,null,null,null,null,2,5,3,5,null,null,2,5,1,5,null,null,null,null,null,null,null,null,4,25,"2","10","3","5",2,1,0,20,null,null,"Continuous",0,12,8,5,50,50,300,1,1,18,"LC","Least Concern",1,0,0,"OtR_0018","Forest/Woodland","Woody vegetation"]
["Otway Ranges","OtR_","Scoria Cone Woodland","Otway RangesScoria Cone Woodland","OtR_0894",70,15,15,15,0,5,1,5,null,null,2,10,null,null,null,null,3,5,6,10,3,5,1,15,null,null,4,15,1,5,null,null,null,null,2,20,null,null,null,null,null,null,0,10,"0","10","Continuous",0,12,3,12,15,20,100,1,1,894,"En","Endangered",1,0,0,"OtR_0894","Forest/Woodland","Woody vegetation"]
["Otway Ranges","OtR_","Sedgy Riparian Woodland","Otway RangesSedgy Riparian Woodland","OtR_0198",70,15,15,20,0,5,1,10,null,null,5,20,null,null,null,null,null,null,6,10,3,5,3,25,2,15,3,10,2,10,null,null,null,null,2,10,null,null,null,null,null,null,0,10,null,null,"Continuous",0,11,6,9,30,30,200,1,1,198,"Vu","Vulnerable",1,0,0,"OtR_0198","Forest/Woodland","Woody vegetation"]
["Otway Ranges","OtR_","Shrubby Dry Forest","Otway RangesShrubby Dry Forest","OtR_0021",60,20,25,30,0,5,null,null,null,null,7,40,2,5,null,null,null,null,5,10,2,5,1,5,2,10,5,15,1,1,null,null,null,null,null,null,null,null,null,null,null,null,0,10,null,null,"Episodic",20,10,9,7,45,20,200,1,1,21,"LC","Least Concern",1,0,0,"OtR_0021","Forest/Woodland","Woody vegetation"]
["Otway Ranges","OtR_","Shrubby Foothill Forest","Otway RangesShrubby Foothill Forest","OtR_0045",70,20,25,40,0,5,null,null,null,null,7,40,2,10,null,null,null,null,4,5,null,null,1,5,1,10,3,5,null,null,null,null,null,null,1,5,null,null,null,null,2,5,0,10,null,null,"Episodic",30,10,9,4,50,40,200,1,1,45,"LC","Least Concern",1,0,0,"OtR_0045","Forest/Woodland","Woody vegetation"]
["Otway Ranges","OtR_","Shrubby Wet Forest","Otway RangesShrubby Wet Forest","OtR_0201",90,20,30,40,0,5,4,30,null,null,6,20,null,null,null,null,2,1,4,5,1,1,1,5,1,10,1,1,null,null,null,null,null,null,3,15,"2","10",null,null,2,5,0,20,null,null,"Continuous",0,13,10,7,50,50,300,1,1,201,"LC","Least Concern",1,0,0,"OtR_0201","Forest/Woodland","Woody vegetation"]
["Otway Ranges","OtR_","Swamp Scrub","Otway RangesSwamp Scrub","OtR_0053",0,0,0,null,null,null,null,null,null,null,2,10,null,null,null,null,3,10,7,20,1,5,2,5,3,15,3,10,1,5,null,null,null,null,null,null,null,null,null,null,1,1,0,20,null,null,"Continuous",0,10,2,11,10,40,0,1.25,1.1499999999999999,53,"En","Endangered",3,0,0,"OtR_0053","scrubs/shrublands/mallee without logs","Woody vegetation"]
["Otway Ranges","OtR_","Swampy Riparian Woodland","Otway RangesSwampy Riparian Woodland","OtR_0083",70,10,15,10,0,5,2,10,null,null,3,10,null,null,null,null,3,5,9,15,4,5,5,25,1,5,8,20,2,5,null,null,null,null,1,1,null,null,null,null,2,5,0,20,null,null,"Continuous",0,13,5,16,20,20,200,1,1,83,"En","Endangered",1,0,0,"OtR_0083","Forest/Woodland","Woody vegetation"]
["Otway Ranges","OtR_","Wet Forest","Otway RangesWet Forest","OtR_0030",90,20,30,40,0,5,4,25,null,null,4,20,null,null,null,null,1,1,1,5,null,null,1,5,1,10,null,null,null,null,null,null,null,null,3,20,"2","20","2","1",1,1,0,20,null,null,"Continuous",0,12,8,2,45,50,300,1,1,30,"LC","Least Concern",1,0,0,"OtR_0030","Forest/Woodland","Woody vegetation"]
["Otway Ranges","OtR_","Wet Heathland","Otway RangesWet Heathland","OtR_0008",0,0,0,null,null,null,null,null,null,null,5,55,3,5,null,null,1,1,2,20,null,null,2,10,null,null,1,10,2,20,null,null,null,null,2,10,null,null,null,null,1,1,0,20,null,null,"Episodic",30,10,8,3,60,20,0,1.36,1.36,8,"LC","Least Concern",4,0,0,"OtR_0008","heathlands","Woody vegetation"]
["Otway Ranges","OtR_","Wet Sands Thicket","Otway RangesWet Sands Thicket","OtR_0233",0,0,0,null,null,null,null,null,null,null,5,50,2,5,1,5,null,null,null,null,null,null,2,5,1,25,null,null,null,null,null,null,null,null,2,5,"1","1",null,null,null,null,0,20,null,null,"Episodic",30,8,7,null,55,40,0,1.36,1.36,233,"Ra","Rare",4,0,0,"OtR_0233","heathlands","Woody vegetation"]
["Robinvale Plains","RobP","Alluvial Plains Semi-arid Grassland","Robinvale PlainsAlluvial Plains Semi-arid Grassland","RobP0806",0,0,0,null,null,null,null,null,null,null,1,5,3,5,null,null,3,5,6,10,3,5,null,null,null,null,3,50,null,null,null,null,null,null,null,null,null,null,null,null,null,null,null,null,"0","10","Episodic",5,7,4,12,10,5,0,1.36,1.36,806,"Vu","Vulnerable",5,"y",0,"RobP0806","grasslands","Other grassland vegetation"]
["Robinvale Plains","RobP","Chenopod Mallee","Robinvale PlainsChenopod Mallee","RobP0158",20,20,12,20,0,5,null,null,null,null,1,5,8,40,null,null,null,null,3,5,2,10,null,null,null,null,null,null,null,null,null,null,null,null,null,null,null,null,null,null,null,null,0,10,"0","15","Continuous",0,7,9,5,45,10,200,1,1,158,"Vu","Vulnerable",1,0,"y","RobP0158","Forest/Woodland","Woody vegetation"]
["Robinvale Plains","RobP","Dunefield Heathland","Robinvale PlainsDunefield Heathland","RobP0089",null,0,0,null,null,null,null,null,null,null,6,50,6,20,null,null,null,null,4,5,null,null,1,1,null,null,3,5,2,5,null,null,"1","1",null,null,null,null,null,null,null,null,null,null,"0","10",null,0,8,12,4,70,0,0,0,{"$error":"#N/A"},{"$error":"#N/A"},{"$error":"#N/A"},{"$error":"#N/A"},{"$error":"#N/A"},{"$error":"#N/A"},{"$error":"#N/A"},{"$error":"#N/A"},{"$error":"#N/A"},{"$error":"#N/A"}]
["Robinvale Plains","RobP","Floodplain Grassy Wetland","Robinvale PlainsFloodplain Grassy Wetland","RobP0809",0,0,0,null,null,null,null,null,null,null,null,null,null,null,null,null,null,null,5,10,3,5,1,5,null,null,3,5,4,60,null,null,null,null,null,null,null,null,null,null,null,null,null,null,null,null,"Episodic",5,5,null,8,null,10,50,1.36,1.36,809,"En","Endangered",6,0,0,"RobP0809","wetlands","Non-woody wetland vegetation"]
["Robinvale Plains","RobP","Floodway Pond Herbland","Robinvale PlainsFloodway Pond Herbland","RobP0810",0,0,0,null,null,null,null,null,null,null,null,null,null,null,null,null,1,1,5,20,4,15,null,null,null,null,2,10,3,20,null,null,null,null,null,null,null,null,null,null,null,null,null,null,null,null,"Episodic",5,5,null,10,null,5,50,1.36,1.36,810,"D","Depleted",6,0,0,"RobP0810","wetlands","Non-woody wetland vegetation"]
["Robinvale Plains","RobP","Grassy Riverine Forest","Robinvale PlainsGrassy Riverine Forest","RobP0106",90,20,25,30,0,5,2,10,null,null,null,null,null,null,null,null,3,5,7,10,1,5,null,null,null,null,2,15,1,1,null,null,null,null,null,null,null,null,null,null,null,null,0,10,null,null,"Continuous",0,8,2,11,10,40,300,1,1,106,"D","Depleted",1,0,0,"RobP0106","Forest/Woodland","Woody vegetation"]
["Robinvale Plains","RobP","Intermittent Swampy Woodland","Robinvale PlainsIntermittent Swampy Woodland","RobP0813",70,15,15,20,0,5,1,5,null,null,1,5,1,5,null,null,2,5,5,10,1,5,null,null,null,null,3,30,2,10,null,null,null,null,null,null,null,null,null,null,null,null,null,null,null,null,"Continuous",0,9,3,8,15,20,200,1,1,813,"D","Depleted",1,0,0,"RobP0813","Forest/Woodland","Woody vegetation"]
["Robinvale Plains","RobP","Lake Bed Herbland","Robinvale PlainsLake Bed Herbland","RobP0107",0,0,0,null,null,null,null,null,null,null,2,5,2,5,null,null,null,null,3,25,3,20,null,null,null,null,2,5,null,null,null,null,null,null,null,null,null,null,null,null,null,null,null,null,null,null,"Episodic",10,5,4,6,10,5,0,1.36,1.36,107,"D","Depleted",6,0,0,"RobP0107","wetlands","Non-woody wetland vegetation"]
["Robinvale Plains","RobP","Lignum Shrubland","Robinvale PlainsLignum Shrubland","RobP0808",0,0,0,null,null,null,null,null,null,null,2,30,3,10,null,null,1,1,6,10,5,5,null,null,1,10,2,20,null,null,null,null,null,null,null,null,null,null,null,null,null,null,null,null,"0","10","Continuous",0,8,5,12,40,10,0,1.36,1.36,808,"LC","Least Concern",6,0,0,"RobP0808","wetlands","Non-woody wetland vegetation"]
["Robinvale Plains","RobP","Lignum Swamp","Robinvale PlainsLignum Swamp","RobP0104",0,0,0,null,null,null,null,null,null,null,1,20,null,null,null,null,4,5,8,25,2,10,null,null,1,5,2,5,2,5,null,null,null,null,null,null,null,null,null,null,1,1,null,null,"0","10","Continuous",0,9,1,14,20,5,0,1.36,1.36,104,"Vu","Vulnerable",6,0,0,"RobP0104","wetlands","Non-woody wetland vegetation"]
["Robinvale Plains","RobP","Lignum Swampy Woodland","Robinvale PlainsLignum Swampy Woodland","RobP0823",70,15,15,20,0,5,null,null,null,null,2,30,1,5,null,null,2,1,8,10,4,10,null,null,1,5,2,5,3,15,null,null,null,null,null,null,null,null,null,null,null,null,null,null,"0","10","Continuous",0,10,3,14,35,10,100,1,1,823,"D","Depleted",1,0,0,"RobP0823","Forest/Woodland","Woody vegetation"]
["Robinvale Plains","RobP","Loamy Sands Mallee","Robinvale PlainsLoamy Sands Mallee","RobP0091",0,0,5,25,null,null,null,null,null,null,5,20,5,10,null,null,2,1,6,10,2,1,1,1,null,null,3,5,null,null,null,null,"1","5",null,null,null,null,null,null,null,null,0,10,"0","10","Episodic",20,10,10,10,30,15,50,1.1499999999999999,1.1499999999999999,91,"LC","Least Concern",2,0,0,"RobP0091","scrubs/shrublands/mallee with logs","Woody vegetation"]
["Robinvale Plains","RobP","Low Chenopod Shrubland","Robinvale PlainsLow Chenopod Shrubland","RobP0102",0,0,0,null,null,null,null,null,null,null,1,5,7,20,1,5,2,1,10,25,4,15,null,null,null,null,2,5,1,5,null,null,null,null,null,null,null,null,null,null,null,null,0,10,"0","10","Continuous",0,10,8,16,25,20,0,1.36,1.36,102,"D","Depleted",5,0,0,"RobP0102","grasslands","Other grassland vegetation"]
["Robinvale Plains","RobP","Non-treed Semi-arid Chenopod Woodland","Robinvale PlainsNon-treed Semi-arid Chenopod Woodland","RobP0098_61",0,0,0,null,null,null,null,null,null,null,2,40,4,15,1,1,2,5,6,15,8,15,null,null,1,5,2,5,1,1,null,null,null,null,null,null,null,null,null,null,null,null,0,10,"0","30","Continuous",0,11,6,16,55,5,0,1.36,{"$error":"#N/A"},{"$error":"#N/A"},{"$error":"#N/A"},{"$error":"#N/A"},{"$error":"#N/A"},{"$error":"#N/A"},{"$error":"#N/A"},{"$error":"#N/A"},{"$error":"#N/A"},{"$error":"#N/A"}]
["Robinvale Plains","RobP","Plains Grassland","Robinvale PlainsPlains Grassland","RobP0132",0,0,0,null,null,null,null,null,null,null,null,null,2,5,null,null,3,5,10,20,3,5,1,5,1,5,10,30,2,5,null,null,null,null,null,null,null,null,null,null,null,null,0,10,"0","20","Episodic",5,10,2,16,5,10,0,1.36,1.36,132,"En","Endangered",5,"y",0,"RobP0132","grasslands","Other grassland vegetation"]
["Robinvale Plains","RobP","Plains Woodland","Robinvale PlainsPlains Woodland","RobP0803",70,15,15,15,null,null,null,null,null,null,3,10,1,5,2,10,3,1,9,10,5,10,1,1,null,null,4,20,2,1,null,null,null,null,null,null,null,null,null,null,1,1,0,10,"0","10","Continuous",0,12,4,17,15,10,100,1,1,803,"En","Endangered",1,0,0,"RobP0803","Forest/Woodland","Woody vegetation"]
["Robinvale Plains","RobP","Ridged Plains Mallee","Robinvale PlainsRidged Plains Mallee","RobP0096",40,15,10,10,0,5,null,null,null,null,3,5,3,10,1,1,2,5,5,10,5,15,1,5,1,1,3,20,1,1,null,null,null,null,null,null,null,null,null,null,null,null,0,10,"0","20","Continuous",0,13,6,12,15,5,50,1,1,96,"En","Endangered",1,0,"y","RobP0096","Forest/Woodland","Woody vegetation"]
["Robinvale Plains","RobP","Riverine Chenopod Woodland","Robinvale PlainsRiverine Chenopod Woodland","RobP0103",40,5,15,10,0,5,null,null,null,null,3,30,5,25,1,1,null,null,5,5,5,10,null,null,null,null,2,5,null,null,null,null,null,null,null,null,null,null,null,null,null,null,null,null,null,null,"Continuous",0,7,8,10,55,10,50,1,1,103,"D","Depleted",1,0,0,"RobP0103","Forest/Woodland","Woody vegetation"]
["Robinvale Plains","RobP","Riverine Grassy Woodland","Robinvale PlainsRiverine Grassy Woodland","RobP0295",80,15,20,20,0,5,null,null,null,null,null,null,4,10,null,null,4,10,2,10,5,10,1,1,null,null,5,20,2,5,null,null,null,null,null,null,null,null,null,null,null,null,0,10,null,null,"Continuous",0,9,4,11,10,10,200,1,1,295,"D","Depleted",1,0,0,"RobP0295","Forest/Woodland","Woody vegetation"]
["Robinvale Plains","RobP","Sedgy Riverine Forest","Robinvale PlainsSedgy Riverine Forest","RobP0816",80,20,25,30,0,5,null,null,null,null,1,10,null,null,null,null,null,null,2,5,2,5,1,50,null,null,2,10,2,10,null,null,null,null,null,null,null,null,null,null,null,null,null,null,null,null,"Episodic",10,7,1,4,10,10,200,1,1,816,"D","Depleted",1,0,0,"RobP0816","Forest/Woodland","Woody vegetation"]
["Robinvale Plains","RobP","Semi-arid Chenopod Woodland","Robinvale PlainsSemi-arid Chenopod Woodland","RobP0098",40,15,12,15,0,5,3,10,null,null,2,40,4,15,1,1,2,5,6,15,8,15,null,null,1,5,2,5,1,1,null,null,null,null,null,null,null,null,null,null,null,null,0,10,"0","30","Continuous",0,13,9,16,65,15,50,1,1,98,"Vu","Vulnerable",1,0,"y","RobP0098","Forest/Woodland","Woody vegetation"]
["Robinvale Plains","RobP","Semi-arid Parilla Woodland","Robinvale PlainsSemi-arid Parilla Woodland","RobP0828",40,20,15,20,0,5,null,null,null,null,4,10,4,10,null,null,2,5,10,10,null,null,null,null,1,1,2,15,1,5,null,null,null,null,null,null,null,null,"1","1",null,null,0,5,"0","30","Continuous",0,11,8,12,20,10,120,1,1,828,"Vu","Vulnerable",1,0,0,"RobP0828","Forest/Woodland","Woody vegetation"]
["Robinvale Plains","RobP","Semi-arid Woodland","Robinvale PlainsSemi-arid Woodland","RobP0097",40,20,12,20,0,5,null,null,null,null,5,15,5,20,null,null,2,5,7,5,2,5,null,null,null,null,2,10,1,1,null,null,null,null,null,null,null,null,null,null,null,null,0,10,"0","20","Continuous",0,10,10,11,35,20,200,1,1,97,"Vu","Vulnerable",1,0,"y","RobP0097","Forest/Woodland","Woody vegetation"]
["Robinvale Plains","RobP","Shallow Freshwater Marsh","Robinvale PlainsShallow Freshwater Marsh","RobP0200",null,null,0,null,null,null,null,null,null,null,null,null,null,null,null,null,null,null,null,null,null,null,null,null,null,null,null,null,null,null,null,null,null,null,null,null,null,null,null,null,null,null,null,null,null,null,null,5,0,null,null,null,null,0,1.36,1.36,200,"Vu","Vulnerable",6,0,0,"RobP0200","wetlands","Non-woody wetland vegetation"]
["Robinvale Plains","RobP","Shrubby Riverine Woodland","Robinvale PlainsShrubby Riverine Woodland","RobP0818",80,5,15,10,0,5,1,5,null,null,2,10,2,5,null,null,4,10,5,10,2,1,null,null,null,null,2,10,null,null,null,null,null,null,null,null,null,null,null,null,null,null,null,null,null,null,"Continuous",0,8,5,11,20,10,100,1,1,818,"LC","Least Concern",1,0,0,"RobP0818","Forest/Woodland","Woody vegetation"]
["Robinvale Plains","RobP","Spike-sedge Wetland","Robinvale PlainsSpike-sedge Wetland","RobP0819",0,0,0,null,null,null,null,null,null,null,null,null,null,null,null,null,1,5,6,15,4,5,null,null,null,null,2,10,2,50,null,null,null,null,null,null,null,null,null,null,null,null,null,null,null,null,"Episodic",5,5,null,11,null,20,50,1.36,1.36,819,"Vu","Vulnerable",6,0,0,"RobP0819","wetlands","Non-woody wetland vegetation"]
["Robinvale Plains","RobP","Sub-saline Depression Shrubland","Robinvale PlainsSub-saline Depression Shrubland","RobP0820",0,0,0,null,null,null,null,null,null,null,null,null,4,25,2,5,null,null,6,25,4,20,null,null,null,null,null,null,null,null,null,null,null,null,null,null,null,null,null,null,null,null,0,10,"0","20","Continuous",0,6,4,10,25,5,0,1.36,1.36,820,"D","Depleted",6,0,0,"RobP0820","wetlands","Non-woody wetland vegetation"]
["Robinvale Plains","RobP","Tall Marsh","Robinvale PlainsTall Marsh","RobP0821",0,0,0,null,null,null,null,null,null,null,null,null,null,null,null,null,null,null,6,20,3,10,1,10,3,40,null,null,2,10,null,null,null,null,null,null,null,null,null,null,null,null,null,null,null,null,"Episodic",1,5,null,9,null,10,50,1.36,1.36,821,"D","Depleted",6,0,0,"RobP0821","wetlands","Non-woody wetland vegetation"]
["Robinvale Plains","RobP","Woorinen Mallee","Robinvale PlainsWoorinen Mallee","RobP0824",15,30,12,25,null,null,null,null,null,null,6,10,6,20,null,null,null,null,6,10,7,10,null,null,null,null,1,1,null,null,null,null,null,null,null,null,null,null,null,null,null,null,0,10,"0","15","Continuous",0,7,12,13,30,20,200,1,1,824,"Vu","Vulnerable",1,0,"y","RobP0824","Forest/Woodland","Woody vegetation"]
["Robinvale Plains","RobP","Woorinen Sands Mallee","Robinvale PlainsWoorinen Sands Mallee","RobP0086",15,30,7,25,null,null,null,null,null,null,4,5,2,10,1,5,null,null,6,5,6,5,null,null,null,null,3,5,1,1,null,null,"1","15",null,null,null,null,null,null,null,null,0,10,"0","10","Continuous",0,10,6,12,15,15,100,1,1,86,"D","Depleted",1,0,"y","RobP0086","Forest/Woodland","Woody vegetation"]
["Strzelecki Ranges","Strz","Coast Banksia Woodland","Strzelecki RangesCoast Banksia Woodland","Strz0002",50,10,15,15,0,5,2,15,null,null,3,30,null,null,null,null,2,1,3,15,2,10,1,1,null,null,2,1,null,null,null,null,null,null,1,5,null,null,null,null,1,5,0,10,null,null,"Episodic",30,11,5,7,45,40,100,1,1,2,"Vu","Vulnerable",1,0,0,"Strz0002","Forest/Woodland","Woody vegetation"]
["Strzelecki Ranges","Strz","Coastal Headland Scrub","Strzelecki RangesCoastal Headland Scrub","Strz0161",0,0,0,null,null,null,null,null,null,null,7,50,2,5,null,null,2,1,4,5,2,5,1,1,null,null,4,10,2,5,null,null,null,null,null,null,null,null,null,null,2,5,0,10,null,null,"Continuous",0,10,9,8,55,40,0,1.36,1.36,161,"Vu","Vulnerable",4,0,0,"Strz0161","heathlands","Woody vegetation"]
["Strzelecki Ranges","Strz","Coastal Tussock Grassland","Strzelecki RangesCoastal Tussock Grassland","Strz0163",0,0,0,null,null,null,null,null,null,null,3,20,1,5,1,1,2,5,5,10,3,5,3,10,null,null,4,25,2,5,null,null,null,null,null,null,null,null,null,null,null,null,0,10,"0","10","Continuous",0,11,4,10,25,20,0,1.36,1.36,163,"D","Depleted",5,0,0,"Strz0163","grasslands","Other grassland vegetation"]
["Strzelecki Ranges","Strz","Cool Temperate Rainforest","Strzelecki RangesCool Temperate Rainforest","Strz0031",70,20,0,50,0,5,2,10,null,null,2,5,null,null,null,null,2,5,2,5,null,null,null,null,null,null,null,null,null,null,null,null,null,null,6,15,"3","40","5","5",2,1,0,40,null,null,"Continuous",0,10,4,4,15,50,200,1,1,31,"En","Endangered",1,0,0,"Strz0031","Forest/Woodland","Woody vegetation"]
["Strzelecki Ranges","Strz","Damp Forest","Strzelecki RangesDamp Forest","Strz0029",90,20,30,40,0,5,4,20,null,null,6,30,1,1,null,null,2,1,8,10,1,1,1,1,1,5,3,10,2,5,null,null,null,null,3,10,"1","5",null,null,3,5,0,20,null,null,"Continuous",0,15,11,11,51,50,300,1,1,29,"En","Endangered",1,0,0,"Strz0029","Forest/Woodland","Woody vegetation"]
["Strzelecki Ranges","Strz","Damp Heathy Woodland","Strzelecki RangesDamp Heathy Woodland","Strz0793",60,10,10,15,0,5,null,null,null,null,5,30,4,5,2,1,null,null,3,5,3,20,2,5,null,null,3,10,1,5,null,null,null,null,1,5,null,null,null,null,null,null,0,20,"0","10","Episodic",30,12,9,6,35,20,100,1,1,793,"D","Depleted",1,0,0,"Strz0793","Forest/Woodland","Woody vegetation"]
["Strzelecki Ranges","Strz","Grassy Forest","Strzelecki RangesGrassy Forest","Strz0128",null,null,null,null,null,null,null,null,null,null,null,null,null,null,null,null,null,null,null,null,null,null,null,null,null,null,null,null,null,null,null,null,null,null,null,null,null,null,null,null,null,null,null,null,null,null,null,null,0,null,null,null,null,0,1,1,128,"En","Endangered",1,0,0,"Strz0128","Forest/Woodland","Woody vegetation"]
["Strzelecki Ranges","Strz","Grassy Woodland","Strzelecki RangesGrassy Woodland","Strz0175",null,null,null,null,null,null,null,null,null,null,null,null,null,null,null,null,null,null,null,null,null,null,null,null,null,null,null,null,null,null,null,null,null,null,null,null,null,null,null,null,null,null,null,null,null,null,null,null,0,null,null,null,null,0,1,1,175,"En","Endangered",1,0,0,"Strz0175","Forest/Woodland","Woody vegetation"]
["Strzelecki Ranges","Strz","Heathy Woodland","Strzelecki RangesHeathy Woodland","Strz0048",50,15,10,10,0,5,null,null,null,null,5,30,5,20,null,null,null,null,2,5,2,5,1,5,1,1,1,1,2,5,null,null,null,null,1,5,null,null,null,null,null,null,0,10,"0","10","Episodic",20,12,10,4,50,40,150,1,1,48,"D","Depleted",1,0,0,"Strz0048","Forest/Woodland","Woody vegetation"]
["Strzelecki Ranges","Strz","Herb-rich Foothill Forest","Strzelecki RangesHerb-rich Foothill Forest","Strz0023",70,20,25,40,0,5,2,15,null,null,5,20,null,null,null,null,3,5,9,15,2,5,3,15,2,5,3,10,2,5,null,null,null,null,2,10,null,null,null,null,3,5,0,20,null,null,"Continuous",0,13,7,14,35,40,200,1,1,23,"En","Endangered",1,0,0,"Strz0023","Forest/Woodland","Woody vegetation"]
["Strzelecki Ranges","Strz","Lowland Forest","Strzelecki RangesLowland Forest","Strz0016",70,20,25,30,0,5,2,10,null,null,8,35,4,10,1,1,null,null,6,10,3,5,3,10,2,10,3,5,2,5,null,null,null,null,2,15,null,null,null,null,3,5,0,10,null,null,"Continuous",0,14,14,9,55,40,200,1,1,16,"Vu","Vulnerable",1,0,0,"Strz0016","Forest/Woodland","Woody vegetation"]
["Strzelecki Ranges","Strz","Plains Grassy Forest","Strzelecki RangesPlains Grassy Forest","Strz0151",70,20,20,30,0,5,3,15,null,null,6,20,3,5,2,5,3,5,6,10,2,5,2,10,1,5,4,15,2,1,null,null,null,null,2,10,null,null,null,null,null,null,0,10,null,null,"Continuous",0,14,12,11,40,20,200,1,1,151,"En","Endangered",1,0,0,"Strz0151","Forest/Woodland","Woody vegetation"]
["Strzelecki Ranges","Strz","Plains Grassy Woodland","Strzelecki RangesPlains Grassy Woodland","Strz0055",80,10,15,20,0,5,1,5,null,null,2,10,1,1,1,1,1,5,10,20,3,5,2,5,1,10,9,35,2,10,null,null,null,null,null,null,null,null,null,null,null,null,0,10,null,null,"Continuous",0,13,4,14,16,10,100,1,1,55,"En","Endangered",1,0,0,"Strz0055","Forest/Woodland","Woody vegetation"]
["Strzelecki Ranges","Strz","Riparian Forest","Strzelecki RangesRiparian Forest","Strz0018",80,20,30,40,0,5,4,20,null,null,8,20,1,1,1,1,2,1,6,10,2,1,3,10,2,5,3,5,1,5,null,null,null,null,5,20,"2","10",null,null,3,5,0,20,null,null,"Continuous",0,16,13,10,41,50,300,1,1,18,"Vu","Vulnerable",1,0,0,"Strz0018","Forest/Woodland","Woody vegetation"]
["Strzelecki Ranges","Strz","Riparian Scrub","Strzelecki RangesRiparian Scrub","Strz0191",0,0,0,null,null,null,null,null,null,null,3,10,1,1,null,null,2,5,1,1,1,1,3,10,1,5,1,1,3,15,null,null,null,null,1,5,null,null,null,null,null,null,0,20,null,null,"Continuous",0,11,4,4,11,40,0,1.25,1.25,191,"Vu","Vulnerable",3,0,0,"Strz0191","scrubs/shrublands/mallee without logs","Woody vegetation"]
["Strzelecki Ranges","Strz","Sand Heathland","Strzelecki RangesSand Heathland","Strz0006",0,0,0,null,null,null,null,null,null,null,7,55,4,10,null,null,null,null,3,5,2,5,1,5,1,1,2,5,2,15,null,null,null,null,1,1,null,null,null,null,null,null,0,10,"0","10","Episodic",30,11,11,5,65,20,0,1.36,{"$error":"#N/A"},{"$error":"#N/A"},{"$error":"#N/A"},{"$error":"#N/A"},{"$error":"#N/A"},{"$error":"#N/A"},{"$error":"#N/A"},{"$error":"#N/A"},{"$error":"#N/A"},{"$error":"#N/A"}]
["Strzelecki Ranges","Strz","Shrubby Foothill Forest","Strzelecki RangesShrubby Foothill Forest","Strz0045",70,20,25,40,0,5,1,5,null,null,8,35,4,15,1,5,null,null,3,5,1,1,1,5,1,10,2,5,null,null,null,null,null,null,2,10,null,null,null,null,1,1,0,10,"0","10","Episodic",30,14,13,4,55,40,200,1,1,45,"En","Endangered",1,0,0,"Strz0045","Forest/Woodland","Woody vegetation"]
["Strzelecki Ranges","Strz","Swamp Scrub","Strzelecki RangesSwamp Scrub","Strz0053",0,0,0,70,null,null,null,null,null,null,2,10,2,1,null,null,2,1,3,15,2,5,2,10,3,10,2,5,2,15,null,null,null,null,1,5,null,null,null,null,1,1,0,20,null,null,"Continuous",0,12,4,7,11,40,0,1.25,1.1499999999999999,53,"En","Endangered",3,0,0,"Strz0053","scrubs/shrublands/mallee without logs","Woody vegetation"]
["Strzelecki Ranges","Strz","Swampy Riparian Woodland","Strzelecki RangesSwampy Riparian Woodland","Strz0083",70,15,15,20,0,5,4,30,null,null,5,20,1,1,1,1,3,5,7,10,3,5,3,15,1,5,5,10,2,5,null,null,null,null,2,5,null,null,null,null,null,null,0,10,null,null,"Continuous",0,14,10,13,51,20,200,1,1,83,"En","Endangered",1,0,0,"Strz0083","Forest/Woodland","Woody vegetation"]
["Strzelecki Ranges","Strz","Swampy Woodland","Strzelecki RangesSwampy Woodland","Strz0937",70,15,15,15,0,5,1,5,null,null,2,20,null,null,null,null,null,null,5,10,3,10,4,30,2,10,4,10,null,null,null,null,null,null,null,null,null,null,null,null,null,null,0,20,null,null,"Continuous",0,9,3,8,25,20,150,1,1,937,"En","Endangered",1,0,0,"Strz0937","Forest/Woodland","Woody vegetation"]
["Strzelecki Ranges","Strz","Warm Temperate Rainforest","Strzelecki RangesWarm Temperate Rainforest","Strz0032",70,20,25,50,null,null,3,30,null,null,2,15,null,null,null,null,1,1,3,5,1,1,2,5,1,1,null,null,2,5,null,null,null,null,4,15,"2","5","1","1",3,20,0,20,null,null,"Continuous",0,13,5,5,45,50,200,1,1,32,"En","Endangered",1,0,0,"Strz0032","Forest/Woodland","Woody vegetation"]
["Strzelecki Ranges","Strz","Wet Forest","Strzelecki RangesWet Forest","Strz0030",90,20,30,40,0,5,4,30,null,null,3,15,null,null,null,null,null,null,3,5,null,null,1,5,1,10,null,null,null,null,null,null,null,null,4,20,"2","20","2","1",2,5,0,20,null,null,"Continuous",0,11,7,3,45,50,300,1,1,30,"D","Depleted",1,0,0,"Strz0030","Forest/Woodland","Woody vegetation"]
["Strzelecki Ranges","Strz","Wet Heathland","Strzelecki RangesWet Heathland","Strz0008",0,0,0,null,null,null,null,null,null,null,6,40,3,5,1,1,null,null,3,5,2,5,1,5,2,10,2,5,3,20,null,null,null,null,1,5,null,null,null,null,null,null,0,20,null,null,"Episodic",30,11,9,5,45,20,0,1.36,1.36,8,"Vu","Vulnerable",4,0,0,"Strz0008","heathlands","Woody vegetation"]
["Strzelecki Ranges","Strz","Wet Sands Thicket",{"$f":"CONCATENATE(A963,C963)","v":"Strzelecki RangesWet Sands Thicket"},"Strz0233",0,0,0,null,null,null,null,null,null,null,5,50,4,10,null,null,null,null,2,1,1,1,1,5,null,null,1,1,1,1,null,null,null,null,1,1,null,null,null,null,1,1,0,10,null,null,"Episodic",30,10,9,3,60,40,0,1.36,1.36,233,"Ra","Rare",4,0,0,"Strz0233","heathlands","Woody vegetation"]
["Strzelecki Ranges","Strz","Wetland Formation","Strzelecki RangesWetland Formation","Strz0074",null,null,0,null,null,null,null,null,null,null,null,null,null,null,null,null,null,null,null,null,null,null,null,null,null,null,null,null,null,null,null,null,null,null,null,null,null,null,null,null,null,null,null,null,null,null,null,5,0,null,null,null,null,0,1.36,{"$error":"#N/A"},{"$error":"#N/A"},{"$error":"#N/A"},{"$error":"#N/A"},{"$error":"#N/A"},{"$error":"#N/A"},{"$error":"#N/A"},{"$error":"#N/A"},{"$error":"#N/A"},{"$error":"#N/A"}]
["Victorian Alps","VAlp","Alpine Coniferous Shrubland","Victorian AlpsAlpine Coniferous Shrubland","VAlp0156",null,0,0,null,null,null,null,null,null,null,null,null,null,null,null,null,null,null,null,null,null,null,null,null,null,null,null,null,null,null,null,null,null,null,null,null,null,null,null,null,null,null,null,null,null,null,null,0,0,null,null,null,0,0,0,{"$error":"#N/A"},{"$error":"#N/A"},{"$error":"#N/A"},{"$error":"#N/A"},{"$error":"#N/A"},{"$error":"#N/A"},{"$error":"#N/A"},{"$error":"#N/A"},{"$error":"#N/A"},{"$error":"#N/A"}]
["Victorian Alps","VAlp","Alpine Damp Grassland","Victorian AlpsAlpine Damp Grassland","VAlp1002",null,0,0,null,null,null,null,null,null,null,null,null,null,null,null,null,null,null,null,null,null,null,null,null,null,null,null,null,null,null,null,null,null,null,null,null,null,null,null,null,null,null,null,null,null,null,null,0,0,null,null,null,0,0,1.36,1.36,1002,"Ra","Rare",5,0,0,"VAlp1002","grasslands","Other grassland vegetation"]
["Victorian Alps","VAlp","Alpine Fen","Victorian AlpsAlpine Fen","VAlp0171",null,0,0,null,null,null,null,null,null,null,null,null,null,null,null,null,null,null,null,null,null,null,null,null,null,null,null,null,null,null,null,null,null,null,null,null,null,null,null,null,null,null,null,null,null,null,null,0,0,null,null,null,0,0,1.36,1.36,171,"En","Endangered",6,0,0,"VAlp0171","wetlands","Non-woody wetland vegetation"]
["Victorian Alps","VAlp","Alpine Grassland","Victorian AlpsAlpine Grassland","VAlp1001",null,0,0,null,null,null,null,null,null,null,null,null,null,null,null,null,null,null,null,null,null,null,null,null,null,null,null,null,null,null,null,null,null,null,null,null,null,null,null,null,null,null,null,null,null,null,null,0,0,null,null,null,0,0,1.36,1.36,1001,"Ra","Rare",5,0,0,"VAlp1001","grasslands","Other grassland vegetation"]
["Victorian Alps","VAlp","Alpine Grassy Heathland","Victorian AlpsAlpine Grassy Heathland","VAlp1004",null,0,0,null,null,null,null,null,null,null,null,null,null,null,null,null,null,null,null,null,null,null,null,null,null,null,null,null,null,null,null,null,null,null,null,null,null,null,null,null,null,null,null,null,null,null,null,0,0,null,null,null,0,0,0,{"$error":"#N/A"},{"$error":"#N/A"},{"$error":"#N/A"},{"$error":"#N/A"},{"$error":"#N/A"},{"$error":"#N/A"},{"$error":"#N/A"},{"$error":"#N/A"},{"$error":"#N/A"},{"$error":"#N/A"}]
["Victorian Alps","VAlp","Alpine Valley Bog","Victorian AlpsAlpine Valley Bog","VAlp0288",null,0,0,null,null,null,null,null,null,null,null,null,null,null,null,null,null,null,null,null,null,null,null,null,null,null,null,null,null,null,null,null,null,null,null,null,null,null,null,null,null,null,null,null,null,null,null,0,0,null,null,null,0,0,1.36,1.36,288,"En","Endangered",6,0,0,"VAlp0288","wetlands","Non-woody wetland vegetation"]
["Victorian Alps","VAlp","Blackthorn Scrub","Victorian AlpsBlackthorn Scrub","VAlp0027",0,0,0,null,0,5,null,null,null,null,5,20,null,null,null,null,null,null,2,1,null,null,null,null,null,null,3,5,1,1,null,null,null,null,2,5,null,null,"2","1",2,1,0,10,"0","10","Continuous",0,10,5,2,20,40,100,1.25,1.25,27,"Ra","Rare",3,0,0,"VAlp0027","scrubs/shrublands/mallee without logs","Woody vegetation"]
["Victorian Alps","VAlp","Cool Temperate Rainforest","Victorian AlpsCool Temperate Rainforest","VAlp0031",70,20,25,50,0,5,1,10,null,null,3,10,1,5,null,null,1,1,4,5,2,1,1,1,null,null,2,10,null,null,null,null,null,null,5,25,"1","10",null,null,null,null,0,40,null,null,"Continuous",0,12,5,7,25,50,200,1,1,31,"En","Endangered",1,0,0,"VAlp0031","Forest/Woodland","Woody vegetation"]
["Victorian Alps","VAlp","Damp Forest","Victorian AlpsDamp Forest","VAlp0029",90,20,30,40,0,5,3,25,null,null,3,20,null,null,null,null,1,1,5,10,2,5,null,null,null,null,1,15,null,null,null,null,null,null,2,20,"1","5",null,null,1,5,0,20,null,null,"Continuous",0,11,6,8,45,50,300,1,1,29,"LC","Least Concern",1,0,0,"VAlp0029","Forest/Woodland","Woody vegetation"]
["Victorian Alps","VAlp","Dry Valley Forest","Victorian AlpsDry Valley Forest","VAlp0169",70,20,20,30,0,5,4,15,null,null,9,30,3,10,1,1,4,5,11,15,3,5,3,5,null,null,4,15,1,1,null,null,null,null,3,10,"1","5",null,null,2,5,0,10,null,null,"Continuous",0,15,16,18,55,40,200,1,1,169,"Vu","Vulnerable",1,0,0,"VAlp0169","Forest/Woodland","Woody vegetation"]
["Victorian Alps","VAlp","Granitic Hills Woodland","Victorian AlpsGranitic Hills Woodland","VAlp0072",60,15,10,15,0,5,1,5,null,null,4,20,3,20,null,null,2,5,11,20,null,null,null,null,null,null,4,5,3,5,null,null,null,null,1,1,null,null,null,null,null,null,0,10,null,null,"Continuous",0,10,8,13,45,20,150,1,1,72,"LC","Least Concern",1,0,0,"VAlp0072","Forest/Woodland","Woody vegetation"]
["Victorian Alps","VAlp","Grassy Dry Forest","Victorian AlpsGrassy Dry Forest","VAlp0022",60,20,20,30,0,5,1,5,null,null,4,10,3,5,2,1,3,5,11,20,3,5,1,5,null,null,7,20,2,5,null,null,null,null,1,5,null,null,null,null,1,1,0,10,"0","10","Continuous",0,15,8,17,20,20,200,1,1,22,"LC","Least Concern",1,0,0,"VAlp0022","Forest/Woodland","Woody vegetation"]
["Victorian Alps","VAlp","Grassy Woodland","Victorian AlpsGrassy Woodland","VAlp0175",60,15,15,20,0,5,1,5,null,null,4,10,1,1,null,null,5,10,7,20,3,5,1,1,null,null,7,30,1,1,null,null,null,null,1,1,null,null,null,null,1,5,0,10,null,null,"Continuous",0,13,6,15,16,20,150,1,1,175,"D","Depleted",1,0,0,"VAlp0175","Forest/Woodland","Woody vegetation"]
["Victorian Alps","VAlp","Heathy Dry Forest","Victorian AlpsHeathy Dry Forest","VAlp0020",60,20,20,30,0,5,1,5,null,null,8,30,2,5,3,15,2,1,4,5,null,null,1,5,null,null,6,20,null,null,null,null,null,null,1,1,null,null,null,null,null,null,0,10,"0","10","Episodic",20,12,11,6,40,20,200,1,1,20,"LC","Least Concern",1,0,0,"VAlp0020","Forest/Woodland","Woody vegetation"]
["Victorian Alps","VAlp","Herb-rich Foothill Forest","Victorian AlpsHerb-rich Foothill Forest","VAlp0023",70,20,25,40,0,5,2,10,null,null,6,20,3,10,2,5,4,5,12,20,2,5,2,5,null,null,6,20,1,5,null,null,null,null,2,15,null,null,null,null,1,5,0,20,null,null,"Continuous",0,14,11,18,40,40,200,1,1,23,"LC","Least Concern",1,0,0,"VAlp0023","Forest/Woodland","Woody vegetation"]
["Victorian Alps","VAlp","Late-lying Snowpatch Herbland","Victorian AlpsLate-lying Snowpatch Herbland","VAlp1014",null,0,0,null,null,null,null,null,null,null,null,null,null,null,null,null,null,null,null,null,null,null,null,null,null,null,null,null,null,null,null,null,null,null,null,null,null,null,null,null,null,null,null,null,null,null,null,0,0,null,null,null,0,0,1.36,1.36,1014,"En","Endangered",5,0,0,"VAlp1014","grasslands","Other grassland vegetation"]
["Victorian Alps","VAlp","Montane Damp Forest","Victorian AlpsMontane Damp Forest","VAlp0038",90,20,30,40,0,5,2,15,null,null,7,25,3,10,null,null,3,5,10,15,2,5,1,5,null,null,6,15,1,1,null,null,null,null,2,10,null,null,null,null,1,5,0,20,null,null,"Continuous",0,13,12,15,50,50,300,1,1,38,"LC","Least Concern",1,0,0,"VAlp0038","Forest/Woodland","Woody vegetation"]
["Victorian Alps","VAlp","Montane Dry Woodland","Victorian AlpsMontane Dry Woodland","VAlp0036",50,15,15,20,0,5,2,20,"1","1",6,20,2,5,null,null,2,5,9,20,2,5,2,5,null,null,6,15,1,5,null,null,null,null,1,5,null,null,null,null,null,null,0,10,"0","10","Continuous",0,14,10,13,45,20,150,1,1,36,"LC","Least Concern",1,0,0,"VAlp0036","Forest/Woodland","Woody vegetation"]
["Victorian Alps","VAlp","Montane Grassy Woodland","Victorian AlpsMontane Grassy Woodland","VAlp0037",50,15,10,20,0,5,1,5,null,null,6,20,3,10,2,5,2,5,15,20,3,10,2,5,null,null,7,20,1,1,null,null,null,null,1,1,null,null,null,null,null,null,0,10,"0","10","Continuous",0,14,10,20,35,20,150,1,1,37,"LC","Least Concern",1,0,0,"VAlp0037","Forest/Woodland","Woody vegetation"]
["Victorian Alps","VAlp","Montane Herb-rich Woodland","Victorian AlpsMontane Herb-rich Woodland","VAlp0319",70,15,25,40,0,5,2,10,null,null,6,15,2,5,1,1,5,10,12,20,3,5,1,5,null,null,8,20,1,1,null,null,null,null,3,10,null,null,null,null,2,5,0,20,null,null,"Continuous",0,14,10,20,30,20,150,1,1,319,"LC","Least Concern",1,0,0,"VAlp0319","Forest/Woodland","Woody vegetation"]
["Victorian Alps","VAlp","Montane Riparian Thicket","Victorian AlpsMontane Riparian Thicket","VAlp0041",0,0,0,null,null,null,null,null,null,null,1,5,null,null,null,null,null,null,null,null,1,1,2,40,null,null,2,1,null,null,null,null,null,null,3,20,"1","5","2","1",null,null,0,20,null,null,"Continuous",0,8,1,1,5,40,50,1.25,1.25,41,"LC","Least Concern",3,0,0,"VAlp0041","scrubs/shrublands/mallee without logs","Woody vegetation"]
["Victorian Alps","VAlp","Montane Riparian Woodland","Victorian AlpsMontane Riparian Woodland","VAlp0040",0,0,0,null,null,null,1,10,null,null,3,15,3,5,null,null,4,10,12,20,4,10,3,5,1,1,6,30,3,5,null,null,null,null,2,5,null,null,null,null,null,null,0,20,null,null,"Continuous",0,12,7,20,30,40,150,1,1,40,"LC","Least Concern",1,0,0,"VAlp0040","Forest/Woodland","Woody vegetation"]
["Victorian Alps","VAlp","Montane Rocky Shrubland","Victorian AlpsMontane Rocky Shrubland","VAlp0192",0,0,0,null,null,null,null,null,null,null,8,40,2,5,1,1,5,5,7,5,3,5,2,5,null,null,4,5,1,1,null,null,null,null,3,5,null,null,null,null,1,1,0,20,null,null,"Episodic",30,12,10,15,45,40,0,1.25,1.25,192,"LC","Least Concern",3,0,0,"VAlp0192","scrubs/shrublands/mallee without logs","Woody vegetation"]
["Victorian Alps","VAlp","Montane Wet Forest","Victorian AlpsMontane Wet Forest","VAlp0039",90,20,30,40,0,5,5,20,null,null,5,25,null,null,null,null,2,5,5,15,2,1,1,1,1,1,1,5,null,null,null,null,null,null,3,25,"2","5",null,null,2,1,0,20,null,null,"Continuous",0,13,10,9,45,50,300,1,1,39,"LC","Least Concern",1,0,0,"VAlp0039","Forest/Woodland","Woody vegetation"]
["Victorian Alps","VAlp","Riparian Forest","Victorian AlpsRiparian Forest","VAlp0018",90,20,30,40,0,5,3,20,null,null,7,30,2,5,2,1,5,10,16,20,4,10,null,null,null,null,8,10,4,5,null,null,null,null,3,10,null,null,null,null,null,null,0,20,null,null,"Continuous",0,12,12,25,55,50,300,1,1,18,"LC","Least Concern",1,0,0,"VAlp0018","Forest/Woodland","Woody vegetation"]
["Victorian Alps","VAlp","Riparian Shrubland","Victorian AlpsRiparian Shrubland","VAlp0019",0,0,0,null,null,null,null,null,null,null,9,20,null,null,null,null,null,null,2,5,null,null,1,10,null,null,4,5,1,1,null,null,null,null,4,10,"2","1",null,null,2,5,0,20,null,null,"Continuous",0,9,9,2,20,40,100,1.25,1.25,19,"Ra","Rare",3,0,0,"VAlp0019","scrubs/shrublands/mallee without logs","Woody vegetation"]
["Victorian Alps","VAlp","Riverine Escarpment Scrub","Victorian AlpsRiverine Escarpment Scrub","VAlp0082",0,0,0,null,0,5,null,null,null,null,8,30,2,1,1,1,2,5,12,20,3,5,4,15,null,null,3,10,2,5,null,null,null,null,3,10,null,null,null,null,1,5,0,10,null,null,"Continuous",0,13,10,17,31,40,50,1.25,1.25,82,"Vu","Vulnerable",3,0,0,"VAlp0082","scrubs/shrublands/mallee without logs","Woody vegetation"]
["Victorian Alps","VAlp","Rocky Outcrop Shrubland","Victorian AlpsRocky Outcrop Shrubland","VAlp0028",0,0,0,null,null,null,null,null,null,null,7,30,2,5,1,1,2,5,2,1,null,null,null,null,null,null,4,5,1,1,null,null,null,null,1,1,null,null,null,null,1,1,0,20,"0","10","Continuous",0,11,9,4,35,40,0,1.36,1.36,28,"Ra","Rare",4,0,0,"VAlp0028","heathlands","Woody vegetation"]
["Victorian Alps","VAlp","Shrubby Damp Forest","Victorian AlpsShrubby Damp Forest","VAlp0316",90,20,25,40,0,5,4,20,null,null,8,20,2,10,1,1,4,5,8,15,2,5,2,5,1,1,3,10,1,5,null,null,null,null,2,15,"1","1",null,null,2,5,0,20,null,null,"Continuous",0,16,14,14,50,50,300,1,1,316,"LC","Least Concern",1,0,0,"VAlp0316","Forest/Woodland","Woody vegetation"]
["Victorian Alps","VAlp","Shrubby Dry Forest","Victorian AlpsShrubby Dry Forest","VAlp0021",60,20,25,30,0,5,1,5,"1","5",8,40,2,5,2,5,3,5,5,10,null,null,2,5,null,null,4,10,1,1,null,null,null,null,null,null,null,null,null,null,null,null,0,10,"0","10","Episodic",20,13,11,8,50,20,200,1,1,21,"LC","Least Concern",1,0,0,"VAlp0021","Forest/Woodland","Woody vegetation"]
["Victorian Alps","VAlp","Shrubby Foothill Forest","Victorian AlpsShrubby Foothill Forest","VAlp0045",70,20,25,40,0,5,1,5,null,null,8,35,2,10,2,5,2,5,1,1,1,1,null,null,null,null,3,5,null,null,null,null,null,null,null,null,null,null,"1","1",1,0,0,10,null,null,"Episodic",30,12,11,4,50,40,200,1,1,45,"LC","Least Concern",1,0,0,"VAlp0045","Forest/Woodland","Woody vegetation"]
["Victorian Alps","VAlp","Shrubby Wet Forest","Victorian AlpsShrubby Wet Forest","VAlp0201",90,20,30,40,0,5,2,20,null,null,7,25,3,10,null,null,2,1,8,15,2,1,1,1,null,null,6,15,1,1,null,null,null,null,2,5,null,null,null,null,null,null,0,20,null,null,"Continuous",0,12,12,12,55,50,300,1,1,201,"LC","Least Concern",1,0,0,"VAlp0201","Forest/Woodland","Woody vegetation"]
["Victorian Alps","VAlp","Snowpatch Grassland","Victorian AlpsSnowpatch Grassland","VAlp1012",null,0,0,null,null,null,null,null,null,null,null,null,null,null,null,null,null,null,null,null,null,null,null,null,null,null,null,null,null,null,null,null,null,null,null,null,null,null,null,null,null,null,null,null,null,null,null,0,0,null,null,null,0,0,1.36,1.36,1012,"Vu","Vulnerable",5,0,0,"VAlp1012","grasslands","Other grassland vegetation"]
["Victorian Alps","VAlp","Sub-alpine Dry Shrubland","Victorian AlpsSub-alpine Dry Shrubland","VAlp1003",null,0,0,null,null,null,null,null,null,null,null,null,null,null,null,null,null,null,null,null,null,null,null,null,null,null,null,null,null,null,null,null,null,null,null,null,null,null,null,null,null,null,null,null,null,null,null,0,0,null,null,null,0,0,1.25,1.25,1003,"Ra","Rare",3,0,0,"VAlp1003","scrubs/shrublands/mallee without logs","Woody vegetation"]
["Victorian Alps","VAlp","Sub-alpine Grassland","Victorian AlpsSub-alpine Grassland","VAlp0206",0,0,0,null,null,null,null,null,null,null,1,5,3,5,1,1,3,5,11,20,3,10,1,1,null,null,5,20,2,10,null,null,null,null,null,null,null,null,null,null,null,null,0,20,"0","10","Continuous",0,11,4,17,10,10,0,1.36,{"$error":"#N/A"},{"$error":"#N/A"},{"$error":"#N/A"},{"$error":"#N/A"},{"$error":"#N/A"},{"$error":"#N/A"},{"$error":"#N/A"},{"$error":"#N/A"},{"$error":"#N/A"},{"$error":"#N/A"}]
["Victorian Alps","VAlp","Sub-alpine Riparian Shrubland","Victorian AlpsSub-alpine Riparian Shrubland","VAlp0208",null,0,0,null,null,null,null,null,null,null,null,null,null,null,null,null,null,null,null,null,null,null,null,null,null,null,null,null,null,null,null,null,null,null,null,null,null,null,null,null,null,null,null,null,null,null,null,0,0,null,null,null,0,0,1.25,1.25,208,"Ra","Rare",3,0,0,"VAlp0208","scrubs/shrublands/mallee without logs","Woody vegetation"]
["Victorian Alps","VAlp","Sub-alpine Shrubland","Victorian AlpsSub-alpine Shrubland","VAlp0042",0,0,0,null,null,null,null,null,null,null,6,40,4,15,2,1,3,5,8,15,2,5,null,null,null,null,5,20,1,5,null,null,null,null,null,null,null,null,null,null,null,null,0,20,null,null,"Continuous",0,9,10,13,55,40,100,1.25,1.25,42,"Ra","Rare",3,0,0,"VAlp0042","scrubs/shrublands/mallee without logs","Woody vegetation"]
["Victorian Alps","VAlp","Sub-alpine Wet Heathland","Victorian AlpsSub-alpine Wet Heathland","VAlp0210",0,0,0,null,null,null,null,null,null,null,4,15,3,10,1,1,1,1,8,15,4,10,1,1,null,null,4,10,2,15,null,null,null,null,1,1,null,null,null,null,null,null,0,40,null,null,"Episodic",30,11,7,13,25,10,0,1.36,1.36,210,"En","Endangered",4,0,0,"VAlp0210","heathlands","Woody vegetation"]
["Victorian Alps","VAlp","Sub-alpine Woodland","Victorian AlpsSub-alpine Woodland","VAlp0043",40,15,10,15,0,5,1,5,null,null,5,20,2,10,null,null,3,10,8,20,2,5,null,null,null,null,4,20,1,5,null,null,null,null,1,1,null,null,null,null,null,null,0,20,"0","10","Continuous",0,12,8,13,35,20,100,1,1,43,"LC","Least Concern",1,0,0,"VAlp0043","Forest/Woodland","Woody vegetation"]
["Victorian Alps","VAlp","Swampy Riparian Woodland","Victorian AlpsSwampy Riparian Woodland","VAlp0083",70,10,15,20,0,5,2,15,null,null,5,10,1,1,null,null,3,5,8,15,4,5,5,30,2,5,3,5,3,5,null,null,null,null,4,10,null,null,null,null,1,1,0,20,null,null,"Continuous",0,14,8,15,26,20,200,1,1,83,"Vu","Vulnerable",1,0,0,"VAlp0083","Forest/Woodland","Woody vegetation"]
["Victorian Alps","VAlp","Tableland Damp Forest","Victorian AlpsTableland Damp Forest","VAlp0035",90,20,30,40,0,5,3,20,null,null,7,20,2,10,null,null,2,5,8,15,2,15,1,5,1,1,3,15,1,5,null,null,null,null,2,5,null,null,null,null,null,null,0,20,null,null,"Continuous",0,13,12,12,50,50,300,1,1,35,"LC","Least Concern",1,0,0,"VAlp0035","Forest/Woodland","Woody vegetation"]
["Victorian Alps","VAlp","Treed Montane Riparian Woodland","Victorian AlpsTreed Montane Riparian Woodland","VAlp0040_61",60,10,10,15,0,5,1,10,null,null,3,15,3,5,null,null,4,10,12,20,4,10,3,5,1,1,6,30,3,5,null,null,null,null,2,5,null,null,null,null,null,null,0,20,null,null,"Continuous",0,13,7,20,30,40,150,1,{"$error":"#N/A"},{"$error":"#N/A"},{"$error":"#N/A"},{"$error":"#N/A"},{"$error":"#N/A"},{"$error":"#N/A"},{"$error":"#N/A"},{"$error":"#N/A"},{"$error":"#N/A"},{"$error":"#N/A"}]
["Victorian Alps","VAlp","Wet Forest","Victorian AlpsWet Forest","VAlp0030",90,20,30,40,0,5,3,25,null,null,7,15,null,null,null,null,2,5,6,10,1,1,1,1,null,null,2,5,null,null,null,null,null,null,4,25,"1","15",null,null,1,5,0,20,null,null,"Continuous",0,12,10,9,40,50,300,1,1,30,"LC","Least Concern",1,0,0,"VAlp0030","Forest/Woodland","Woody vegetation"]
["Victorian Riverina","VRiv","Alluvial Terraces Herb-rich Woodland","Victorian RiverinaAlluvial Terraces Herb-rich Woodland","VRiv0067",70,10,15,15,0,5,1,5,null,null,5,5,2,5,null,null,2,5,11,20,3,5,1,1,null,null,15,30,2,5,null,null,null,null,null,null,null,null,null,null,null,null,0,10,"0","10","Continuous",0,12,8,16,15,10,150,1,1,67,"Vu","Vulnerable",1,0,0,"VRiv0067","Forest/Woodland","Woody vegetation"]
["Victorian Riverina","VRiv","Box Ironbark Forest","Victorian RiverinaBox Ironbark Forest","VRiv0061",70,15,20,20,0,5,null,null,null,null,5,20,3,5,null,null,2,5,5,10,null,null,1,1,null,null,5,15,null,null,null,null,null,null,null,null,null,null,null,null,1,1,0,10,"0","20","Continuous",0,10,8,7,25,20,200,1,1,61,"Vu","Vulnerable",1,0,0,"VRiv0061","Forest/Woodland","Woody vegetation"]
["Victorian Riverina","VRiv","Cane Grass Wetland","Victorian RiverinaCane Grass Wetland","VRiv0291",null,null,null,null,null,null,null,null,null,null,null,null,null,null,null,null,null,null,null,null,null,null,null,null,null,null,null,null,null,null,null,null,null,null,null,null,null,null,null,null,null,null,null,null,null,null,null,null,0,null,null,null,null,0,1.36,1.36,291,"Vu","Vulnerable",6,0,0,"VRiv0291","wetlands","Non-woody wetland vegetation"]
["Victorian Riverina","VRiv","Chenopod Grassland","Victorian RiverinaChenopod Grassland","VRiv0829",0,0,0,null,null,null,null,null,null,null,2,20,6,30,2,1,2,5,4,10,4,5,null,null,null,null,3,20,null,null,null,null,null,null,null,null,null,null,null,null,null,null,0,10,"0","20","Continuous",0,9,8,10,50,5,0,1.36,1.36,829,"En","Endangered",5,"y",0,"VRiv0829","grasslands","Other grassland vegetation"]
["Victorian Riverina","VRiv","Chenopod Mallee","Victorian RiverinaChenopod Mallee","VRiv0158",null,0,0,null,null,null,null,null,null,null,null,null,null,null,null,null,null,null,null,null,null,null,null,null,null,null,null,null,null,null,null,null,null,null,null,null,null,null,null,null,null,null,null,null,null,null,null,0,0,null,null,null,0,0,1,1,158,"Vu","Vulnerable",1,0,"y","VRiv0158","Forest/Woodland","Woody vegetation"]
["Victorian Riverina","VRiv","Creekline Grassy Woodland","Victorian RiverinaCreekline Grassy Woodland","VRiv0068",80,15,15,15,0,5,1,5,null,null,4,10,3,5,null,null,2,5,9,15,3,5,2,10,1,5,16,35,3,5,null,null,null,null,null,null,null,null,null,null,null,null,0,10,null,null,"Continuous",0,12,8,14,20,40,300,1,1,68,"En","Endangered",1,0,0,"VRiv0068","Forest/Woodland","Woody vegetation"]
["Victorian Riverina","VRiv","Damp Sands Herb-rich Woodland","Victorian RiverinaDamp Sands Herb-rich Woodland","VRiv0003",70,15,15,15,0,5,2,10,null,null,2,5,1,1,null,null,3,5,8,15,2,5,3,10,null,null,8,25,2,5,null,null,null,null,1,5,null,null,null,null,null,null,0,10,"0","10","Continuous",0,13,5,13,16,40,100,1,1,3,"En","Endangered",1,0,0,"VRiv0003","Forest/Woodland","Woody vegetation"]
["Victorian Riverina","VRiv","Floodplain Riparian Woodland","Victorian RiverinaFloodplain Riparian Woodland","VRiv0056",80,15,20,20,0,5,1,5,null,null,2,5,1,1,null,null,null,null,4,10,2,1,2,10,1,5,6,35,2,10,null,null,null,null,null,null,null,null,null,null,null,null,0,10,null,null,"Episodic",10,11,4,6,11,40,300,1,1,56,"Vu","Vulnerable",1,0,0,"VRiv0056","Forest/Woodland","Woody vegetation"]
["Victorian Riverina","VRiv","Floodway Pond Herbland","Victorian RiverinaFloodway Pond Herbland","VRiv0810",0,0,0,null,null,null,null,null,null,null,null,null,null,null,null,null,1,1,5,20,4,15,null,null,null,null,2,10,3,20,null,null,null,null,null,null,null,null,null,null,null,null,null,null,null,null,null,0,5,null,10,null,5,50,1.36,1.36,810,"Vu","Vulnerable",6,0,0,"VRiv0810","wetlands","Non-woody wetland vegetation"]
["Victorian Riverina","VRiv","Granitic Hills Woodland","Victorian RiverinaGranitic Hills Woodland","VRiv0072",50,15,10,15,0,5,null,null,null,null,7,20,3,5,null,null,4,5,11,15,2,1,null,null,null,null,6,5,2,1,null,null,null,null,2,1,null,null,null,null,null,null,0,10,"0","10","Continuous",0,11,10,17,25,20,150,1,1,72,"En","Endangered",1,0,"y","VRiv0072","Forest/Woodland","Woody vegetation"]
["Victorian Riverina","VRiv","Grassy Dry Forest","Victorian RiverinaGrassy Dry Forest","VRiv0022",60,20,20,30,0,5,2,5,null,null,5,10,4,5,1,1,3,1,5,15,2,1,1,1,null,null,8,25,1,1,null,null,null,null,2,1,null,null,null,null,1,1,0,10,"0","10","Continuous",0,15,11,10,20,20,200,1,1,22,"D","Depleted",1,0,0,"VRiv0022","Forest/Woodland","Woody vegetation"]
["Victorian Riverina","VRiv","Grassy Riverine Forest","Victorian RiverinaGrassy Riverine Forest","VRiv0106",90,20,25,30,0,5,1,10,null,null,null,null,null,null,null,null,2,10,3,10,null,null,null,null,null,null,3,25,3,10,null,null,null,null,null,null,null,null,null,null,null,null,0,10,null,null,"Continuous",0,7,1,5,10,40,300,1,1,106,"D","Depleted",1,0,0,"VRiv0106","Forest/Woodland","Woody vegetation"]
["Victorian Riverina","VRiv","Grassy Woodland","Victorian RiverinaGrassy Woodland","VRiv0175",null,null,null,null,null,null,null,null,null,null,null,null,null,null,null,null,null,null,null,null,null,null,null,null,null,null,null,null,null,null,null,null,null,null,null,null,null,null,null,null,null,null,null,null,null,null,null,null,0,null,null,null,null,0,1,1,175,"En","Endangered",1,0,0,"VRiv0175","Forest/Woodland","Woody vegetation"]
["Victorian Riverina","VRiv","Heathy Dry Forest","Victorian RiverinaHeathy Dry Forest","VRiv0020",60,20,20,30,0,5,1,5,null,null,6,20,6,20,1,1,3,5,7,15,2,1,2,15,null,null,6,15,1,1,null,null,null,null,null,null,null,null,null,null,null,null,0,10,"0","10","Episodic",20,13,13,12,45,20,200,1,1,20,"LC","Least Concern",1,0,0,"VRiv0020","Forest/Woodland","Woody vegetation"]
["Victorian Riverina","VRiv","Herb-rich Foothill Forest","Victorian RiverinaHerb-rich Foothill Forest","VRiv0023",70,20,30,40,0,5,2,10,null,null,3,10,3,5,2,5,3,5,13,25,4,5,2,5,null,null,6,20,1,1,null,null,null,null,1,5,null,null,null,null,2,1,0,20,null,null,"Continuous",0,14,8,20,25,40,200,1,1,23,"D","Depleted",1,0,0,"VRiv0023","Forest/Woodland","Woody vegetation"]
["Victorian Riverina","VRiv","Intermittent Swampy Woodland","Victorian RiverinaIntermittent Swampy Woodland","VRiv0813",70,15,15,20,0,5,1,5,null,null,1,5,1,5,null,null,2,5,5,10,1,5,null,null,null,null,3,30,2,10,null,null,null,null,null,null,null,null,null,null,null,null,null,null,null,null,"Continuous",0,9,3,8,15,20,200,1,1,813,"D","Depleted",1,0,0,"VRiv0813","Forest/Woodland","Woody vegetation"]
["Victorian Riverina","VRiv","Lake Bed Herbland","Victorian RiverinaLake Bed Herbland","VRiv0107",0,0,0,null,null,null,null,null,null,null,2,5,2,5,null,null,null,null,3,25,3,20,null,null,null,null,null,null,null,null,null,null,null,null,null,null,null,null,null,null,null,null,null,null,null,null,"Episodic",10,4,4,6,10,5,0,1.36,1.36,107,"D","Depleted",6,0,0,"VRiv0107","wetlands","Non-woody wetland vegetation"]
["Victorian Riverina","VRiv","Lignum Swamp","Victorian RiverinaLignum Swamp","VRiv0104",0,0,0,null,null,null,null,null,null,null,1,20,null,null,null,null,4,5,8,25,2,10,null,null,1,5,2,5,2,5,null,null,null,null,null,null,null,null,null,null,1,1,null,null,"0","10","Continuous",0,9,1,14,20,5,0,1.36,1.36,104,"Vu","Vulnerable",6,0,0,"VRiv0104","wetlands","Non-woody wetland vegetation"]
["Victorian Riverina","VRiv","Lignum Swampy Woodland","Victorian RiverinaLignum Swampy Woodland","VRiv0823",70,15,15,20,0,5,1,5,null,null,2,30,1,5,null,null,2,1,8,10,4,10,null,null,1,5,2,5,3,15,null,null,null,null,null,null,null,null,null,null,null,null,null,null,"0","10","Continuous",0,11,4,14,40,5,100,1,1,823,"Vu","Vulnerable",1,0,0,"VRiv0823","Forest/Woodland","Woody vegetation"]
["Victorian Riverina","VRiv","Low Rises Grassy Woodland",{"$f":"CONCATENATE(A1027,C1027)","v":"Victorian RiverinaLow Rises Grassy Woodland"},"VRiv0175_61",70,15,15,15,0,5,1,5,null,null,3,10,4,5,1,1,3,5,12,20,null,null,1,5,1,5,19,40,4,5,null,null,null,null,1,1,null,null,null,null,null,null,0,10,"0","10","Continuous",0,14,8,15,20,20,150,1,{"$error":"#N/A"},{"$error":"#N/A"},{"$error":"#N/A"},{"$error":"#N/A"},{"$error":"#N/A"},{"$error":"#N/A"},{"$error":"#N/A"},{"$error":"#N/A"},{"$error":"#N/A"},{"$error":"#N/A"}]
["Victorian Riverina","VRiv","Low Rises Woodland","Victorian RiverinaLow Rises Woodland","VRiv0066",60,20,15,20,0,5,2,5,null,null,5,15,3,5,null,null,1,1,3,5,2,1,null,null,null,null,7,25,1,1,null,null,null,null,null,null,null,null,null,null,null,null,0,10,"0","10","Continuous",0,11,10,6,25,15,200,1,1,66,"En","Endangered",1,0,0,"VRiv0066","Forest/Woodland","Woody vegetation"]
["Victorian Riverina","VRiv","Lunette Woodland","Victorian RiverinaLunette Woodland","VRiv0652",80,8,15,10,0,5,1,5,null,null,3,10,1,1,null,null,3,5,8,15,2,5,2,5,null,null,12,45,2,5,null,null,null,null,null,null,null,null,null,null,null,null,0,10,"0","10","Continuous",0,12,5,13,16,10,100,1,1,652,"En","Endangered",1,0,0,"VRiv0652","Forest/Woodland","Woody vegetation"]
["Victorian Riverina","VRiv","Mountain Valley Riparian Woodland","Victorian RiverinaMountain Valley Riparian Woodland","VRiv1085",null,0,0,null,null,null,null,null,null,null,null,null,null,null,null,null,null,null,null,null,null,null,null,null,null,null,null,null,null,null,null,null,null,null,null,null,null,null,null,null,null,null,null,null,null,null,null,0,0,null,null,null,0,0,1,1,1085,"Vu","Vulnerable",1,0,0,"VRiv1085","Forest/Woodland","Woody vegetation"]
["Victorian Riverina","VRiv","Non-treed Semi-arid Chenopod Woodland","Victorian RiverinaNon-treed Semi-arid Chenopod Woodland","VRiv0098_61",0,0,0,null,null,null,null,null,null,null,2,40,4,15,1,1,2,5,6,15,8,15,null,null,1,5,2,5,1,1,null,null,null,null,null,null,null,null,null,null,null,null,0,10,"0","30","Continuous",0,11,6,16,55,5,0,1.36,{"$error":"#N/A"},{"$error":"#N/A"},{"$error":"#N/A"},{"$error":"#N/A"},{"$error":"#N/A"},{"$error":"#N/A"},{"$error":"#N/A"},{"$error":"#N/A"},{"$error":"#N/A"},{"$error":"#N/A"}]
["Victorian Riverina","VRiv","Plains Grassland","Victorian RiverinaPlains Grassland","VRiv0132",0,0,0,null,null,null,null,null,null,null,null,null,2,5,null,null,3,5,10,20,3,5,1,5,1,5,10,30,2,5,null,null,null,null,null,null,null,null,null,null,null,null,0,10,"0","20","Episodic",5,10,2,16,5,10,0,1.36,1.36,132,"En","Endangered",5,"y",0,"VRiv0132","grasslands","Other grassland vegetation"]
["Victorian Riverina","VRiv","Plains Grassy Wetland","Victorian RiverinaPlains Grassy Wetland","VRiv0125",0,0,0,null,null,null,null,null,null,null,null,null,null,null,null,null,5,5,11,20,6,10,2,5,null,null,7,20,3,30,null,null,null,null,null,null,null,null,null,null,null,null,0,10,null,null,"Episodic",5,7,null,22,null,10,50,1.36,1.36,125,"En","Endangered",6,"y",0,"VRiv0125","wetlands","Non-woody wetland vegetation"]
["Victorian Riverina","VRiv","Plains Grassy Woodland","Victorian RiverinaPlains Grassy Woodland","VRiv0055",null,null,null,null,null,null,null,null,null,null,null,null,null,null,null,null,null,null,null,null,null,null,null,null,null,null,null,null,null,null,null,null,null,null,null,null,null,null,null,null,null,null,null,null,null,null,null,null,0,null,null,null,null,0,1,1,55,"En","Endangered",1,0,0,"VRiv0055","Forest/Woodland","Woody vegetation"]
["Victorian Riverina","VRiv","Plains Grassy Woodland","Victorian RiverinaPlains Grassy Woodland","VRiv0055_61",80,10,15,10,0,5,1,5,null,null,3,10,2,1,1,1,3,5,8,15,3,5,2,5,null,null,12,45,2,5,null,null,null,null,null,null,null,null,null,null,null,null,0,10,"0","10","Continuous",0,13,6,14,16,10,100,1,{"$error":"#N/A"},{"$error":"#N/A"},{"$error":"#N/A"},{"$error":"#N/A"},{"$error":"#N/A"},{"$error":"#N/A"},{"$error":"#N/A"},{"$error":"#N/A"},{"$error":"#N/A"},{"$error":"#N/A"}]
["Victorian Riverina","VRiv","Plains Saltmarsh","Victorian RiverinaPlains Saltmarsh","VRiv0888",0,0,0,null,0,5,null,null,null,null,null,null,1,10,1,5,null,null,1,5,2,10,null,null,null,null,1,5,2,25,null,null,null,null,null,null,null,null,null,null,null,null,0,10,"0","10","Continuous",0,9,1,3,10,10,0,1.36,1.36,888,"En","Endangered",5,0,0,"VRiv0888","grasslands","Other grassland vegetation"]
["Victorian Riverina","VRiv","Plains Savannah","Victorian RiverinaPlains Savannah","VRiv0826",0,0,0,null,null,null,null,null,null,null,null,null,2,5,null,null,3,5,6,20,3,10,1,5,1,5,5,35,2,5,null,null,null,null,null,null,null,null,null,null,null,null,0,10,"0","25","Continuous",0,10,2,12,5,5,0,1,1,826,"En","Endangered",1,0,0,"VRiv0826","Forest/Woodland","Woody vegetation"]
["Victorian Riverina","VRiv","Plains Woodland","Victorian RiverinaPlains Woodland","VRiv0803",70,15,15,15,0,5,null,null,null,null,2,1,1,1,null,null,1,5,11,25,2,5,1,5,null,null,15,45,2,5,null,null,null,null,null,null,null,null,null,null,null,null,0,10,null,null,"Continuous",0,10,3,14,2,10,100,1,1,803,"En","Endangered",1,0,0,"VRiv0803","Forest/Woodland","Woody vegetation"]
["Victorian Riverina","VRiv","Red Gum Swamp","Victorian RiverinaRed Gum Swamp","VRiv0292",80,10,15,10,0,5,1,10,null,null,null,null,null,null,null,null,null,null,1,15,null,null,2,5,null,null,2,10,2,40,null,null,null,null,null,null,null,null,null,null,null,null,0,10,"0","0","Episodic",5,8,1,1,10,20,150,1,1,292,"Vu","Vulnerable",1,0,0,"VRiv0292","Forest/Woodland","Woody vegetation"]
["Victorian Riverina","VRiv","Ridged Plains Mallee","Victorian RiverinaRidged Plains Mallee","VRiv0096",40,15,10,10,0,5,null,null,null,null,3,5,3,10,1,1,2,5,5,10,5,15,1,5,1,1,3,20,1,1,null,null,null,null,null,null,null,null,null,null,null,null,0,10,"0","20","Continuous",0,13,6,12,15,5,50,1,1,96,"En","Endangered",1,0,"y","VRiv0096","Forest/Woodland","Woody vegetation"]
["Victorian Riverina","VRiv","Riparian Forest","Victorian RiverinaRiparian Forest","VRiv0018",80,20,30,40,0,5,3,15,null,null,5,20,1,1,1,1,2,5,11,20,2,5,4,15,2,5,4,10,2,5,null,null,null,null,4,15,"1","5",null,null,2,5,0,20,null,null,"Continuous",0,16,9,15,36,50,300,1,1,18,"D","Depleted",1,0,0,"VRiv0018","Forest/Woodland","Woody vegetation"]
["Victorian Riverina","VRiv","Riparian Shrubland","Victorian RiverinaRiparian Shrubland","VRiv0019",0,0,0,20,null,null,null,null,null,null,4,5,1,1,null,null,5,5,8,10,3,5,3,5,2,1,8,10,4,5,null,null,null,null,1,1,null,null,null,null,null,null,0,20,null,null,"Continuous",0,11,5,16,6,10,100,1.25,1.25,19,"D","Depleted",3,0,0,"VRiv0019","scrubs/shrublands/mallee without logs","Woody vegetation"]
["Victorian Riverina","VRiv","Riparian Woodland","Victorian RiverinaRiparian Woodland","VRiv0641",80,15,15,10,0,5,2,10,null,null,2,10,null,null,null,null,4,10,5,10,1,1,3,10,null,null,4,30,2,5,null,null,null,null,null,null,null,null,null,null,1,5,0,10,null,null,"Continuous",0,11,4,10,20,30,200,1,1,641,"En","Endangered",1,0,0,"VRiv0641","Forest/Woodland","Woody vegetation"]
["Victorian Riverina","VRiv","Riverina Plains Grassy Woodland (syn. Plain","Victorian RiverinaRiverina Plains Grassy Woodland (syn. Plain","VRiv0055_62",70,15,15,15,0,5,null,null,null,null,2,5,1,1,null,null,1,5,11,25,2,5,1,5,null,null,15,45,2,5,null,null,null,null,null,null,null,null,null,null,null,null,0,10,null,null,"Continuous",0,10,3,14,6,10,100,1,{"$error":"#N/A"},{"$error":"#N/A"},{"$error":"#N/A"},{"$error":"#N/A"},{"$error":"#N/A"},{"$error":"#N/A"},{"$error":"#N/A"},{"$error":"#N/A"},{"$error":"#N/A"},{"$error":"#N/A"}]
["Victorian Riverina","VRiv","Riverine Chenopod Woodland","Victorian RiverinaRiverine Chenopod Woodland","VRiv0103",50,5,15,10,0,5,1,5,null,null,3,30,5,25,1,1,null,null,5,5,5,10,null,null,null,null,2,5,null,null,null,null,null,null,null,null,null,null,null,null,null,null,null,null,"0","10","Continuous",0,9,9,10,60,5,50,1,1,103,"Vu","Vulnerable",1,0,0,"VRiv0103","Forest/Woodland","Woody vegetation"]
["Victorian Riverina","VRiv","Riverine Escarpment Scrub","Victorian RiverinaRiverine Escarpment Scrub","VRiv0082",0,0,10,30,0,5,null,null,null,null,8,30,2,1,1,1,2,5,12,20,3,5,4,15,null,null,3,10,2,5,null,null,null,null,3,10,null,null,null,null,1,5,0,10,null,null,"Continuous",0,13,10,17,31,40,50,1.25,1.25,82,"En","Endangered",3,0,0,"VRiv0082","scrubs/shrublands/mallee without logs","Woody vegetation"]
["Victorian Riverina","VRiv","Riverine Grassy Woodland","Victorian RiverinaRiverine Grassy Woodland","VRiv0295",80,15,20,20,0,5,1,5,null,null,null,null,1,1,null,null,null,null,2,1,2,1,2,5,null,null,5,20,2,20,null,null,null,null,null,null,null,null,null,null,null,null,0,10,null,null,"Continuous",0,9,2,4,6,10,200,1,1,295,"Vu","Vulnerable",1,0,0,"VRiv0295","Forest/Woodland","Woody vegetation"]
["Victorian Riverina","VRiv","Riverine Swamp Forest","Victorian RiverinaRiverine Swamp Forest","VRiv0814",90,20,25,30,0,5,null,null,null,null,null,null,null,null,null,null,2,5,6,15,null,null,null,null,1,5,1,5,2,30,null,null,null,null,null,null,null,null,null,null,null,null,null,null,null,null,"Continuous",0,6,null,8,null,20,200,1,1,814,"D","Depleted",1,0,0,"VRiv0814","Forest/Woodland","Woody vegetation"]
["Victorian Riverina","VRiv","Riverine Swampy Woodland","Victorian RiverinaRiverine Swampy Woodland","VRiv0815",70,15,15,20,0,5,null,null,null,null,null,null,null,null,null,null,2,5,3,10,1,5,3,10,null,null,2,10,3,20,null,null,null,null,null,null,null,null,null,null,null,null,null,null,null,null,"Episodic",5,7,null,6,null,10,100,1,1,815,"Vu","Vulnerable",1,0,0,"VRiv0815","Forest/Woodland","Woody vegetation"]
["Victorian Riverina","VRiv","Rocky Outcrop Shrubland","Victorian RiverinaRocky Outcrop Shrubland","VRiv0028",0,0,0,null,null,null,null,null,null,null,5,25,2,5,null,null,2,5,5,5,1,1,2,5,null,null,4,10,null,null,null,null,null,null,2,5,null,null,null,null,null,null,0,20,"0","10","Continuous",0,10,7,8,30,40,0,1.36,1.36,28,"Vu","Vulnerable",4,0,0,"VRiv0028","heathlands","Woody vegetation"]
["Victorian Riverina","VRiv","Rushy Riverine Swamp","Victorian RiverinaRushy Riverine Swamp","VRiv0804",null,0,0,null,null,null,null,null,null,null,null,null,null,null,null,null,null,null,null,null,null,null,null,null,null,null,null,null,null,null,null,null,null,null,null,null,null,null,null,null,null,null,null,null,null,null,null,0,0,null,null,null,0,0,1.36,1.36,804,"D","Depleted",6,0,0,"VRiv0804","wetlands","Non-woody wetland vegetation"]
["Victorian Riverina","VRiv","Samphire Shrubland","Victorian RiverinaSamphire Shrubland","VRiv0101",0,0,0,null,null,null,null,null,null,null,null,null,4,20,null,null,null,null,7,5,3,5,null,null,null,null,2,1,2,1,null,null,null,null,null,null,null,null,null,null,null,null,null,null,null,null,"Continuous",0,5,4,10,20,0,0,1.36,1.36,101,"LC","Least Concern",5,0,0,"VRiv0101","grasslands","Other grassland vegetation"]
["Victorian Riverina","VRiv","Sand Ridge Woodland","Victorian RiverinaSand Ridge Woodland","VRiv0264",70,15,15,15,0,5,1,5,null,null,4,20,3,10,2,5,2,5,10,15,5,5,3,10,null,null,8,15,null,null,null,null,null,null,1,5,null,null,null,null,1,5,0,10,"0","10","Continuous",0,14,8,17,35,10,150,1,1,264,"En","Endangered",1,0,0,"VRiv0264","Forest/Woodland","Woody vegetation"]
["Victorian Riverina","VRiv","Sandstone Ridge Shrubland","Victorian RiverinaSandstone Ridge Shrubland","VRiv0093",0,0,0,null,null,null,null,null,null,null,9,30,5,10,1,1,1,1,6,15,null,null,null,null,null,null,3,5,null,null,null,null,null,null,null,null,null,null,null,null,null,null,0,20,"0","20","Episodic",30,8,14,7,40,20,0,1.1499999999999999,1.1499999999999999,93,"Vu","Vulnerable",2,0,0,"VRiv0093","scrubs/shrublands/mallee with logs","Woody vegetation"]
["Victorian Riverina","VRiv","Sedgy Riverine Forest","Victorian RiverinaSedgy Riverine Forest","VRiv0816",90,20,25,30,0,5,1,5,null,null,null,null,null,null,null,null,2,5,7,15,3,10,2,10,null,null,4,5,3,20,null,null,null,null,null,null,null,null,null,null,null,null,0,10,null,null,"Continuous",0,9,1,12,5,10,200,1,1,816,"Vu","Vulnerable",1,0,0,"VRiv0816","Forest/Woodland","Woody vegetation"]
["Victorian Riverina","VRiv","Semi-arid Chenopod Woodland","Victorian RiverinaSemi-arid Chenopod Woodland","VRiv0098",40,15,12,15,0,5,3,10,null,null,2,40,4,15,1,1,2,5,6,15,8,15,null,null,1,5,2,5,1,1,null,null,null,null,null,null,null,null,null,null,null,null,0,10,"0","30","Continuous",0,13,9,16,65,15,50,1,1,98,"En","Endangered",1,0,0,"VRiv0098","Forest/Woodland","Woody vegetation"]
["Victorian Riverina","VRiv","Semi-arid Woodland","Victorian RiverinaSemi-arid Woodland","VRiv0097",40,20,12,20,0,5,null,null,null,null,5,15,5,20,null,null,2,5,7,5,2,5,null,null,null,null,2,10,1,1,null,null,null,null,null,null,null,null,null,null,null,null,0,10,"0","20","Continuous",0,10,10,11,35,20,200,1,1,97,"En","Endangered",1,0,"y","VRiv0097","Forest/Woodland","Woody vegetation"]
["Victorian Riverina","VRiv","Shallow Sands Woodland","Victorian RiverinaShallow Sands Woodland","VRiv0882",70,15,15,15,0,5,1,5,null,null,4,15,3,10,1,5,null,null,10,20,2,5,1,1,null,null,13,30,3,5,null,null,null,null,null,null,null,null,null,null,null,null,0,10,"0","10","Continuous",0,12,8,12,30,20,150,1,1,882,"En","Endangered",1,0,0,"VRiv0882","Forest/Woodland","Woody vegetation"]
["Victorian Riverina","VRiv","Shrubby Dry Forest","Victorian RiverinaShrubby Dry Forest","VRiv0021",70,20,25,30,0,5,2,10,null,null,8,15,3,5,2,5,2,1,7,5,2,1,1,1,1,1,6,10,null,null,null,null,null,null,2,5,null,null,null,null,2,1,0,10,"0","10","Episodic",20,15,13,11,30,20,200,1,1,21,"Vu","Vulnerable",1,0,0,"VRiv0021","Forest/Woodland","Woody vegetation"]
["Victorian Riverina","VRiv","Shrubby Granitic-outwash Grassy Woodland","Victorian RiverinaShrubby Granitic-outwash Grassy Woodland","VRiv0175_62",70,15,15,15,0,5,2,10,null,null,2,5,7,15,1,1,null,null,8,10,null,null,1,5,null,null,10,20,5,10,null,null,null,null,1,1,null,null,null,null,1,1,0,10,"0","10","Continuous",0,13,11,8,30,20,150,1,{"$error":"#N/A"},{"$error":"#N/A"},{"$error":"#N/A"},{"$error":"#N/A"},{"$error":"#N/A"},{"$error":"#N/A"},{"$error":"#N/A"},{"$error":"#N/A"},{"$error":"#N/A"},{"$error":"#N/A"}]
["Victorian Riverina","VRiv","Spike-sedge Wetland","Victorian RiverinaSpike-sedge Wetland","VRiv0819",0,0,0,null,null,null,null,null,null,null,null,null,null,null,null,null,null,null,2,5,2,5,null,null,null,null,2,5,2,60,null,null,null,null,null,null,null,null,null,null,null,null,null,null,null,null,"Episodic",5,4,null,4,null,20,0,1.36,1.36,819,"Vu","Vulnerable",6,0,0,"VRiv0819","wetlands","Non-woody wetland vegetation"]
["Victorian Riverina","VRiv","Spring Soak Woodland","Victorian RiverinaSpring Soak Woodland","VRiv0080",50,5,10,10,0,5,null,null,null,null,2,5,null,null,null,null,2,1,6,10,3,10,2,10,3,5,9,35,1,5,null,null,null,null,null,null,null,null,null,null,null,null,0,20,null,null,"Continuous",0,10,2,11,5,20,50,1,1,80,"Vu","Vulnerable",1,0,0,"VRiv0080","Forest/Woodland","Woody vegetation"]
["Victorian Riverina","VRiv","Swampy Riparian Woodland","Victorian RiverinaSwampy Riparian Woodland","VRiv0083",null,null,null,null,null,null,null,null,null,null,null,null,null,null,null,null,null,null,null,null,null,null,null,null,null,null,null,null,null,null,null,null,null,null,null,null,null,null,null,null,null,null,null,null,null,null,null,null,0,null,null,null,null,0,1,1,83,"En","Endangered",1,0,0,"VRiv0083","Forest/Woodland","Woody vegetation"]
["Victorian Riverina","VRiv","Swampy Woodland","Victorian RiverinaSwampy Woodland","VRiv0937",null,0,0,null,null,null,null,null,null,null,null,null,null,null,null,null,null,null,null,null,null,null,null,null,null,null,null,null,null,null,null,null,null,null,null,null,null,null,null,null,null,null,null,null,null,null,null,0,0,null,null,null,0,0,1,1,937,"En","Endangered",1,0,0,"VRiv0937","Forest/Woodland","Woody vegetation"]
["Victorian Riverina","VRiv","Tall Marsh","Victorian RiverinaTall Marsh","VRiv0821",0,0,0,null,null,null,null,null,null,null,null,null,null,null,null,null,null,null,6,20,3,10,1,10,3,40,null,null,2,10,null,null,null,null,null,null,null,null,null,null,null,null,null,null,null,null,"Episodic",1,5,null,9,null,10,0,1.36,1.36,821,"D","Depleted",6,0,0,"VRiv0821","wetlands","Non-woody wetland vegetation"]
["Victorian Riverina","VRiv","Treed Plains Savannah","Victorian RiverinaTreed Plains Savannah","VRiv0826_61",40,5,10,10,0,5,null,null,null,null,null,null,2,5,null,null,3,5,6,20,3,10,1,5,1,5,5,35,2,5,null,null,null,null,null,null,null,null,null,null,null,null,0,10,"0","25","Continuous",0,11,2,12,5,5,50,1,{"$error":"#N/A"},{"$error":"#N/A"},{"$error":"#N/A"},{"$error":"#N/A"},{"$error":"#N/A"},{"$error":"#N/A"},{"$error":"#N/A"},{"$error":"#N/A"},{"$error":"#N/A"},{"$error":"#N/A"}]
["Victorian Riverina","VRiv","Treed Sandstone Ridge Shrubland","Victorian RiverinaTreed Sandstone Ridge Shrubland","VRiv0093_61",0,0,3,30,null,null,null,null,null,null,9,30,5,10,1,1,1,1,6,15,null,null,null,null,null,null,3,5,null,null,null,null,null,null,null,null,null,null,null,null,null,null,0,20,"0","20","Episodic",30,8,14,7,40,20,50,1,{"$error":"#N/A"},{"$error":"#N/A"},{"$error":"#N/A"},{"$error":"#N/A"},{"$error":"#N/A"},{"$error":"#N/A"},{"$error":"#N/A"},{"$error":"#N/A"},{"$error":"#N/A"},{"$error":"#N/A"}]
["Victorian Riverina","VRiv","Valley Grassy Forest","Victorian RiverinaValley Grassy Forest","VRiv0047",70,20,20,20,0,5,3,10,null,null,3,10,3,5,null,null,1,1,9,20,3,5,1,1,null,null,12,25,1,5,null,null,null,null,null,null,null,null,null,null,null,null,0,20,null,null,"Continuous",0,11,9,13,25,20,200,1,1,47,"Vu","Vulnerable",1,0,0,"VRiv0047","Forest/Woodland","Woody vegetation"]
["Victorian Riverina","VRiv","Valley Heathy Forest","Victorian RiverinaValley Heathy Forest","VRiv0127",70,20,15,30,0,5,2,10,null,null,7,15,5,5,2,1,null,null,6,10,3,5,3,5,2,20,6,15,1,1,null,null,null,null,1,1,null,null,null,null,3,5,0,10,null,null,"Episodic",30,14,14,9,30,40,200,1,1,127,"En","Endangered",1,0,0,"VRiv0127","Forest/Woodland","Woody vegetation"]
["Victorian Riverina","VRiv","Wetland Formation","Victorian RiverinaWetland Formation","VRiv0074",null,null,0,null,null,null,null,null,null,null,null,null,null,null,null,null,null,null,null,null,null,null,null,null,null,null,null,null,null,null,null,null,null,null,null,null,null,null,null,null,null,null,null,null,null,null,null,5,0,null,null,null,null,0,1.36,1.36,74,"En","Endangered",6,0,0,"VRiv0074","wetlands","Non-woody wetland vegetation"]
["Victorian Riverina","VRiv","Woorinen Mallee","Victorian RiverinaWoorinen Mallee","VRiv0824",15,30,12,25,null,null,null,null,null,null,6,10,6,20,null,null,null,null,6,10,7,10,null,null,null,null,1,1,null,null,null,null,null,null,null,null,null,null,null,null,null,null,0,10,"0","15","Continuous",0,7,12,13,30,20,200,1,1,824,"Vu","Vulnerable",1,0,"y","VRiv0824","Forest/Woodland","Woody vegetation"]
["Victorian Volcanic Plain","VVP_","Alluvial Terraces Herb-rich Woodland","Victorian Volcanic PlainAlluvial Terraces Herb-rich Woodland","VVP_0067",70,10,15,15,0,5,1,10,null,null,5,15,4,5,2,5,2,5,15,15,8,10,2,5,null,null,10,15,4,10,null,null,null,null,null,null,null,null,null,null,null,null,0,10,"0","10","Continuous",0,13,10,25,30,10,150,1,1,67,"En","Endangered",1,0,0,"VVP_0067","Forest/Woodland","Woody vegetation"]
["Victorian Volcanic Plain","VVP_","Aquatic Herbland","Victorian Volcanic PlainAquatic Herbland","VVP_0653",0,0,0,null,null,null,null,null,null,null,null,null,null,null,null,null,2,10,5,40,2,10,null,null,1,5,4,10,2,10,null,null,null,null,null,null,null,null,null,null,null,null,null,null,null,null,"Episodic",5,6,null,9,null,10,0,1.36,1.36,653,"En","Endangered",6,0,0,"VVP_0653","wetlands","Non-woody wetland vegetation"]
["Victorian Volcanic Plain","VVP_","Basalt Creekline Shrubby Woodland","Victorian Volcanic PlainBasalt Creekline Shrubby Woodland","VVP_0705",70,10,10,10,0,5,1,10,null,null,4,15,null,null,null,null,2,5,8,15,5,10,2,15,null,null,7,20,2,10,null,null,null,null,null,null,null,null,null,null,null,null,0,10,null,null,"Continuous",0,10,5,15,25,20,200,1,1,705,"En","Endangered",1,0,0,"VVP_0705","Forest/Woodland","Woody vegetation"]
["Victorian Volcanic Plain","VVP_","Basalt Shrubby Woodland","Victorian Volcanic PlainBasalt Shrubby Woodland","VVP_0642",70,15,15,15,0,5,2,10,null,null,2,5,null,null,2,1,2,1,10,15,5,10,3,5,1,5,10,25,3,10,null,null,null,null,1,15,null,null,null,null,null,null,0,10,"0","10","Continuous",0,14,4,17,15,20,150,1,1,642,"En","Endangered",1,0,0,"VVP_0642","Forest/Woodland","Woody vegetation"]
["Victorian Volcanic Plain","VVP_","Berm Grassy Shrubland","Victorian Volcanic PlainBerm Grassy Shrubland","VVP_0311",0,0,0,null,null,null,null,null,null,null,3,20,1,5,null,null,2,5,2,10,2,5,1,1,null,null,2,25,2,10,null,null,null,null,null,null,null,null,null,null,null,null,null,null,null,null,"Continuous",0,8,4,6,25,10,0,1.36,{"$error":"#N/A"},{"$error":"#N/A"},{"$error":"#N/A"},{"$error":"#N/A"},{"$error":"#N/A"},{"$error":"#N/A"},{"$error":"#N/A"},{"$error":"#N/A"},{"$error":"#N/A"},{"$error":"#N/A"}]
["Victorian Volcanic Plain","VVP_","Box Ironbark Forest","Victorian Volcanic PlainBox Ironbark Forest","VVP_0061",70,15,20,20,0,5,null,null,null,null,5,20,2,5,null,null,2,1,8,20,2,5,2,5,1,1,8,15,2,5,null,null,null,null,null,null,null,null,"1","0",1,1,0,10,"0","10","Continuous",0,14,7,12,25,20,200,1,1,61,"D","Depleted",1,0,0,"VVP_0061","Forest/Woodland","Woody vegetation"]
["Victorian Volcanic Plain","VVP_","Brackish Grassland","Victorian Volcanic PlainBrackish Grassland","VVP_0934",0,0,0,null,null,null,null,null,null,null,null,null,null,null,null,null,1,1,3,5,5,5,2,20,null,null,4,20,1,10,null,null,null,null,null,null,null,null,null,null,null,null,0,10,null,null,"Continuous",0,7,null,9,null,10,0,1.36,1.36,934,"En","Endangered",5,0,0,"VVP_0934","grasslands","Other grassland vegetation"]
["Victorian Volcanic Plain","VVP_","Brackish Wetland","Victorian Volcanic PlainBrackish Wetland","VVP_0656",0,0,0,null,null,null,null,null,null,null,null,null,null,null,null,null,1,5,3,15,3,10,1,10,2,10,2,5,3,15,null,null,null,null,null,null,null,null,null,null,1,1,null,null,"0","10","Episodic",5,9,null,7,null,10,0,1.36,1.36,656,"En","Endangered",6,0,0,"VVP_0656","wetlands","Non-woody wetland vegetation"]
["Victorian Volcanic Plain","VVP_","Cane Grass Wetland","Victorian Volcanic PlainCane Grass Wetland","VVP_0291",0,0,0,null,null,null,null,null,null,null,null,null,null,null,null,null,null,null,null,null,2,10,null,null,null,null,null,null,2,40,null,null,null,null,null,null,null,null,null,null,null,null,null,null,null,null,"Episodic",5,2,null,2,null,10,0,1.36,1.36,291,"Vu","Vulnerable",6,0,0,"VVP_0291","wetlands","Non-woody wetland vegetation"]
["Victorian Volcanic Plain","VVP_","Cinder Cone Woodland","Victorian Volcanic PlainCinder Cone Woodland","VVP_0644",70,15,15,15,0,5,1,5,null,null,2,10,null,null,null,null,2,5,5,10,1,1,1,20,null,null,2,5,1,1,null,null,null,null,2,20,null,null,null,null,1,1,0,10,null,null,"Continuous",0,12,3,8,15,20,100,1,1,644,"En","Endangered",1,0,0,"VVP_0644","Forest/Woodland","Woody vegetation"]
["Victorian Volcanic Plain","VVP_","Coast Banksia Woodland","Victorian Volcanic PlainCoast Banksia Woodland","VVP_0002",50,10,15,15,0,5,null,null,null,null,3,40,1,1,null,null,2,1,3,15,2,10,1,1,null,null,1,5,1,10,null,null,null,null,1,10,null,null,null,null,2,10,0,20,null,null,"Episodic",30,12,4,7,41,40,100,1,{"$error":"#N/A"},{"$error":"#N/A"},{"$error":"#N/A"},{"$error":"#N/A"},{"$error":"#N/A"},{"$error":"#N/A"},{"$error":"#N/A"},{"$error":"#N/A"},{"$error":"#N/A"},{"$error":"#N/A"}]
["Victorian Volcanic Plain","VVP_","Coastal Alkaline Scrub","Victorian Volcanic PlainCoastal Alkaline Scrub","VVP_0858",0,0,8,30,null,null,null,null,null,null,3,20,1,1,1,5,2,1,5,10,2,5,1,5,null,null,4,10,1,5,null,null,null,null,null,null,null,null,null,null,2,1,0,20,null,null,null,0,11,4,9,21,40,50,1.1499999999999999,1.1499999999999999,858,"En","Endangered",2,0,0,"VVP_0858","scrubs/shrublands/mallee with logs","Woody vegetation"]
["Victorian Volcanic Plain","VVP_","Coastal Dune Scrub","Victorian Volcanic PlainCoastal Dune Scrub","VVP_0160",0,0,0,null,null,null,null,null,null,null,5,50,3,5,null,null,2,5,6,10,3,5,2,1,1,5,3,10,2,5,null,null,null,null,1,5,null,null,null,null,2,1,0,10,null,null,"Episodic",30,12,8,11,55,40,50,1.36,{"$error":"#N/A"},{"$error":"#N/A"},{"$error":"#N/A"},{"$error":"#N/A"},{"$error":"#N/A"},{"$error":"#N/A"},{"$error":"#N/A"},{"$error":"#N/A"},{"$error":"#N/A"},{"$error":"#N/A"}]
["Victorian Volcanic Plain","VVP_","Coastal Headland Scrub","Victorian Volcanic PlainCoastal Headland Scrub","VVP_0161",null,null,0,null,null,null,null,null,null,null,null,null,null,null,null,null,null,null,null,null,null,null,null,null,null,null,null,null,null,null,null,null,null,null,null,null,null,null,null,null,null,null,null,null,null,null,null,0,0,null,null,null,null,0,1.36,1.36,161,"Vu","Vulnerable",4,0,0,"VVP_0161","heathlands","Woody vegetation"]
["Victorian Volcanic Plain","VVP_","Coastal Saltmarsh","Victorian Volcanic PlainCoastal Saltmarsh","VVP_0009",0,0,0,null,null,null,null,null,null,null,1,20,2,10,null,null,null,null,2,30,1,1,null,null,null,null,1,5,1,5,null,null,null,null,null,null,null,null,null,null,null,null,null,null,"0","10","Continuous",0,7,3,3,30,10,0,1.36,1.36,9,"Vu","Vulnerable",5,"y",0,"VVP_0009","grasslands","Other grassland vegetation"]
["Victorian Volcanic Plain","VVP_","Coastal Tussock Grassland","Victorian Volcanic PlainCoastal Tussock Grassland","VVP_0163",0,0,0,null,null,null,null,null,null,null,3,10,1,5,null,null,1,10,3,10,2,5,3,10,1,5,4,20,2,10,null,null,null,null,null,null,null,null,null,null,null,null,0,10,null,null,"Continuous",0,10,4,6,15,20,0,1.36,1.36,163,"Vu","Vulnerable",5,0,0,"VVP_0163","grasslands","Other grassland vegetation"]
["Victorian Volcanic Plain","VVP_","Creekline Grassy Woodland","Victorian Volcanic PlainCreekline Grassy Woodland","VVP_0068",80,15,15,15,0,5,2,10,null,null,5,10,1,1,null,null,2,5,6,10,3,5,2,10,1,5,10,25,3,10,null,null,null,null,null,null,null,null,null,null,3,10,0,10,null,null,"Continuous",0,13,8,11,21,40,200,1,1,68,"En","Endangered",1,0,0,"VVP_0068","Forest/Woodland","Woody vegetation"]
["Victorian Volcanic Plain","VVP_","Creekline Herb-rich Woodland","Victorian Volcanic PlainCreekline Herb-rich Woodland","VVP_0164",70,10,0,15,0,5,2,10,null,null,2,10,null,null,1,5,2,5,9,15,1,5,3,20,1,5,5,15,1,5,null,null,null,null,1,5,null,null,null,null,2,1,0,20,null,null,"Continuous",0,14,4,12,20,20,100,1,1,164,"En","Endangered",1,0,0,"VVP_0164","Forest/Woodland","Woody vegetation"]
["Victorian Volcanic Plain","VVP_","Creekline Tussock Grassland","Victorian Volcanic PlainCreekline Tussock Grassland","VVP_0654",0,0,0,null,null,null,null,null,null,null,null,null,null,null,null,null,4,5,8,10,11,10,3,40,null,null,10,10,4,10,null,null,null,null,null,null,null,null,null,null,null,null,0,20,null,null,"Episodic",10,7,null,23,null,10,0,1.36,1.36,654,"En","Endangered",5,"y",0,"VVP_0654","grasslands","Other grassland vegetation"]
["Victorian Volcanic Plain","VVP_","Damp Heath Scrub",{"$f":"CONCATENATE(A1091,C1091)","v":"Victorian Volcanic PlainDamp Heath Scrub"},"VVP_0165",null,null,null,null,null,null,null,null,null,null,null,null,null,null,null,null,null,null,null,null,null,null,null,null,null,null,null,null,null,null,null,null,null,null,null,null,null,null,null,null,null,null,null,null,null,null,null,null,0,null,null,null,null,0,0,1.36,165,"Vu","Vulnerable",4,0,0,"VVP_0165","heathlands","Woody vegetation"]
["Victorian Volcanic Plain","VVP_","Damp Heathland","Victorian Volcanic PlainDamp Heathland","VVP_0710",0,0,0,null,null,null,null,null,null,null,6,30,5,20,2,5,null,null,6,10,2,1,1,5,1,1,4,15,3,20,null,null,null,null,null,null,null,null,null,null,2,5,0,10,"0","10","Episodic",30,12,11,8,50,20,0,1.36,1.36,710,"Vu","Vulnerable",4,0,0,"VVP_0710","heathlands","Woody vegetation"]
["Victorian Volcanic Plain","VVP_","Damp Heathy Woodland","Victorian Volcanic PlainDamp Heathy Woodland","VVP_0793",60,10,10,10,0,5,null,null,null,null,6,40,2,10,2,1,3,5,6,10,4,5,3,5,2,5,11,20,3,15,null,null,null,null,null,null,null,null,null,null,null,null,0,10,null,null,"Episodic",30,12,8,13,50,20,100,1,1,793,"Vu","Vulnerable",1,0,0,"VVP_0793","Forest/Woodland","Woody vegetation"]
["Victorian Volcanic Plain","VVP_","Damp Sands Herb-rich Woodland","Victorian Volcanic PlainDamp Sands Herb-rich Woodland","VVP_0003",70,15,15,15,0,5,3,15,null,null,6,15,3,5,3,5,4,5,15,25,6,5,2,5,1,5,12,15,4,10,null,null,null,null,1,10,null,null,null,null,1,1,0,10,null,null,"Continuous",0,15,12,25,35,40,150,1,1,3,"Vu","Vulnerable",1,0,0,"VVP_0003","Forest/Woodland","Woody vegetation"]
["Victorian Volcanic Plain","VVP_","Deep Freshwater Marsh","Victorian Volcanic PlainDeep Freshwater Marsh","VVP_0681",null,null,0,null,null,null,null,null,null,null,null,null,null,null,null,null,null,null,null,null,null,null,null,null,null,null,null,null,null,null,null,null,null,null,null,null,null,null,null,null,null,null,null,null,null,null,null,5,0,null,null,null,null,0,1.36,1.36,681,"Vu","Vulnerable",6,0,0,"VVP_0681","wetlands","Non-woody wetland vegetation"]
["Victorian Volcanic Plain","VVP_","Escarpment Shrubland","Victorian Volcanic PlainEscarpment Shrubland","VVP_0895",0,0,8,15,null,null,null,null,null,null,3,10,2,5,null,null,3,5,4,10,5,5,1,5,1,5,9,25,3,5,null,null,null,null,1,5,null,null,null,null,1,5,0,10,"0","10","Continuous",0,13,5,12,15,20,50,1.1499999999999999,1.1499999999999999,895,"En","Endangered",1,0,0,"VVP_0895","Forest/Woodland","Woody vegetation"]
["Victorian Volcanic Plain","VVP_","Estuarine Flats Grassland","Victorian Volcanic PlainEstuarine Flats Grassland","VVP_0914",0,0,0,null,null,null,null,null,null,null,2,5,1,5,null,null,1,1,3,15,4,15,2,15,null,null,2,20,3,15,null,null,null,null,null,null,null,null,null,null,null,null,null,null,null,null,"Continuous",0,8,3,8,10,10,0,1.36,1.36,914,"En","Endangered",6,0,0,"VVP_0914","wetlands","Non-woody wetland vegetation"]
["Victorian Volcanic Plain","VVP_","Estuarine Wetland","Victorian Volcanic PlainEstuarine Wetland","VVP_0010",0,0,0,null,null,null,null,null,null,null,1,1,null,null,null,null,3,10,4,10,4,15,1,10,1,25,2,5,1,1,null,null,null,null,null,null,null,null,null,null,1,5,null,null,null,null,"Episodic",5,9,1,11,1,10,0,1.36,1.36,10,"En","Endangered",6,0,0,"VVP_0010","wetlands","Non-woody wetland vegetation"]
["Victorian Volcanic Plain","VVP_","Floodplain Riparian Woodland","Victorian Volcanic PlainFloodplain Riparian Woodland","VVP_0056",80,15,20,20,0,5,1,5,null,null,3,15,null,null,null,null,2,5,4,10,3,10,3,15,1,10,5,15,3,10,null,null,null,null,null,null,null,null,null,null,1,5,0,10,null,null,"Episodic",5,12,4,9,20,40,300,1,1,56,"En","Endangered",1,0,0,"VVP_0056","Forest/Woodland","Woody vegetation"]
["Victorian Volcanic Plain","VVP_","Freshwater Lignum Shrubland","Victorian Volcanic PlainFreshwater Lignum Shrubland","VVP_0657",null,null,0,null,null,null,null,null,null,null,null,null,null,null,null,null,null,null,null,null,null,null,null,null,null,null,null,null,null,null,null,null,null,null,null,null,null,null,null,null,null,null,null,null,null,null,null,0,0,null,null,null,null,0,1.36,1.36,657,"En","Endangered",6,0,0,"VVP_0657","wetlands","Non-woody wetland vegetation"]
["Victorian Volcanic Plain","VVP_","Freshwater Meadow","Victorian Volcanic PlainFreshwater Meadow","VVP_0680",null,null,0,null,null,null,null,null,null,null,null,null,null,null,null,null,null,null,null,null,null,null,null,null,null,null,null,null,null,null,null,null,null,null,null,null,null,null,null,null,null,null,null,null,null,null,null,5,0,null,null,null,null,0,1.36,1.36,680,"En","Endangered",6,0,0,"VVP_0680","wetlands","Non-woody wetland vegetation"]
["Victorian Volcanic Plain","VVP_","Granitic Hills Woodland","Victorian Volcanic PlainGranitic Hills Woodland","VVP_0072",60,15,10,15,0,5,2,10,null,null,5,5,null,null,null,null,4,10,9,15,2,5,null,null,null,null,11,20,2,1,null,null,null,null,2,5,null,null,null,null,2,1,0,10,"0","10","Continuous",0,12,7,15,15,20,150,1,1,72,"En","Endangered",1,0,0,"VVP_0072","Forest/Woodland","Woody vegetation"]
["Victorian Volcanic Plain","VVP_","Grassy Dry Forest","Victorian Volcanic PlainGrassy Dry Forest","VVP_0022",70,20,20,30,0,5,1,5,null,null,3,10,3,5,1,1,3,5,7,20,2,5,1,5,null,null,7,30,1,1,null,null,null,null,1,1,null,null,null,null,1,1,0,10,"0","10","Continuous",0,15,7,12,20,20,200,1,1,22,"D","Depleted",1,0,0,"VVP_0022","Forest/Woodland","Woody vegetation"]
["Victorian Volcanic Plain","VVP_","Grassy Forest","Victorian Volcanic PlainGrassy Forest","VVP_0127",null,0,0,null,null,null,null,null,null,null,null,null,null,null,null,null,null,null,null,null,null,null,null,null,null,null,null,null,null,null,null,null,null,null,null,null,null,null,null,null,null,null,null,null,null,null,null,0,0,null,null,null,0,0,1,1,127,"En","Endangered",1,0,0,"VVP_0127","Forest/Woodland","Woody vegetation"]
["Victorian Volcanic Plain","VVP_","Grassy Riverine Forest","Victorian Volcanic PlainGrassy Riverine Forest","VVP_0104_61",80,5,15,10,0,5,null,null,null,null,1,20,null,null,null,null,2,5,3,15,3,10,1,5,null,null,6,20,3,10,null,null,null,null,null,null,null,null,null,null,null,null,0,10,"0","10","Episodic",10,10,1,8,20,10,50,1,{"$error":"#N/A"},{"$error":"#N/A"},{"$error":"#N/A"},{"$error":"#N/A"},{"$error":"#N/A"},{"$error":"#N/A"},{"$error":"#N/A"},{"$error":"#N/A"},{"$error":"#N/A"},{"$error":"#N/A"}]
["Victorian Volcanic Plain","VVP_","Grassy Woodland","Victorian Volcanic PlainGrassy Woodland","VVP_0175",70,15,15,15,0,5,2,10,null,null,2,10,2,1,2,5,2,5,8,20,3,5,1,1,null,null,8,45,1,5,null,null,null,null,null,null,null,null,null,null,1,1,0,10,null,null,"Continuous",0,13,6,13,21,20,150,1,1,175,"En","Endangered",1,0,0,"VVP_0175","Forest/Woodland","Woody vegetation"]
["Victorian Volcanic Plain","VVP_","Heathy Dry Forest","Victorian Volcanic PlainHeathy Dry Forest","VVP_0020",60,20,20,30,0,5,null,null,null,null,2,15,3,20,null,null,1,1,2,5,2,5,1,1,null,null,4,20,1,1,null,null,null,null,null,null,null,null,null,null,null,null,0,10,"0","10","Episodic",20,11,5,5,35,20,200,1,1,20,"LC","Least Concern",1,0,0,"VVP_0020","Forest/Woodland","Woody vegetation"]
["Victorian Volcanic Plain","VVP_","Heathy Woodland","Victorian Volcanic PlainHeathy Woodland","VVP_0048",60,15,10,15,0,5,1,5,null,null,7,35,9,20,3,5,null,null,8,10,1,1,2,5,1,5,3,5,3,5,null,null,null,null,1,5,null,null,null,null,1,1,0,10,"0","10","Episodic",20,15,17,9,60,40,150,1,1,48,"Vu","Vulnerable",1,0,0,"VVP_0048","Forest/Woodland","Woody vegetation"]
["Victorian Volcanic Plain","VVP_","Heavier-soils Plains Grassland","Victorian Volcanic PlainHeavier-soils Plains Grassland","VVP_0132_61",0,0,0,null,null,null,null,null,null,null,null,null,null,null,null,null,2,5,12,20,4,5,1,5,null,null,13,40,4,5,null,null,null,null,null,null,null,null,null,null,null,null,null,20,null,null,"Episodic",5,7,null,18,null,10,0,1.36,{"$error":"#N/A"},{"$error":"#N/A"},{"$error":"#N/A"},{"$error":"#N/A"},{"$error":"#N/A"},{"$error":"#N/A"},{"$error":"#N/A"},{"$error":"#N/A"},{"$error":"#N/A"},{"$error":"#N/A"}]
["Victorian Volcanic Plain","VVP_","Herb-rich Foothill Forest","Victorian Volcanic PlainHerb-rich Foothill Forest","VVP_0023",70,20,25,40,0,5,2,10,null,null,3,20,1,1,null,null,2,5,6,15,3,5,3,20,1,5,5,10,2,10,null,null,null,null,1,5,null,null,null,null,2,5,0,20,null,null,"Continuous",0,14,6,11,31,40,200,1,1,23,"Vu","Vulnerable",1,0,0,"VVP_0023","Forest/Woodland","Woody vegetation"]
["Victorian Volcanic Plain","VVP_","Hills Herb-rich Woodland","Victorian Volcanic PlainHills Herb-rich Woodland","VVP_0071",70,15,15,15,0,5,1,5,null,null,4,10,2,1,1,1,1,5,4,5,null,null,1,1,null,null,8,25,3,5,null,null,null,null,null,null,null,null,null,null,null,null,0,10,"0","10","Continuous",0,12,7,5,16,20,150,1,1,71,"Vu","Vulnerable",1,0,0,"VVP_0071","Forest/Woodland","Woody vegetation"]
["Victorian Volcanic Plain","VVP_","Lighter-soils Plains Grassland","Victorian Volcanic PlainLighter-soils Plains Grassland","VVP_0132_62",0,0,0,null,null,null,null,null,null,null,null,null,null,null,null,null,2,5,10,20,4,5,null,null,null,null,13,40,4,5,null,null,null,null,null,null,null,null,null,null,null,null,null,20,null,null,"Episodic",5,6,null,16,null,10,0,1.36,{"$error":"#N/A"},{"$error":"#N/A"},{"$error":"#N/A"},{"$error":"#N/A"},{"$error":"#N/A"},{"$error":"#N/A"},{"$error":"#N/A"},{"$error":"#N/A"},{"$error":"#N/A"},{"$error":"#N/A"}]
["Victorian Volcanic Plain","VVP_","Lignum Cane Grass Swamp","Victorian Volcanic PlainLignum Cane Grass Swamp","VVP_0655",0,8,0,null,null,null,null,null,null,null,1,25,null,null,2,10,null,null,null,null,null,null,null,null,null,null,null,null,3,40,null,null,null,null,null,null,null,null,null,null,null,null,null,null,"0","10","Episodic",5,4,1,null,25,10,0,1.36,1.36,655,"En","Endangered",6,0,0,"VVP_0655","wetlands","Non-woody wetland vegetation"]
["Victorian Volcanic Plain","VVP_","Lignum Swamp","Victorian Volcanic PlainLignum Swamp","VVP_0104",0,0,0,0,0,0,null,null,null,null,1,20,null,null,null,null,2,5,3,15,3,10,1,5,null,null,6,20,3,10,null,null,null,null,null,null,null,null,null,null,null,null,0,10,"0","10","Episodic",10,9,1,8,20,10,0,1.36,1.36,104,"En","Endangered",6,0,0,"VVP_0104","wetlands","Non-woody wetland vegetation"]
["Victorian Volcanic Plain","VVP_","Lowland Forest","Victorian Volcanic PlainLowland Forest","VVP_0016",70,20,25,30,0,5,2,10,null,null,6,15,3,5,2,1,2,5,8,20,2,5,2,5,2,10,5,10,1,5,null,null,null,null,1,5,null,null,null,null,2,1,0,10,null,null,"Continuous",0,15,11,12,30,40,200,1,1,16,"LC","Least Concern",1,0,0,"VVP_0016","Forest/Woodland","Woody vegetation"]
["Victorian Volcanic Plain","VVP_","Low-rainfall Plains Grassland","Victorian Volcanic PlainLow-rainfall Plains Grassland","VVP_0132_63",0,0,0,null,null,null,null,null,null,null,null,null,1,5,1,5,2,5,8,20,3,10,1,5,null,null,10,30,2,5,null,null,null,null,null,null,null,null,null,null,null,0,null,20,null,null,"Episodic",5,9,1,13,5,10,0,1.36,{"$error":"#N/A"},{"$error":"#N/A"},{"$error":"#N/A"},{"$error":"#N/A"},{"$error":"#N/A"},{"$error":"#N/A"},{"$error":"#N/A"},{"$error":"#N/A"},{"$error":"#N/A"},{"$error":"#N/A"}]
["Victorian Volcanic Plain","VVP_","Lunette Woodland","Victorian Volcanic PlainLunette Woodland","VVP_0652",80,8,15,10,0,5,1,5,null,null,3,10,2,1,1,1,3,5,8,15,3,5,2,5,null,null,12,45,2,5,null,null,null,null,null,null,null,null,null,null,null,null,0,10,"0","10","Continuous",0,13,6,14,16,10,100,1,1,652,"En","Endangered",1,0,0,"VVP_0652","Forest/Woodland","Woody vegetation"]
["Victorian Volcanic Plain","VVP_","Mangrove Shrubland","Victorian Volcanic PlainMangrove Shrubland","VVP_0140",0,0,0,null,null,null,null,null,null,null,1,40,null,null,null,null,null,null,null,null,null,null,null,null,null,null,null,null,1,5,null,null,null,null,null,null,null,null,null,null,null,null,null,null,null,null,"Continuous",0,2,1,null,40,0,0,1.36,1.36,140,"Vu","Vulnerable",4,0,0,"VVP_0140","heathlands","Woody vegetation"]
["Victorian Volcanic Plain","VVP_","Non-Eucalypt Grassy Woodland","Victorian Volcanic PlainNon-Eucalypt Grassy Woodland","VVP_0175_61",70,15,10,15,0,5,null,null,null,null,2,10,2,1,2,5,null,null,8,20,3,5,1,1,null,null,8,45,1,5,null,null,null,null,null,null,null,null,null,null,1,1,0,10,null,null,"Continuous",0,11,4,11,11,20,150,1,{"$error":"#N/A"},{"$error":"#N/A"},{"$error":"#N/A"},{"$error":"#N/A"},{"$error":"#N/A"},{"$error":"#N/A"},{"$error":"#N/A"},{"$error":"#N/A"},{"$error":"#N/A"},{"$error":"#N/A"}]
["Victorian Volcanic Plain","VVP_","Permanent Open Freshwater","Victorian Volcanic PlainPermanent Open Freshwater","VVP_0682",null,0,0,null,null,null,null,null,null,null,null,null,null,null,null,null,null,null,null,null,null,null,null,null,null,null,null,null,null,null,null,null,null,null,null,null,null,null,null,null,null,null,null,null,null,null,null,0,0,null,null,null,0,0,0,{"$error":"#N/A"},{"$error":"#N/A"},{"$error":"#N/A"},{"$error":"#N/A"},{"$error":"#N/A"},{"$error":"#N/A"},{"$error":"#N/A"},{"$error":"#N/A"},{"$error":"#N/A"},{"$error":"#N/A"}]
["Victorian Volcanic Plain","VVP_","Permanent Saline","Victorian Volcanic PlainPermanent Saline","VVP_0684",null,0,0,null,null,null,null,null,null,null,null,null,null,null,null,null,null,null,null,null,null,null,null,null,null,null,null,null,null,null,null,null,null,null,null,null,null,null,null,null,null,null,null,null,null,null,null,0,0,null,null,null,0,0,0,{"$error":"#N/A"},{"$error":"#N/A"},{"$error":"#N/A"},{"$error":"#N/A"},{"$error":"#N/A"},{"$error":"#N/A"},{"$error":"#N/A"},{"$error":"#N/A"},{"$error":"#N/A"},{"$error":"#N/A"}]
["Victorian Volcanic Plain","VVP_","Plains Grassland","Victorian Volcanic PlainPlains Grassland","VVP_0128",70,20,20,30,0,5,2,10,null,null,3,10,4,5,2,1,3,5,10,15,null,null,1,5,null,null,9,30,null,null,null,null,null,null,null,null,null,null,null,null,2,1,0,10,null,null,"Continuous",0,11,9,13,25,20,200,1,1,128,"En","Endangered",1,0,0,"VVP_0128","Forest/Woodland","Woody vegetation"]
["Victorian Volcanic Plain","VVP_","Plains Grassy Wetland","Victorian Volcanic PlainPlains Grassy Wetland","VVP_0106",null,0,0,null,null,null,null,null,null,null,null,null,null,null,null,null,null,null,null,null,null,null,null,null,null,null,null,null,null,null,null,null,null,null,null,null,null,null,null,null,null,null,null,null,null,null,null,0,0,null,null,null,0,0,0,{"$error":"#N/A"},{"$error":"#N/A"},{"$error":"#N/A"},{"$error":"#N/A"},{"$error":"#N/A"},{"$error":"#N/A"},{"$error":"#N/A"},{"$error":"#N/A"},{"$error":"#N/A"},{"$error":"#N/A"}]
["Victorian Volcanic Plain","VVP_","Plains Grassy Woodland","Victorian Volcanic PlainPlains Grassy Woodland","VVP_0055",null,null,null,null,null,null,null,null,null,null,null,null,null,null,null,null,null,null,null,null,null,null,null,null,null,null,null,null,null,null,null,null,null,null,null,null,null,null,null,null,null,null,null,null,null,null,null,null,0,null,null,null,null,0,1,1,"55_61","En","Endangered",1,0,0,"VVP_0055","Forest/Woodland","Woody vegetation"]
["Victorian Volcanic Plain","VVP_","Plains Grassy Woodland","Victorian Volcanic PlainPlains Grassy Woodland","VVP_0055_61",80,8,15,10,0,5,1,5,null,null,3,10,2,1,1,1,3,5,8,15,3,5,2,5,null,null,12,45,2,5,null,null,null,null,null,null,null,null,null,null,null,null,0,10,"0","10","Continuous",0,13,6,14,16,10,100,1,{"$error":"#N/A"},{"$error":"#N/A"},{"$error":"#N/A"},{"$error":"#N/A"},{"$error":"#N/A"},{"$error":"#N/A"},{"$error":"#N/A"},{"$error":"#N/A"},{"$error":"#N/A"},{"$error":"#N/A"}]
["Victorian Volcanic Plain","VVP_","Plains Grassy Woodland","Victorian Volcanic PlainPlains Grassy Woodland","VVP_0055_63",70,15,15,20,0,5,1,5,null,null,3,10,2,1,1,1,3,5,8,15,3,5,2,5,null,null,12,45,2,5,null,null,null,null,null,null,null,null,null,null,null,null,0,10,"0","10","Continuous",0,13,6,14,16,10,100,1,{"$error":"#N/A"},{"$error":"#N/A"},{"$error":"#N/A"},{"$error":"#N/A"},{"$error":"#N/A"},{"$error":"#N/A"},{"$error":"#N/A"},{"$error":"#N/A"},{"$error":"#N/A"},{"$error":"#N/A"}]
["Victorian Volcanic Plain","VVP_","Plains Sedgy Wetland","Victorian Volcanic PlainPlains Sedgy Wetland","VVP_0647",0,0,0,null,null,null,0,0,null,null,null,null,null,null,null,null,2,5,5,40,5,10,2,5,null,null,4,25,2,5,null,null,null,null,null,null,null,null,null,null,null,null,null,null,null,null,"Episodic",5,7,1,12,5,10,50,1.36,1.36,647,"En","Endangered",6,0,0,"VVP_0647","wetlands","Non-woody wetland vegetation"]
["Victorian Volcanic Plain","VVP_","Plains Sedgy Woodland","Victorian Volcanic PlainPlains Sedgy Woodland","VVP_0283",70,15,15,10,0,5,null,null,null,null,2,5,2,1,null,null,4,15,10,20,2,5,2,1,1,1,13,30,4,20,null,null,null,null,null,null,null,null,null,null,null,null,0,10,null,null,"Continuous",0,11,4,16,6,10,150,1,1,283,"Vu","Vulnerable",1,0,0,"VVP_0283","Forest/Woodland","Woody vegetation"]
["Victorian Volcanic Plain","VVP_","Plains Swampy Woodland","Victorian Volcanic PlainPlains Swampy Woodland","VVP_0651",80,10,15,10,0,5,1,5,null,null,4,15,null,null,null,null,3,5,8,20,5,5,3,30,1,1,7,10,2,5,null,null,null,null,null,null,null,null,null,null,null,null,0,20,null,null,"Continuous",0,11,5,16,20,10,100,1,1,651,"En","Endangered",1,0,0,"VVP_0651","Forest/Woodland","Woody vegetation"]
["Victorian Volcanic Plain","VVP_","Plains Woodland","Victorian Volcanic PlainPlains Woodland","VVP_0803",70,15,15,15,0,5,null,null,null,null,2,5,2,5,1,1,1,1,20,20,4,10,1,1,1,1,16,45,3,5,null,null,null,null,null,null,null,null,null,null,null,null,0,10,"0","10","Continuous",0,13,4,25,10,10,100,1,1,803,"En","Endangered",1,0,0,"VVP_0803","Forest/Woodland","Woody vegetation"]
["Victorian Volcanic Plain","VVP_","Red Gum Swamp","Victorian Volcanic PlainRed Gum Swamp","VVP_0292",80,10,15,15,0,5,null,null,null,null,null,null,null,null,null,null,2,10,7,25,2,1,2,15,null,null,6,20,2,15,null,null,null,null,null,null,null,null,null,null,null,null,null,null,null,null,"Episodic",5,7,null,11,null,10,100,1,1,292,"En","Endangered",1,0,0,"VVP_0292","Forest/Woodland","Woody vegetation"]
["Victorian Volcanic Plain","VVP_","Riparian Forest","Victorian Volcanic PlainRiparian Forest","VVP_0018",80,20,30,40,0,5,3,20,null,null,4,20,null,null,null,null,1,5,3,10,1,1,2,20,null,null,3,15,1,5,null,null,null,null,2,10,null,null,null,null,2,5,0,20,null,null,"Continuous",0,12,7,5,40,50,300,1,1,18,"Vu","Vulnerable",1,0,0,"VVP_0018","Forest/Woodland","Woody vegetation"]
["Victorian Volcanic Plain","VVP_","Riparian Scrub","Victorian Volcanic PlainRiparian Scrub","VVP_0191",0,0,6,60,null,null,null,null,null,null,3,20,null,null,null,null,4,10,8,10,4,5,3,20,2,5,5,10,3,10,null,null,null,null,null,null,null,null,null,null,null,null,0,20,null,null,"Continuous",0,9,3,16,20,40,0,1.25,1.25,191,"En","Endangered",3,0,0,"VVP_0191","scrubs/shrublands/mallee without logs","Woody vegetation"]
["Victorian Volcanic Plain","VVP_","Riparian Woodland","Victorian Volcanic PlainRiparian Woodland","VVP_0641",80,15,15,20,0,5,2,10,null,null,2,10,1,5,null,null,4,15,5,10,1,5,3,10,1,5,4,20,2,5,null,null,null,null,null,null,null,null,null,null,1,5,0,10,null,null,"Continuous",0,13,5,10,25,30,200,1,1,641,"En","Endangered",1,0,0,"VVP_0641","Forest/Woodland","Woody vegetation"]
["Victorian Volcanic Plain","VVP_","Riverina Plains Grassy Woodland (syn. EVC 8","Victorian Volcanic PlainRiverina Plains Grassy Woodland (syn. EVC 8","VVP_0055_62",70,15,15,15,0,5,null,null,null,null,2,5,2,5,1,1,1,1,20,20,4,10,1,1,null,null,16,45,3,5,null,null,null,null,null,null,null,null,null,null,null,null,0,10,"0","10","Continuous",0,12,4,25,10,10,100,1,{"$error":"#N/A"},{"$error":"#N/A"},{"$error":"#N/A"},{"$error":"#N/A"},{"$error":"#N/A"},{"$error":"#N/A"},{"$error":"#N/A"},{"$error":"#N/A"},{"$error":"#N/A"},{"$error":"#N/A"}]
["Victorian Volcanic Plain","VVP_","Rocky Chenopod Woodland","Victorian Volcanic PlainRocky Chenopod Woodland","VVP_0064",40,10,8,10,null,null,3,5,null,null,6,25,2,5,null,null,null,null,3,10,1,1,null,null,null,null,3,5,null,null,null,null,null,null,null,null,null,null,null,null,1,1,0,10,"0","20","Continuous",0,9,11,4,35,10,100,1,1,64,"Vu","Vulnerable",1,0,0,"VVP_0064","Forest/Woodland","Woody vegetation"]
["Victorian Volcanic Plain","VVP_","Sand Forest","Victorian Volcanic PlainSand Forest","VVP_0134",70,15,20,30,0,5,1,5,null,null,3,5,1,5,2,5,null,null,2,5,null,null,1,1,null,null,7,15,2,1,null,null,null,null,1,50,null,null,null,null,null,null,0,10,null,null,"Continuous",0,11,5,2,15,40,150,1,1,134,"En","Endangered",1,0,0,"VVP_0134","Forest/Woodland","Woody vegetation"]
["Victorian Volcanic Plain","VVP_","Sand Heathland","Victorian Volcanic PlainSand Heathland","VVP_0006",0,0,0,null,null,null,null,null,null,null,6,30,8,20,3,5,null,null,3,5,2,5,2,10,1,5,6,15,1,1,null,null,null,null,1,1,null,null,null,null,3,5,0,10,"0","10","Episodic",30,13,14,5,50,20,150,1.36,1.36,6,"LC","Least Concern",4,0,0,"VVP_0006","heathlands","Woody vegetation"]
["Victorian Volcanic Plain","VVP_","Scoria Cone Woodland","Victorian Volcanic PlainScoria Cone Woodland","VVP_0894",70,15,15,15,0,5,1,5,null,null,2,10,null,null,null,null,3,5,6,10,3,5,1,15,null,null,4,15,1,5,null,null,null,null,2,20,null,null,null,null,null,null,0,10,"0","10","Continuous",0,12,3,12,15,20,100,1,1,894,"En","Endangered",1,0,0,"VVP_0894","Forest/Woodland","Woody vegetation"]
["Victorian Volcanic Plain","VVP_","Seasonally Inundated Shrubby Woodland","Victorian Volcanic PlainSeasonally Inundated Shrubby Woodland","VVP_0195",70,15,15,15,0,5,1,5,null,null,8,40,2,10,1,1,null,null,5,10,4,10,2,5,null,null,4,10,2,10,null,null,null,null,null,null,null,null,null,null,null,null,0,10,"0","10","Continuous",0,12,11,9,55,20,150,1,1,195,"En","Endangered",1,0,0,"VVP_0195","Forest/Woodland","Woody vegetation"]
["Victorian Volcanic Plain","VVP_","Sedge Wetland","Victorian Volcanic PlainSedge Wetland","VVP_0136",0,0,0,null,null,null,null,null,null,null,null,null,null,null,null,null,1,5,null,null,1,1,2,20,1,20,null,null,null,null,null,null,null,null,null,null,null,null,null,null,null,null,0,10,null,null,"Episodic",5,5,null,2,null,10,0,1.36,1.36,136,"Vu","Vulnerable",6,0,0,"VVP_0136","wetlands","Non-woody wetland vegetation"]
["Victorian Volcanic Plain","VVP_","Sedgy Riparian Woodland","Victorian Volcanic PlainSedgy Riparian Woodland","VVP_0198",70,15,15,20,0,5,1,10,null,null,5,20,null,null,null,null,null,null,3,10,null,null,5,30,null,null,2,5,2,5,null,null,null,null,2,10,null,null,null,null,null,null,0,20,null,null,"Continuous",0,9,6,3,30,20,200,1,1,198,"Vu","Vulnerable",1,0,0,"VVP_0198","Forest/Woodland","Woody vegetation"]
["Victorian Volcanic Plain","VVP_","Shallow Freshwater Marsh","Victorian Volcanic PlainShallow Freshwater Marsh","VVP_0200",null,null,0,null,null,null,null,null,null,null,null,null,null,null,null,null,null,null,null,null,null,null,null,null,null,null,null,null,null,null,null,null,null,null,null,null,null,null,null,null,null,null,null,null,null,null,null,5,0,null,null,null,null,0,1.36,1.36,200,"En","Endangered",6,0,0,"VVP_0200","wetlands","Non-woody wetland vegetation"]
["Victorian Volcanic Plain","VVP_","Shrubby Dry Forest","Victorian Volcanic PlainShrubby Dry Forest","VVP_0021",70,20,25,30,0,5,1,5,null,null,4,20,3,10,1,1,1,1,2,5,null,null,1,15,null,null,2,10,null,null,null,null,null,null,null,null,null,null,null,null,null,null,0,10,"0","10","Episodic",20,11,8,3,35,20,200,1,1,21,"LC","Least Concern",1,0,0,"VVP_0021","Forest/Woodland","Woody vegetation"]
["Victorian Volcanic Plain","VVP_","Shrubby Foothill Forest","Victorian Volcanic PlainShrubby Foothill Forest","VVP_0045",70,20,25,40,0,5,1,5,null,null,5,20,3,10,2,5,1,1,7,15,null,null,2,5,1,15,5,20,1,5,null,null,null,null,2,10,null,null,null,null,1,1,0,10,"0","10","Episodic",30,15,9,8,35,40,200,1,1,45,"D","Depleted",1,0,0,"VVP_0045","Forest/Woodland","Woody vegetation"]
["Victorian Volcanic Plain","VVP_","Stony Knoll Shrubland","Victorian Volcanic PlainStony Knoll Shrubland","VVP_0649",0,0,0,null,null,null,null,null,null,null,3,10,null,null,1,1,2,1,11,10,4,5,null,null,null,null,10,25,2,5,"2","5",null,null,2,5,null,null,null,null,null,null,0,10,"0","10","Continuous",0,11,3,17,10,20,0,1.36,1.36,649,"En","Endangered",1,0,0,"VVP_0649","Forest/Woodland","Woody vegetation"]
["Victorian Volcanic Plain","VVP_","Stony Rises Woodland","Victorian Volcanic PlainStony Rises Woodland","VVP_0203",70,15,15,15,0,5,1,10,null,null,1,5,1,5,null,null,3,5,8,15,4,10,1,5,null,null,4,20,1,5,null,null,null,null,2,20,null,null,null,null,1,1,0,10,null,null,"Continuous",0,13,3,15,20,20,150,1,1,203,"Vu","Vulnerable",1,0,0,"VVP_0203","Forest/Woodland","Woody vegetation"]
["Victorian Volcanic Plain","VVP_","Stream Bank Shrubland","Victorian Volcanic PlainStream Bank Shrubland","VVP_0851",0,0,0,null,null,null,2,10,null,null,4,20,null,null,null,null,3,5,12,20,4,10,3,10,3,10,10,15,5,10,null,null,null,null,null,null,null,null,null,null,2,5,null,null,null,null,"Continuous",0,10,6,19,30,40,0,1.36,1,851,"En","Endangered",1,0,0,"VVP_0851","Forest/Woodland","Woody vegetation"]
["Victorian Volcanic Plain","VVP_","Swamp Scrub","Victorian Volcanic PlainSwamp Scrub","VVP_0053",0,0,6,60,null,null,null,null,null,null,null,null,null,null,null,null,5,10,13,30,2,5,9,15,1,1,7,15,null,null,null,null,null,null,null,null,null,null,null,null,null,null,0,20,null,null,"Continuous",0,7,null,20,null,20,0,1.25,1.1499999999999999,53,"En","Endangered",3,0,0,"VVP_0053","scrubs/shrublands/mallee without logs","Woody vegetation"]
["Victorian Volcanic Plain","VVP_","Swampy Riparian Woodland","Victorian Volcanic PlainSwampy Riparian Woodland","VVP_0083",70,10,15,20,0,5,2,10,null,null,2,5,null,null,null,null,5,10,9,15,4,5,5,20,1,1,8,20,2,1,null,null,null,null,1,1,null,null,null,null,2,5,0,20,null,null,"Continuous",0,13,4,18,15,20,200,1,1,83,"En","Endangered",1,0,0,"VVP_0083","Forest/Woodland","Woody vegetation"]
["Victorian Volcanic Plain","VVP_","Swampy Woodland","Victorian Volcanic PlainSwampy Woodland","VVP_0937",null,null,0,null,null,null,null,null,null,null,null,null,null,null,null,null,null,null,null,null,null,null,null,null,null,null,null,null,null,null,null,null,null,null,null,null,null,null,null,null,null,null,null,null,null,null,null,0,0,null,null,null,null,0,1,1,937,"En","Endangered",1,0,0,"VVP_0937","Forest/Woodland","Woody vegetation"]
["Victorian Volcanic Plain","VVP_","Tall Marsh","Victorian Volcanic PlainTall Marsh","VVP_0821",0,0,0,null,null,null,null,null,null,null,null,null,null,null,null,null,3,10,2,5,6,10,1,5,2,40,null,null,1,1,null,null,null,null,null,null,null,null,null,null,null,null,null,null,null,null,"Episodic",5,6,null,11,null,10,0,1.36,{"$error":"#N/A"},{"$error":"#N/A"},{"$error":"#N/A"},{"$error":"#N/A"},{"$error":"#N/A"},{"$error":"#N/A"},{"$error":"#N/A"},{"$error":"#N/A"},{"$error":"#N/A"},{"$error":"#N/A"}]
["Victorian Volcanic Plain","VVP_","Treed Escarpment Shrubland","Victorian Volcanic PlainTreed Escarpment Shrubland","VVP_0895_61",70,15,15,15,0,5,3,10,null,null,3,10,2,5,null,null,3,5,4,10,5,5,1,5,1,5,9,25,3,5,null,null,null,null,1,5,null,null,null,null,1,5,0,10,"0","10","Continuous",0,15,8,12,25,20,150,1,{"$error":"#N/A"},{"$error":"#N/A"},{"$error":"#N/A"},{"$error":"#N/A"},{"$error":"#N/A"},{"$error":"#N/A"},{"$error":"#N/A"},{"$error":"#N/A"},{"$error":"#N/A"},{"$error":"#N/A"}]
["Victorian Volcanic Plain","VVP_","Treed Sand Heathland","Victorian Volcanic PlainTreed Sand Heathland","VVP_0006_61",50,15,5,10,null,null,null,null,null,null,6,30,8,20,3,5,null,null,3,5,2,5,2,10,1,5,6,15,1,1,null,null,null,null,1,1,null,null,null,null,3,5,0,10,"0","10","Episodic",30,13,14,5,50,20,150,1,{"$error":"#N/A"},{"$error":"#N/A"},{"$error":"#N/A"},{"$error":"#N/A"},{"$error":"#N/A"},{"$error":"#N/A"},{"$error":"#N/A"},{"$error":"#N/A"},{"$error":"#N/A"},{"$error":"#N/A"}]
["Victorian Volcanic Plain","VVP_","Treed Stony Knoll Shrubland",{"$f":"CONCATENATE(A1155,C1155)","v":"Victorian Volcanic PlainTreed Stony Knoll Shrubland"},"VVP_0649_61",0,0,8,15,null,null,null,null,null,null,3,10,null,null,1,1,2,1,11,10,4,5,null,null,null,null,10,25,2,5,"2","5",null,null,2,5,null,null,null,null,null,null,0,10,"0","10","Continuous",0,11,3,17,10,20,50,1.1499999999999999,{"$error":"#N/A"},{"$error":"#N/A"},{"$error":"#N/A"},{"$error":"#N/A"},{"$error":"#N/A"},{"$error":"#N/A"},{"$error":"#N/A"},{"$error":"#N/A"},{"$error":"#N/A"},{"$error":"#N/A"}]
["Victorian Volcanic Plain","VVP_","Treed Stream Bank Shrubland","Victorian Volcanic PlainTreed Stream Bank Shrubland","VVP_0851_61",70,10,15,10,0,5,2,10,null,null,4,20,null,null,null,null,3,5,12,20,4,10,3,10,3,10,10,15,5,10,null,null,null,null,null,null,null,null,null,null,2,5,null,null,null,null,"Continuous",0,11,6,19,30,40,100,1,{"$error":"#N/A"},{"$error":"#N/A"},{"$error":"#N/A"},{"$error":"#N/A"},{"$error":"#N/A"},{"$error":"#N/A"},{"$error":"#N/A"},{"$error":"#N/A"},{"$error":"#N/A"},{"$error":"#N/A"}]
["Victorian Volcanic Plain","VVP_","Valley Grassy Forest","Victorian Volcanic PlainValley Grassy Forest","VVP_0047",70,20,25,20,0,5,2,10,null,null,2,10,null,null,1,1,2,5,11,20,3,5,2,5,1,5,16,40,2,5,null,null,null,null,null,null,null,null,null,null,1,1,0,20,null,null,"Continuous",0,13,4,16,20,20,200,1,1,47,"Vu","Vulnerable",1,0,0,"VVP_0047","Forest/Woodland","Woody vegetation"]
["Victorian Volcanic Plain","VVP_","Valley Heathy Forest","Victorian Volcanic PlainValley Heathy Forest","VVP_0125",0,0,0,null,null,null,null,null,null,null,null,null,null,null,null,null,5,5,6,10,3,10,3,15,1,5,8,30,2,10,null,null,null,null,null,null,null,null,null,null,null,null,0,10,null,null,"Episodic",5,8,null,14,null,20,50,1.36,1.36,125,"En","Endangered",6,"y",0,"VVP_0125","wetlands","Non-woody wetland vegetation"]
["Victorian Volcanic Plain","VVP_","Wet Heathland","Victorian Volcanic PlainWet Heathland","VVP_0008",0,0,0,null,null,null,null,null,null,null,7,50,6,15,1,5,null,null,3,5,2,1,2,15,null,null,2,5,3,10,null,null,null,null,2,10,null,null,null,null,null,null,0,20,null,null,"Episodic",30,10,13,5,65,20,0,1.36,1.36,8,"LC","Least Concern",4,0,0,"VVP_0008","heathlands","Woody vegetation"]
["Victorian Volcanic Plain","VVP_","Wet Verge Sedgeland","Victorian Volcanic PlainWet Verge Sedgeland","VVP_0932",null,null,0,null,null,null,null,null,null,null,null,null,null,null,null,null,null,null,null,null,null,null,null,null,null,null,null,null,null,null,null,null,null,null,null,null,null,null,null,null,null,null,null,null,null,null,null,0,0,null,null,null,null,0,1.36,1.36,932,"En","Endangered",6,0,0,"VVP_0932","wetlands","Non-woody wetland vegetation"]
["Victorian Volcanic Plain","VVP_","Wetland Formation","Victorian Volcanic PlainWetland Formation","VVP_0074",null,null,0,null,null,null,null,null,null,null,null,null,null,null,null,null,null,null,null,null,null,null,null,null,null,null,null,null,null,null,null,null,null,null,null,null,null,null,null,null,null,null,null,null,null,null,null,5,0,null,null,null,null,0,1.36,1.36,74,"En","Endangered",6,0,0,"VVP_0074","wetlands","Non-woody wetland vegetation"]
["Warrnambool Plain","WaP_","Aquatic Herbland","Warrnambool PlainAquatic Herbland","WaP_0653",0,0,0,null,null,null,null,null,null,null,null,null,null,null,null,null,null,null,3,20,null,null,1,25,null,null,4,25,1,1,null,null,null,null,null,null,null,null,null,null,null,null,null,null,null,null,"Episodic",5,4,null,3,null,10,0,1.36,1.36,653,"En","Endangered",6,0,0,"WaP_0653","wetlands","Non-woody wetland vegetation"]
["Warrnambool Plain","WaP_","Basalt Creekline Shrubby Woodland","Warrnambool PlainBasalt Creekline Shrubby Woodland","WaP_0705",70,10,10,10,0,5,1,10,null,null,4,15,null,null,null,null,2,5,8,15,5,10,2,15,null,null,7,20,2,10,null,null,null,null,null,null,null,null,null,null,null,null,0,10,null,null,"Continuous",0,10,5,15,25,20,200,1,1,705,"En","Endangered",1,0,0,"WaP_0705","Forest/Woodland","Woody vegetation"]
["Warrnambool Plain","WaP_","Basalt Shrubby Woodland","Warrnambool PlainBasalt Shrubby Woodland","WaP_0642",70,15,15,15,0,5,2,10,null,null,2,5,null,null,2,1,2,1,10,15,5,10,3,5,1,5,10,25,3,10,null,null,null,null,1,15,null,null,null,null,null,null,0,10,"0","10","Continuous",0,14,4,17,15,20,150,1,1,642,"En","Endangered",1,0,0,"WaP_0642","Forest/Woodland","Woody vegetation"]
["Warrnambool Plain","WaP_","Bird Colony Shrubland","Warrnambool PlainBird Colony Shrubland","WaP_0154",null,0,0,null,null,null,null,null,null,null,null,null,null,null,null,null,null,null,null,null,null,null,null,null,null,null,null,null,null,null,null,null,null,null,null,null,null,null,null,null,null,null,null,null,null,null,null,0,0,null,null,null,0,0,1.36,1.36,154,"Ra","Rare",5,0,0,"WaP_0154","grasslands","Other grassland vegetation"]
["Warrnambool Plain","WaP_","Bird Colony Succulent Herbland","Warrnambool PlainBird Colony Succulent Herbland","WaP_0155",0,0,0,null,null,null,null,null,null,null,1,30,null,null,null,null,null,null,2,5,2,20,1,1,null,null,null,null,null,null,null,null,null,null,null,null,null,null,null,null,2,40,null,null,null,null,"Continuous",0,5,1,4,30,10,0,1.36,1.36,155,"Vu","Vulnerable",5,0,0,"WaP_0155","grasslands","Other grassland vegetation"]
["Warrnambool Plain","WaP_","Coast Gully Thicket","Warrnambool PlainCoast Gully Thicket","WaP_0181",0,0,0,null,null,null,null,null,null,null,5,50,1,5,null,null,null,null,2,1,null,null,2,5,null,null,3,5,null,null,null,null,null,null,2,5,null,null,null,null,2,5,0,10,null,null,"Continuous",0,8,6,2,55,40,50,1.25,1.25,181,"En","Endangered",3,0,0,"WaP_0181","scrubs/shrublands/mallee without logs","Woody vegetation"]
["Warrnambool Plain","WaP_","Coastal Dune Scrub","Warrnambool PlainCoastal Dune Scrub","WaP_0160",0,0,0,null,null,null,null,null,null,null,7,50,1,1,null,null,3,5,7,15,3,10,null,null,null,null,2,15,2,5,null,null,null,null,null,null,null,null,null,null,3,5,0,10,null,null,"Episodic",30,9,8,13,51,40,0,1.36,1.36,160,"D","Depleted",4,0,0,"WaP_0160","heathlands","Woody vegetation"]
["Warrnambool Plain","WaP_","Coastal Headland Scrub","Warrnambool PlainCoastal Headland Scrub","WaP_0161",0,0,0,null,null,null,null,null,null,null,5,50,2,10,1,1,2,1,4,10,2,5,1,5,1,1,5,15,2,5,null,null,null,null,null,null,null,null,null,null,null,null,0,10,"0","10","Continuous",0,12,7,8,60,40,0,1.36,1.36,161,"Vu","Vulnerable",4,0,0,"WaP_0161","heathlands","Woody vegetation"]
["Warrnambool Plain","WaP_","Coastal Tussock Grassland","Warrnambool PlainCoastal Tussock Grassland","WaP_0163",0,0,0,null,null,null,null,null,null,null,5,20,2,15,1,1,2,1,6,10,2,5,1,10,null,null,5,25,2,5,null,null,null,null,null,null,null,null,null,null,null,null,0,10,"0","10","Continuous",0,11,7,10,35,20,0,1.36,1.36,163,"Vu","Vulnerable",5,0,0,"WaP_0163","grasslands","Other grassland vegetation"]
["Warrnambool Plain","WaP_","Damp Heath Scrub","Warrnambool PlainDamp Heath Scrub","WaP_0165",0,0,0,null,null,null,null,null,null,null,6,50,3,5,2,5,null,null,4,5,2,1,2,10,null,null,4,15,2,10,null,null,null,null,null,null,null,null,null,null,null,null,0,10,"0","10","Episodic",30,10,9,6,55,40,0,1.36,1.36,165,"Vu","Vulnerable",4,0,0,"WaP_0165","heathlands","Woody vegetation"]
["Warrnambool Plain","WaP_","Damp Sands Herb-rich Woodland","Warrnambool PlainDamp Sands Herb-rich Woodland","WaP_0003",70,15,15,15,0,5,1,10,null,null,3,10,1,1,1,1,2,5,7,15,4,5,2,10,2,10,4,15,2,5,null,null,null,null,1,10,null,null,null,null,null,null,0,10,null,null,"Continuous",0,14,5,13,21,40,150,1,1,3,"En","Endangered",1,0,0,"WaP_0003","Forest/Woodland","Woody vegetation"]
["Warrnambool Plain","WaP_","Deep Freshwater Marsh","Warrnambool PlainDeep Freshwater Marsh","WaP_0681",null,null,0,null,null,null,null,null,null,null,null,null,null,null,null,null,null,null,null,null,null,null,null,null,null,null,null,null,null,null,null,null,null,null,null,null,null,null,null,null,null,null,null,null,null,null,null,5,0,null,null,null,null,0,1.36,1.36,681,"En","Endangered",6,0,0,"WaP_0681","wetlands","Non-woody wetland vegetation"]
["Warrnambool Plain","WaP_","Estuarine Wetland","Warrnambool PlainEstuarine Wetland","WaP_0010",0,0,0,null,null,null,null,null,null,null,null,null,null,null,null,null,null,null,2,25,1,10,1,10,null,null,1,5,3,20,null,null,null,null,null,null,null,null,null,null,null,null,null,null,null,null,"Episodic",5,5,null,3,null,10,0,1.36,1.36,10,"D","Depleted",6,0,0,"WaP_0010","wetlands","Non-woody wetland vegetation"]
["Warrnambool Plain","WaP_","Freshwater Meadow","Warrnambool PlainFreshwater Meadow","WaP_0680",null,null,0,null,null,null,null,null,null,null,null,null,null,null,null,null,null,null,null,null,null,null,null,null,null,null,null,null,null,null,null,null,null,null,null,null,null,null,null,null,null,null,null,null,null,null,null,5,0,null,null,null,null,0,1.36,1.36,680,"En","Endangered",6,0,0,"WaP_0680","wetlands","Non-woody wetland vegetation"]
["Warrnambool Plain","WaP_","Grassy Woodland","Warrnambool PlainGrassy Woodland","WaP_0175",70,15,15,15,0,5,2,10,null,null,2,10,2,1,2,5,2,5,8,20,3,5,1,1,null,null,8,45,1,5,null,null,null,null,null,null,null,null,null,null,1,1,0,10,null,null,"Continuous",0,13,6,13,21,20,150,1,1,175,"En","Endangered",1,0,0,"WaP_0175","Forest/Woodland","Woody vegetation"]
["Warrnambool Plain","WaP_","Heathy Woodland","Warrnambool PlainHeathy Woodland","WaP_0048",60,15,10,15,0,5,null,null,null,null,7,30,4,5,2,1,null,null,4,10,1,1,1,5,1,1,3,5,1,5,null,null,null,null,2,5,null,null,null,null,null,null,0,10,"0","10","Episodic",20,13,11,5,35,40,150,1,1,48,"Vu","Vulnerable",1,0,0,"WaP_0048","Forest/Woodland","Woody vegetation"]
["Warrnambool Plain","WaP_","Herb-rich Foothill Forest","Warrnambool PlainHerb-rich Foothill Forest","WaP_0023",70,20,25,40,0,5,1,5,null,null,5,15,2,1,2,5,1,1,10,20,3,5,3,10,2,10,5,20,2,5,null,null,null,null,3,10,null,null,null,null,2,1,0,20,null,null,"Continuous",0,15,8,14,21,40,200,1,1,23,"Vu","Vulnerable",1,0,0,"WaP_0023","Forest/Woodland","Woody vegetation"]
["Warrnambool Plain","WaP_","Lowland Forest","Warrnambool PlainLowland Forest","WaP_0016",70,20,25,30,0,5,2,10,null,null,8,25,3,5,1,1,2,1,6,10,2,5,2,5,1,5,3,5,2,5,null,null,null,null,2,10,null,null,null,null,2,1,0,10,null,null,"Continuous",0,15,13,10,40,40,200,1,1,16,"Vu","Vulnerable",1,0,0,"WaP_0016","Forest/Woodland","Woody vegetation"]
["Warrnambool Plain","WaP_","Permanent Saline","Warrnambool PlainPermanent Saline","WaP_0684",null,null,0,null,null,null,null,null,null,null,null,null,null,null,null,null,null,null,null,null,null,null,null,null,null,null,null,null,null,null,null,null,null,null,null,null,null,null,null,null,null,null,null,null,null,null,null,0,0,null,null,null,null,0,1.36,{"$error":"#N/A"},{"$error":"#N/A"},{"$error":"#N/A"},{"$error":"#N/A"},{"$error":"#N/A"},{"$error":"#N/A"},{"$error":"#N/A"},{"$error":"#N/A"},{"$error":"#N/A"},{"$error":"#N/A"}]
["Warrnambool Plain","WaP_","Plains Grassy Wetland","Warrnambool PlainPlains Grassy Wetland","WaP_0125",null,null,0,null,null,null,null,null,null,null,null,null,null,null,null,null,null,null,null,null,null,null,null,null,null,null,null,null,null,null,null,null,null,null,null,null,null,null,null,null,null,null,null,null,null,null,null,0,0,null,null,null,null,0,1.36,1.36,125,"En","Endangered",6,"y",0,"WaP_0125","wetlands","Non-woody wetland vegetation"]
["Warrnambool Plain","WaP_","Plains Grassy Woodland","Warrnambool PlainPlains Grassy Woodland","WaP_0055",80,8,15,10,0,5,1,5,null,null,3,10,2,1,1,1,3,5,8,15,3,5,2,5,null,null,12,45,2,5,null,null,null,null,null,null,null,null,null,null,null,null,0,10,"0","10","Continuous",0,13,6,14,16,10,100,1,1,55,"En","Endangered",1,0,0,"WaP_0055","Forest/Woodland","Woody vegetation"]
["Warrnambool Plain","WaP_","Plains Sedgy Wetland","Warrnambool PlainPlains Sedgy Wetland","WaP_0647",0,0,0,null,null,null,null,null,null,null,null,null,null,null,null,null,2,5,5,40,5,10,2,5,1,5,4,25,2,5,null,null,null,null,null,null,null,null,null,null,null,null,null,null,null,null,"Episodic",5,7,null,12,null,10,50,1.36,1.36,647,"En","Endangered",6,0,0,"WaP_0647","wetlands","Non-woody wetland vegetation"]
["Warrnambool Plain","WaP_","Plains Swampy Woodland","Warrnambool PlainPlains Swampy Woodland","WaP_0651",80,10,15,10,0,5,1,5,null,null,3,15,null,null,null,null,3,5,8,20,5,5,3,30,1,1,7,10,2,5,null,null,null,null,null,null,null,null,null,null,null,null,0,20,null,null,"Continuous",0,11,4,16,20,10,100,1,1,651,"En","Endangered",1,0,0,"WaP_0651","Forest/Woodland","Woody vegetation"]
["Warrnambool Plain","WaP_","Riparian Forest","Warrnambool PlainRiparian Forest","WaP_0018",80,20,30,40,0,5,3,15,null,null,4,15,null,null,null,null,2,5,4,10,2,5,3,10,1,5,null,null,1,1,null,null,null,null,5,30,"1","5","2","1",2,5,0,20,null,null,"Continuous",0,14,7,8,30,50,300,1,1,18,"Vu","Vulnerable",1,0,0,"WaP_0018","Forest/Woodland","Woody vegetation"]
["Warrnambool Plain","WaP_","Scoria Cone Woodland","Warrnambool PlainScoria Cone Woodland","WaP_0894",70,15,15,15,0,5,1,5,null,null,2,10,null,null,null,null,3,5,6,10,3,5,1,15,null,null,4,15,1,5,null,null,null,null,2,20,null,null,null,null,null,null,0,10,"0","10","Continuous",0,12,3,12,15,20,100,1,1,894,"En","Endangered",1,0,0,"WaP_0894","Forest/Woodland","Woody vegetation"]
["Warrnambool Plain","WaP_","Sedge Wetland","Warrnambool PlainSedge Wetland","WaP_0136",null,null,0,null,null,null,null,null,null,null,null,null,null,null,null,null,null,null,null,null,null,null,null,null,null,null,null,null,null,null,null,null,null,null,null,null,null,null,null,null,null,null,null,null,null,null,null,0,0,null,null,null,null,0,1.36,1.36,136,"En","Endangered",6,0,0,"WaP_0136","wetlands","Non-woody wetland vegetation"]
["Warrnambool Plain","WaP_","Sedgy Riparian Woodland","Warrnambool PlainSedgy Riparian Woodland","WaP_0198",70,15,15,20,0,5,null,null,null,null,5,30,null,null,null,null,1,1,7,10,2,5,3,30,1,5,1,1,3,10,null,null,null,null,2,10,null,null,null,null,1,1,0,20,null,null,"Continuous",0,12,5,10,30,30,200,1,1,198,"En","Endangered",1,0,0,"WaP_0198","Forest/Woodland","Woody vegetation"]
["Warrnambool Plain","WaP_","Semi-permanent Saline","Warrnambool PlainSemi-permanent Saline","WaP_0683",null,null,0,null,null,null,null,null,null,null,null,null,null,null,null,null,null,null,null,null,null,null,null,null,null,null,null,null,null,null,null,null,null,null,null,null,null,null,null,null,null,null,null,null,null,null,null,0,0,null,null,null,null,0,1.36,{"$error":"#N/A"},{"$error":"#N/A"},{"$error":"#N/A"},{"$error":"#N/A"},{"$error":"#N/A"},{"$error":"#N/A"},{"$error":"#N/A"},{"$error":"#N/A"},{"$error":"#N/A"},{"$error":"#N/A"}]
["Warrnambool Plain","WaP_","Shallow Freshwater Marsh","Warrnambool PlainShallow Freshwater Marsh","WaP_0200",null,null,0,null,null,null,null,null,null,null,null,null,null,null,null,null,null,null,null,null,null,null,null,null,null,null,null,null,null,null,null,null,null,null,null,null,null,null,null,null,null,null,null,null,null,null,null,5,0,null,null,null,null,0,1.36,1.36,200,"En","Endangered",6,0,0,"WaP_0200","wetlands","Non-woody wetland vegetation"]
["Warrnambool Plain","WaP_","Shrubby Foothill Forest","Warrnambool PlainShrubby Foothill Forest","WaP_0045",70,20,25,40,0,5,1,5,null,null,7,40,2,10,null,null,null,null,4,5,1,1,2,10,1,10,2,5,1,1,null,null,null,null,3,10,null,null,null,null,2,1,0,10,null,null,"Episodic",30,13,10,5,55,40,200,1,1,45,"D","Depleted",1,0,0,"WaP_0045","Forest/Woodland","Woody vegetation"]
["Warrnambool Plain","WaP_","Shrubby Wet Forest","Warrnambool PlainShrubby Wet Forest","WaP_0201",90,20,30,40,0,5,2,10,null,null,9,20,null,null,1,1,2,1,5,10,2,5,2,10,1,10,2,5,1,1,null,null,null,null,3,20,"1","15",null,null,1,1,0,20,null,null,"Continuous",0,15,11,9,30,50,300,1,1,201,"LC","Least Concern",1,0,0,"WaP_0201","Forest/Woodland","Woody vegetation"]
["Warrnambool Plain","WaP_","Stony Rises Woodland","Warrnambool PlainStony Rises Woodland","WaP_0203",70,15,15,15,0,5,1,10,null,null,1,5,1,5,null,null,3,5,9,20,3,10,1,5,null,null,4,20,1,5,null,null,null,null,2,20,null,null,null,null,1,1,0,10,null,null,"Continuous",0,13,3,15,20,20,150,1,1,203,"Vu","Vulnerable",1,0,0,"WaP_0203","Forest/Woodland","Woody vegetation"]
["Warrnambool Plain","WaP_","Swamp Scrub","Warrnambool PlainSwamp Scrub","WaP_0053",0,0,0,null,null,null,null,null,null,null,2,10,null,null,null,null,3,5,1,5,1,5,3,30,1,10,null,null,2,5,null,null,null,null,2,5,null,null,null,null,1,5,0,20,null,null,"Continuous",0,10,2,5,10,40,0,1.25,1.1499999999999999,53,"En","Endangered",3,0,0,"WaP_0053","scrubs/shrublands/mallee without logs","Woody vegetation"]
["Warrnambool Plain","WaP_","Swampy Riparian Woodland","Warrnambool PlainSwampy Riparian Woodland","WaP_0083",70,10,15,15,0,5,2,10,null,null,2,5,null,null,null,null,5,10,9,20,4,10,5,20,1,5,8,20,2,1,null,null,null,null,1,1,null,null,null,null,2,5,0,20,null,null,"Continuous",0,13,4,18,15,20,200,1,1,83,"En","Endangered",1,0,0,"WaP_0083","Forest/Woodland","Woody vegetation"]
["Warrnambool Plain","WaP_","Tall Marsh","Warrnambool PlainTall Marsh","WaP_0821",0,0,0,null,null,null,null,null,null,null,null,null,null,null,null,null,3,10,3,5,5,20,1,5,3,40,2,5,2,1,null,null,null,null,null,null,null,null,null,null,null,null,null,null,null,null,"Episodic",5,7,null,11,null,0,0,1.36,{"$error":"#N/A"},{"$error":"#N/A"},{"$error":"#N/A"},{"$error":"#N/A"},{"$error":"#N/A"},{"$error":"#N/A"},{"$error":"#N/A"},{"$error":"#N/A"},{"$error":"#N/A"},{"$error":"#N/A"}]
["Warrnambool Plain","WaP_","Wet Heathland","Warrnambool PlainWet Heathland","WaP_0008",0,0,0,null,null,null,null,null,null,null,7,40,6,15,1,5,null,null,3,5,2,1,2,15,null,null,2,5,3,10,null,null,null,null,2,5,null,null,null,null,null,null,0,20,null,null,"Episodic",30,10,13,5,55,20,0,1.36,1.36,8,"En","Endangered",4,0,0,"WaP_0008","heathlands","Woody vegetation"]
["Wilsons Promontory","WPro","Bird Colony Shrubland","Wilsons PromontoryBird Colony Shrubland","WPro0154",0,0,0,null,null,null,null,null,null,null,6,20,null,null,null,null,3,15,null,null,null,null,null,null,null,null,null,null,null,null,null,null,null,null,null,null,null,null,null,null,null,null,null,null,null,null,"Continuous",0,2,6,3,20,10,0,1.36,1.36,154,"Ra","Rare",5,0,0,"WPro0154","grasslands","Other grassland vegetation"]
["Wilsons Promontory","WPro","Blocked Coastal Stream Swamp","Wilsons PromontoryBlocked Coastal Stream Swamp","WPro0875",0,0,0,null,null,null,null,null,null,null,null,null,null,null,null,null,2,10,1,5,1,1,null,null,2,55,3,5,1,1,null,null,null,null,null,null,null,null,null,null,null,null,null,null,null,null,"Episodic",5,6,null,4,null,10,0,1.36,1.36,875,"Ra","Rare",6,0,0,"WPro0875","wetlands","Non-woody wetland vegetation"]
["Wilsons Promontory","WPro","Coast Banksia Woodland","Wilsons PromontoryCoast Banksia Woodland","WPro0002",50,10,15,15,0,5,2,20,null,null,3,30,null,null,null,null,2,1,3,15,2,10,1,1,null,null,1,5,1,5,null,null,null,null,1,5,null,null,null,null,1,10,0,10,null,null,"Episodic",30,12,5,7,50,40,100,1,1,2,"Ra","Rare",1,0,0,"WPro0002","Forest/Woodland","Woody vegetation"]
["Wilsons Promontory","WPro","Coastal Alkaline Scrub","Wilsons PromontoryCoastal Alkaline Scrub","WPro0858",0,0,0,null,0,5,null,null,null,null,4,30,2,5,null,null,1,1,5,10,2,5,1,5,null,null,4,10,2,5,null,null,null,null,null,null,null,null,null,null,2,1,0,20,null,null,"Continuous",0,11,6,8,35,40,50,1.1499999999999999,1.1499999999999999,858,"D","Depleted",2,0,0,"WPro0858","scrubs/shrublands/mallee with logs","Woody vegetation"]
["Wilsons Promontory","WPro","Coastal Headland Scrub","Wilsons PromontoryCoastal Headland Scrub","WPro0161",0,0,0,null,null,null,2,25,null,null,7,50,2,5,null,null,2,5,2,5,2,5,1,1,null,null,4,10,2,1,null,null,null,null,null,null,null,null,null,null,2,1,0,10,null,null,"Continuous",0,11,11,6,80,40,0,1.36,1.36,161,"Vu","Vulnerable",4,0,0,"WPro0161","heathlands","Woody vegetation"]
["Wilsons Promontory","WPro","Coastal Lagoon Wetland","Wilsons PromontoryCoastal Lagoon Wetland","WPro0011",0,0,0,null,null,null,null,null,null,null,null,null,null,null,null,null,1,1,2,5,1,1,2,10,2,15,1,1,2,5,null,null,null,null,null,null,null,null,null,null,null,null,null,null,null,null,"Continuous",0,7,null,4,null,20,0,1.36,1.36,11,"Ra","Rare",6,0,0,"WPro0011","wetlands","Non-woody wetland vegetation"]
["Wilsons Promontory","WPro","Coastal Saltmarsh","Wilsons PromontoryCoastal Saltmarsh","WPro0009",0,0,0,null,null,null,null,null,null,null,1,20,1,1,null,null,null,null,3,20,2,15,null,null,1,1,1,5,2,10,null,null,null,null,null,null,null,null,null,null,null,null,null,null,"0","10","Continuous",0,8,2,5,21,10,0,1.36,1.36,9,"LC","Least Concern",5,"y",0,"WPro0009","grasslands","Other grassland vegetation"]
["Wilsons Promontory","WPro","Coastal Sand Heathland","Wilsons PromontoryCoastal Sand Heathland","WPro0005",0,0,0,null,null,null,null,null,null,null,null,null,10,55,null,null,2,5,2,5,1,1,null,null,null,null,4,10,2,5,null,null,null,null,null,null,null,null,null,null,null,null,0,10,null,null,"Continuous",0,7,10,5,55,40,0,1.36,1.36,5,"Ra","Rare",4,0,0,"WPro0005","heathlands","Woody vegetation"]
["Wilsons Promontory","WPro","Coastal Tussock Grassland","Wilsons PromontoryCoastal Tussock Grassland","WPro0163",0,0,0,null,null,null,null,null,null,null,3,20,1,5,1,1,2,5,5,10,3,5,3,10,null,null,4,25,2,5,null,null,null,null,null,null,null,null,null,null,null,null,0,10,"0","10","Continuous",0,11,4,10,25,20,0,1.36,1.36,163,"Ra","Rare",5,0,0,"WPro0163","grasslands","Other grassland vegetation"]
["Wilsons Promontory","WPro","Cool Temperate Rainforest","Wilsons PromontoryCool Temperate Rainforest","WPro0031",70,20,25,50,0,5,2,10,null,null,2,5,null,null,null,null,2,5,2,5,null,null,null,null,null,null,null,null,null,null,null,null,null,null,6,15,"3","40","5","5",2,1,0,40,null,null,"Continuous",0,10,4,4,15,50,200,1,1,31,"En","Endangered",1,0,0,"WPro0031","Forest/Woodland","Woody vegetation"]
["Wilsons Promontory","WPro","Damp Forest","Wilsons PromontoryDamp Forest","WPro0029",90,20,30,40,0,5,4,20,null,null,6,25,1,1,null,null,null,null,3,1,null,null,2,5,1,1,2,10,1,1,null,null,null,null,3,10,"1","5",null,null,2,1,0,20,null,null,"Continuous",0,13,11,3,46,50,300,1,1,29,"LC","Least Concern",1,0,0,"WPro0029","Forest/Woodland","Woody vegetation"]
["Wilsons Promontory","WPro","Damp Sands Herb-rich Woodland","Wilsons PromontoryDamp Sands Herb-rich Woodland","WPro0003",70,15,15,15,0,5,null,null,null,null,5,25,3,5,1,1,2,5,8,15,5,10,2,10,1,1,4,10,2,10,null,null,null,null,1,15,null,null,null,null,null,null,0,10,null,null,"Continuous",0,13,8,15,30,40,150,1,1,3,"Vu","Vulnerable",1,0,0,"WPro0003","Forest/Woodland","Woody vegetation"]
["Wilsons Promontory","WPro","Estuarine Flats Grassland","Wilsons PromontoryEstuarine Flats Grassland","WPro0914",0,0,0,null,null,null,null,null,null,null,2,5,1,5,null,null,1,1,3,15,4,15,2,15,null,null,2,20,3,15,null,null,null,null,null,null,null,null,null,null,null,null,null,null,null,null,"Continuous",0,8,3,8,10,10,0,1.36,{"$error":"#N/A"},{"$error":"#N/A"},{"$error":"#N/A"},{"$error":"#N/A"},{"$error":"#N/A"},{"$error":"#N/A"},{"$error":"#N/A"},{"$error":"#N/A"},{"$error":"#N/A"},{"$error":"#N/A"}]
["Wilsons Promontory","WPro","Estuarine Wetland","Wilsons PromontoryEstuarine Wetland","WPro0010",0,0,0,null,null,null,null,null,null,null,1,10,2,5,null,null,2,5,6,20,2,5,2,10,1,5,2,5,3,20,null,null,null,null,1,5,null,null,null,null,1,1,null,null,null,null,"Episodic",5,11,3,10,15,10,0,1.36,1.36,10,"Ra","Rare",6,0,0,"WPro0010","wetlands","Non-woody wetland vegetation"]
["Wilsons Promontory","WPro","Granitic Hills Woodland","Wilsons PromontoryGranitic Hills Woodland","WPro0072",60,15,10,15,0,5,1,10,null,null,10,30,6,10,2,5,null,null,3,5,null,null,2,10,1,1,4,20,1,1,null,null,null,null,2,5,null,null,null,null,null,null,0,10,null,null,"Continuous",0,12,17,3,50,20,150,1,1,72,"LC","Least Concern",1,0,0,"WPro0072","Forest/Woodland","Woody vegetation"]
["Wilsons Promontory","WPro","Heathy Woodland","Wilsons PromontoryHeathy Woodland","WPro0048",50,15,10,10,0,5,1,5,null,null,6,40,5,10,1,1,null,null,2,1,null,null,2,15,null,null,2,10,2,10,null,null,null,null,1,5,null,null,null,null,null,null,0,10,"0","10","Episodic",20,12,12,2,55,40,150,1,1,48,"LC","Least Concern",1,0,0,"WPro0048","Forest/Woodland","Woody vegetation"]
["Wilsons Promontory","WPro","Lowland Forest","Wilsons PromontoryLowland Forest","WPro0016",70,20,25,30,0,5,null,null,null,null,7,30,5,10,2,5,null,null,7,10,4,5,2,5,1,5,7,15,1,1,null,null,null,null,2,15,null,null,null,null,3,1,0,10,null,null,"Continuous",0,13,12,11,40,40,200,1,1,16,"LC","Least Concern",1,0,0,"WPro0016","Forest/Woodland","Woody vegetation"]
["Wilsons Promontory","WPro","Mangrove Shrubland","Wilsons PromontoryMangrove Shrubland","WPro0140",0,0,0,null,null,null,null,null,null,null,1,40,null,null,null,null,null,null,null,null,null,null,null,null,null,null,null,null,1,5,null,null,null,null,null,null,null,null,null,null,null,null,null,null,null,null,"Continuous",0,2,1,null,40,0,0,1.36,1.36,140,"Ra","Rare",4,0,0,"WPro0140","heathlands","Woody vegetation"]
["Wilsons Promontory","WPro","Montane Rocky Shrubland","Wilsons PromontoryMontane Rocky Shrubland","WPro0192",0,0,0,null,null,null,null,null,null,null,6,30,null,null,null,null,null,null,1,1,null,null,2,15,null,null,2,5,1,1,null,null,null,null,3,10,"1","5","2","5",null,null,0,20,null,null,"Episodic",30,9,6,1,30,40,0,1.25,1.25,192,"Ra","Rare",3,0,0,"WPro0192","scrubs/shrublands/mallee without logs","Woody vegetation"]
["Wilsons Promontory","WPro","Riparian Forest","Wilsons PromontoryRiparian Forest","WPro0018",80,20,30,40,0,5,1,15,null,null,8,20,1,1,null,null,2,1,6,10,2,1,3,10,1,5,3,5,3,10,null,null,null,null,3,15,"1","1",null,null,2,5,0,20,null,null,"Continuous",0,15,10,10,36,50,300,1,1,18,"LC","Least Concern",1,0,0,"WPro0018","Forest/Woodland","Woody vegetation"]
["Wilsons Promontory","WPro","Riparian Scrub","Wilsons PromontoryRiparian Scrub","WPro0191",0,0,0,null,null,null,null,null,null,null,6,50,1,1,null,null,null,null,3,10,null,null,3,30,1,5,2,5,3,5,null,null,null,null,2,10,null,null,null,null,1,10,0,20,null,null,"Continuous",0,10,7,3,51,40,50,1.25,1.25,191,"LC","Least Concern",3,0,0,"WPro0191","scrubs/shrublands/mallee without logs","Woody vegetation"]
["Wilsons Promontory","WPro","Rocky Outcrop Shrubland",{"$f":"CONCATENATE(A1219,C1219)","v":"Wilsons PromontoryRocky Outcrop Shrubland"},"WPro0028",0,0,0,null,null,null,null,null,null,null,7,25,2,5,2,5,2,5,2,1,null,null,2,5,null,null,4,10,1,1,null,null,null,null,1,1,null,null,null,null,null,null,0,20,"0","10","Continuous",0,11,9,4,30,40,100,1.36,{"$error":"#N/A"},{"$error":"#N/A"},{"$error":"#N/A"},{"$error":"#N/A"},{"$error":"#N/A"},{"$error":"#N/A"},{"$error":"#N/A"},{"$error":"#N/A"},{"$error":"#N/A"},{"$error":"#N/A"}]
["Wilsons Promontory","WPro","Sand Heathland","Wilsons PromontorySand Heathland","WPro0006",0,0,0,null,null,null,null,null,null,null,7,40,6,15,2,1,null,null,3,5,null,null,1,1,null,null,3,10,2,5,null,null,null,null,1,1,null,null,null,null,null,null,0,10,"0","10","Episodic",30,10,13,3,55,20,0,1.36,1.36,6,"Ra","Rare",4,0,0,"WPro0006","heathlands","Woody vegetation"]
["Wilsons Promontory","WPro","Sedge Wetland","Wilsons PromontorySedge Wetland","WPro0136",0,0,0,null,null,null,null,null,null,null,1,5,null,null,null,null,1,5,4,10,null,null,1,15,2,30,1,1,2,1,null,null,null,null,null,null,null,null,null,null,null,null,0,10,null,null,"Episodic",5,8,1,5,5,10,0,1.36,1.36,136,"Ra","Rare",6,0,0,"WPro0136","wetlands","Non-woody wetland vegetation"]
["Wilsons Promontory","WPro","Shrubby Foothill Forest","Wilsons PromontoryShrubby Foothill Forest","WPro0045",70,20,25,40,0,5,3,25,null,null,7,35,2,10,null,null,null,null,2,1,null,null,1,5,1,5,1,5,null,null,null,null,null,null,2,5,null,null,null,null,null,null,0,10,null,null,"Episodic",30,10,12,2,70,40,200,1,1,45,"LC","Least Concern",1,0,0,"WPro0045","Forest/Woodland","Woody vegetation"]
["Wilsons Promontory","WPro","Spray-zone Coastal Shrubland","Wilsons PromontorySpray-zone Coastal Shrubland","WPro0876",0,0,0,null,null,null,null,null,null,null,2,5,4,30,null,null,null,null,2,5,4,5,2,5,null,null,4,10,1,1,null,null,null,null,null,null,null,null,null,null,1,5,null,null,"0","20","Continuous",0,9,6,6,35,10,0,1.36,1.36,876,"Ra","Rare",5,0,0,"WPro0876","grasslands","Other grassland vegetation"]
["Wilsons Promontory","WPro","Swamp Scrub","Wilsons PromontorySwamp Scrub","WPro0053",0,0,0,null,null,null,null,null,null,null,2,10,2,1,null,null,2,5,3,15,2,5,2,10,3,10,2,5,2,15,null,null,null,null,1,5,null,null,null,null,1,1,0,20,null,null,"Continuous",0,12,4,7,11,40,0,1.25,1.1499999999999999,53,"En","Endangered",3,0,0,"WPro0053","scrubs/shrublands/mallee without logs","Woody vegetation"]
["Wilsons Promontory","WPro","Warm Temperate Rainforest","Wilsons PromontoryWarm Temperate Rainforest","WPro0032",70,20,25,50,0,5,3,10,null,null,3,10,null,null,null,null,null,null,3,5,null,null,2,10,null,null,null,null,null,null,null,null,null,null,5,20,"3","30","6","5",2,5,0,20,null,null,"Continuous",0,10,6,3,20,50,200,1,1,32,"Ra","Rare",1,0,0,"WPro0032","Forest/Woodland","Woody vegetation"]
["Wilsons Promontory","WPro","Wet Forest","Wilsons PromontoryWet Forest","WPro0030",90,20,30,40,0,5,4,25,null,null,3,15,null,null,null,null,null,null,3,5,null,null,1,1,null,null,1,1,null,null,null,null,null,null,4,15,"2","5","2","1",2,1,0,20,null,null,"Continuous",0,11,7,3,40,50,300,1,1,30,"LC","Least Concern",1,0,0,"WPro0030","Forest/Woodland","Woody vegetation"]
["Wilsons Promontory","WPro","Wet Heathland","Wilsons PromontoryWet Heathland","WPro0008",0,0,0,null,null,null,null,null,null,null,5,50,2,5,null,null,1,5,2,5,null,null,3,20,1,1,2,5,4,20,null,null,null,null,1,10,null,null,null,null,1,1,0,20,null,null,"Episodic",30,11,7,3,55,20,0,1.36,1.36,8,"LC","Least Concern",4,0,0,"WPro0008","heathlands","Woody vegetation"]
["Wilsons Promontory","WPro","Wet Rocky Outcrop Scrub","Wilsons PromontoryWet Rocky Outcrop Scrub","WPro0310",0,0,0,null,null,null,2,10,null,null,6,30,2,10,null,null,null,null,4,10,null,null,2,5,null,null,1,1,3,5,null,null,null,null,3,10,null,null,"2","5",null,null,0,20,null,null,"Episodic",30,10,10,4,50,40,0,1.36,1.36,310,"Ra","Rare",5,0,0,"WPro0310","grasslands","Other grassland vegetation"]
["Wilsons Promontory","WPro","Wet Swale Herbland","Wilsons PromontoryWet Swale Herbland","WPro0012",0,0,0,null,null,null,null,null,null,null,null,null,null,null,null,null,1,1,7,15,3,5,2,5,1,1,4,10,4,25,null,null,null,null,1,5,null,null,null,null,2,1,null,null,null,null,"Episodic",5,9,null,11,null,10,0,1.36,1.36,12,"Ra","Rare",6,0,0,"WPro0012","wetlands","Non-woody wetland vegetation"]
["Wilsons Promontory","WPro","Wetland Formation","Wilsons PromontoryWetland Formation","WPro0074",null,null,0,null,null,null,null,null,null,null,null,null,null,null,null,null,null,null,null,null,null,null,null,null,null,null,null,null,null,null,null,null,null,null,null,null,null,null,null,null,null,null,null,null,null,null,null,0,0,null,null,null,null,0,1.36,1.36,74,"Ra","Rare",6,0,0,"WPro0074","wetlands","Non-woody wetland vegetation"]
["Wimmera","Wim_","Alluvial Terraces Herb-rich Woodland","WimmeraAlluvial Terraces Herb-rich Woodland","Wim_0067",70,8,15,15,0,5,1,5,null,null,3,5,3,5,1,1,3,5,15,20,5,10,1,1,null,null,12,20,2,5,null,null,null,null,1,1,null,null,null,null,null,null,0,10,"0","10","Continuous",0,14,7,23,15,10,150,1,1,67,"Vu","Vulnerable",1,0,0,"Wim_0067","Forest/Woodland","Woody vegetation"]
["Wimmera","Wim_","Aquatic Herbland","WimmeraAquatic Herbland","Wim_0653",0,0,0,null,null,null,null,null,null,null,null,null,null,null,null,null,null,null,3,30,2,5,null,null,null,null,3,10,2,20,null,null,null,null,null,null,null,null,null,null,null,null,null,null,null,null,"Episodic",5,4,null,5,null,10,0,1.36,1.36,653,"En","Endangered",6,0,0,"Wim_0653","wetlands","Non-woody wetland vegetation"]
["Wimmera","Wim_","Black Box Lignum Woodland","WimmeraBlack Box Lignum Woodland","Wim_0663",70,10,12,10,0,5,null,null,null,null,1,25,1,1,null,null,4,5,9,20,2,5,2,5,null,null,7,20,3,20,null,null,null,null,null,null,null,null,null,null,null,null,null,null,"0","10","Episodic",10,10,2,15,26,20,150,1,1,663,"En","Endangered",1,0,0,"Wim_0663","Forest/Woodland","Woody vegetation"]
["Wimmera","Wim_","Box Ironbark Forest","WimmeraBox Ironbark Forest","Wim_0061",70,15,20,30,0,5,null,null,null,null,7,25,4,5,2,1,null,null,9,20,null,null,1,1,null,null,8,15,null,null,null,null,null,null,null,null,null,null,null,null,null,null,0,10,"0","20","Continuous",0,9,11,9,30,20,200,1,1,61,"D","Depleted",1,0,0,"Wim_0061","Forest/Woodland","Woody vegetation"]
["Wimmera","Wim_","Brackish Sedgeland","WimmeraBrackish Sedgeland","Wim_0013",0,0,0,null,null,null,null,null,null,null,null,null,null,null,null,null,1,5,5,10,5,5,1,5,null,null,4,10,3,50,"3","5",null,null,null,null,null,null,null,null,null,null,null,null,null,null,"Episodic",5,7,null,11,null,10,0,1.36,1.36,13,"En","Endangered",6,0,0,"Wim_0013","wetlands","Non-woody wetland vegetation"]
["Wimmera","Wim_","Brackish Wetland","WimmeraBrackish Wetland","Wim_0656",0,0,0,null,null,null,null,null,null,null,null,null,null,null,null,null,1,5,3,15,3,10,1,10,2,10,2,5,3,15,null,null,null,null,null,null,null,null,null,null,1,1,null,null,"0","10","Episodic",5,9,null,7,null,10,0,1.36,1.36,656,"En","Endangered",6,0,0,"Wim_0656","wetlands","Non-woody wetland vegetation"]
["Wimmera","Wim_","Cane Grass Wetland","WimmeraCane Grass Wetland","Wim_0291",0,0,0,null,null,null,null,null,null,null,null,null,null,null,null,null,null,null,null,null,2,10,null,null,null,null,null,null,2,40,null,null,null,null,null,null,null,null,null,null,null,null,null,null,null,null,"Episodic",5,2,null,2,null,10,0,1.36,1.36,291,"Vu","Vulnerable",6,0,0,"Wim_0291","wetlands","Non-woody wetland vegetation"]
["Wimmera","Wim_","Chenopod Grassland","WimmeraChenopod Grassland","Wim_0829",0,0,0,null,null,null,null,null,null,null,1,10,6,30,null,null,1,1,5,15,4,5,null,null,null,null,3,20,null,null,null,null,null,null,null,null,null,null,null,null,null,null,0,10,"0","20","Continuous",0,8,7,10,40,5,0,1.36,1.36,829,"En","Endangered",5,"y",0,"Wim_0829","grasslands","Other grassland vegetation"]
["Wimmera","Wim_","Creekline Grassy Woodland","WimmeraCreekline Grassy Woodland","Wim_0068",80,15,15,15,0,5,null,null,null,null,2,10,2,1,null,null,null,null,5,10,1,1,3,20,null,null,6,25,null,null,null,null,null,null,null,null,null,null,null,null,null,null,0,10,null,null,"Continuous",0,8,4,6,11,40,200,1,1,68,"En","Endangered",1,0,0,"Wim_0068","Forest/Woodland","Woody vegetation"]
["Wimmera","Wim_","Creekline Herb-rich Woodland","WimmeraCreekline Herb-rich Woodland","Wim_0164",70,10,15,15,0,5,1,5,null,null,3,15,1,5,null,null,null,null,6,20,1,5,1,20,1,5,2,5,1,5,null,null,null,null,null,null,null,null,null,null,null,null,0,20,null,null,"Continuous",0,11,5,7,25,20,100,1,1,164,"En","Endangered",1,0,0,"Wim_0164","Forest/Woodland","Woody vegetation"]
["Wimmera","Wim_","Creekline Sedgy Woodland","WimmeraCreekline Sedgy Woodland","Wim_0640",80,15,15,15,0,5,2,10,null,null,2,5,2,1,null,null,2,5,5,10,1,1,3,15,1,5,6,20,null,null,null,null,null,null,null,null,null,null,null,null,null,null,0,10,null,null,"Continuous",0,11,6,8,16,40,200,1,1,640,"En","Endangered",1,0,0,"Wim_0640","Forest/Woodland","Woody vegetation"]
["Wimmera","Wim_","Damp Heathland","WimmeraDamp Heathland","Wim_0710",0,0,0,null,null,null,null,null,null,null,6,30,5,20,2,5,null,null,6,10,2,1,1,5,1,1,4,10,3,15,null,null,null,null,null,null,null,null,null,null,2,5,0,10,"0","10","Episodic",30,12,11,8,50,20,0,1.36,1.36,710,"LC","Least Concern",4,0,0,"Wim_0710","heathlands","Woody vegetation"]
["Wimmera","Wim_","Damp Sands Herb-rich Woodland","WimmeraDamp Sands Herb-rich Woodland","Wim_0003",70,15,15,10,0,5,1,5,null,null,4,25,7,15,null,null,1,1,8,10,3,1,1,5,null,null,7,10,4,10,"2","1","1","15",1,10,null,null,null,null,2,5,0,10,null,null,"Continuous",0,15,12,12,45,40,150,1,1,3,"Vu","Vulnerable",1,0,0,"Wim_0003","Forest/Woodland","Woody vegetation"]
["Wimmera","Wim_","Deep Freshwater Marsh","WimmeraDeep Freshwater Marsh","Wim_0681",null,null,0,null,null,null,null,null,null,null,null,null,null,null,null,null,null,null,null,null,null,null,null,null,null,null,null,null,null,null,null,null,null,null,null,null,null,null,null,null,null,null,null,null,null,null,null,5,0,null,null,null,null,0,1.36,1.36,681,"En","Endangered",6,0,0,"Wim_0681","wetlands","Non-woody wetland vegetation"]
["Wimmera","Wim_","Drainage-line Woodland","WimmeraDrainage-line Woodland","Wim_0679",80,15,15,15,0,5,null,null,null,null,null,null,null,null,null,null,2,5,5,10,1,1,3,15,1,5,6,20,null,null,null,null,null,null,null,null,null,null,null,null,null,null,0,10,null,null,"Continuous",0,8,null,8,null,40,200,1,1,679,"En","Endangered",1,0,0,"Wim_0679","Forest/Woodland","Woody vegetation"]
["Wimmera","Wim_","Dry Creekline Woodland","WimmeraDry Creekline Woodland","Wim_0285",70,15,15,20,0,5,null,null,null,null,4,20,null,null,null,null,1,1,5,10,null,null,1,5,null,null,5,20,2,5,"2","1",null,null,null,null,null,null,null,null,null,null,0,20,null,null,"Continuous",0,9,4,6,20,20,200,1,1,285,"En","Endangered",1,0,0,"Wim_0285","Forest/Woodland","Woody vegetation"]
["Wimmera","Wim_","Dune Soak Woodland","WimmeraDune Soak Woodland","Wim_0673",70,15,15,20,0,5,2,20,null,null,8,35,5,10,2,1,3,5,5,10,null,null,1,1,2,5,8,30,6,20,"3","5",null,null,1,1,null,null,null,null,1,1,0,10,null,null,"Continuous",0,15,15,8,65,20,150,1,1,673,"En","Endangered",1,0,0,"Wim_0673","Forest/Woodland","Woody vegetation"]
["Wimmera","Wim_","Dunefield Heathland","WimmeraDunefield Heathland","Wim_0089",0,0,0,null,null,null,null,null,null,null,6,50,6,20,null,null,null,null,4,5,null,null,1,1,null,null,3,5,2,5,null,null,"1","1",null,null,null,null,null,null,null,null,null,null,"0","10","Episodic",20,8,12,4,70,5,0,1.36,1.36,89,"LC","Least Concern",4,0,0,"Wim_0089","heathlands","Woody vegetation"]
["Wimmera","Wim_","Escarpment Shrubland","WimmeraEscarpment Shrubland","Wim_0895",0,0,0,null,null,null,null,null,null,null,2,10,2,5,null,null,3,5,4,10,5,5,1,5,1,5,9,25,3,5,null,null,null,null,null,null,null,null,null,null,1,5,0,10,"0","20","Continuous",0,12,4,12,15,20,50,1.1499999999999999,1,895,"En","Endangered",1,0,0,"Wim_0895","Forest/Woodland","Woody vegetation"]
["Wimmera","Wim_","Floodplain Riparian Woodland","WimmeraFloodplain Riparian Woodland","Wim_0056",80,15,20,15,0,5,1,5,null,null,3,10,null,null,null,null,5,10,4,10,2,5,2,15,1,5,6,20,1,5,null,null,null,null,null,null,null,null,null,null,null,null,0,10,null,null,"Episodic",5,11,4,11,15,40,300,1,1,56,"En","Endangered",1,0,0,"Wim_0056","Forest/Woodland","Woody vegetation"]
["Wimmera","Wim_","Freshwater Lignum Shrubland","WimmeraFreshwater Lignum Shrubland","Wim_0657",0,0,0,null,null,null,null,null,null,null,1,20,null,null,null,null,2,5,3,20,3,10,1,5,null,null,6,25,3,10,null,null,null,null,null,null,null,null,null,null,null,null,0,10,"0","10","Episodic",10,9,1,8,20,10,0,1.36,1.36,657,"En","Endangered",6,0,0,"Wim_0657","wetlands","Non-woody wetland vegetation"]
["Wimmera","Wim_","Freshwater Meadow","WimmeraFreshwater Meadow","Wim_0680",null,null,0,null,null,null,null,null,null,null,null,null,null,null,null,null,null,null,null,null,null,null,null,null,null,null,null,null,null,null,null,null,null,null,null,null,null,null,null,null,null,null,null,null,null,null,null,5,0,null,null,null,null,0,1.36,1.36,680,"En","Endangered",6,0,0,"Wim_0680","wetlands","Non-woody wetland vegetation"]
["Wimmera","Wim_","Grassy Dry Forest","WimmeraGrassy Dry Forest","Wim_0022",60,20,20,30,0,5,1,5,null,null,3,5,3,5,2,1,3,10,16,30,3,5,2,5,null,null,13,30,4,5,null,null,null,null,1,5,null,null,null,null,1,1,0,10,"0","10","Continuous",0,15,7,22,15,20,200,1,1,22,"D","Depleted",1,0,0,"Wim_0022","Forest/Woodland","Woody vegetation"]
["Wimmera","Wim_","Grassy Woodland","WimmeraGrassy Woodland","Wim_0175",70,15,15,15,0,5,null,null,null,null,6,15,3,5,null,null,4,10,10,15,2,1,2,5,null,null,11,25,3,5,null,null,null,null,null,null,null,null,null,null,null,null,0,10,"0","10","Continuous",0,11,9,16,20,20,150,1,1,175,"En","Endangered",1,0,0,"Wim_0175","Forest/Woodland","Woody vegetation"]
["Wimmera","Wim_","Heathy Herb-rich Woodland","WimmeraHeathy Herb-rich Woodland","Wim_0179",70,15,15,10,0,5,1,5,null,null,6,20,7,15,2,5,1,1,6,5,2,1,2,5,null,null,6,5,2,5,null,null,null,null,1,25,null,null,null,null,null,null,0,10,null,null,"Continuous",0,13,14,9,40,20,150,1,1,179,"D","Depleted",1,0,0,"Wim_0179","Forest/Woodland","Woody vegetation"]
["Wimmera","Wim_","Heathy Mallee","WimmeraHeathy Mallee","Wim_0088",0,0,4,25,null,null,null,null,null,null,6,30,7,20,null,null,2,1,3,5,null,null,1,1,null,null,3,5,2,5,null,null,"1","5",null,null,null,null,null,null,null,null,null,null,"0","10","Episodic",20,9,13,5,50,10,50,1.1499999999999999,1.1499999999999999,88,"LC","Least Concern",2,0,0,"Wim_0088","scrubs/shrublands/mallee with logs","Woody vegetation"]
["Wimmera","Wim_","Heathy Woodland","WimmeraHeathy Woodland","Wim_0048",50,15,10,15,null,null,null,null,null,null,8,40,9,25,2,5,2,1,6,5,null,null,2,5,null,null,7,10,3,10,null,null,null,null,null,null,null,null,null,null,null,null,0,10,"0","10","Episodic",20,10,17,8,65,40,150,1,1,48,"LC","Least Concern",1,0,0,"Wim_0048","Forest/Woodland","Woody vegetation"]
["Wimmera","Wim_","Higher Rainfall Shallow Sands Woodland","WimmeraHigher Rainfall Shallow Sands Woodland","Wim_0882_61",70,15,15,15,0,5,1,5,null,null,3,15,3,10,2,5,1,1,14,20,4,5,null,null,null,null,13,30,3,5,null,null,null,null,null,null,null,null,null,null,null,null,0,10,"0","10","Continuous",0,12,7,19,30,20,150,1,{"$error":"#N/A"},{"$error":"#N/A"},{"$error":"#N/A"},{"$error":"#N/A"},{"$error":"#N/A"},{"$error":"#N/A"},{"$error":"#N/A"},{"$error":"#N/A"},{"$error":"#N/A"},{"$error":"#N/A"}]
["Wimmera","Wim_","Hillcrest Herb-rich Woodland","WimmeraHillcrest Herb-rich Woodland","Wim_0070",70,15,10,15,0,5,2,10,null,null,2,5,2,1,null,null,4,10,14,20,2,5,1,1,null,null,12,30,3,5,null,null,null,null,1,1,null,null,null,null,null,null,0,10,"0","10","Continuous",0,13,6,20,16,20,150,1,1,70,"D","Depleted",1,0,0,"Wim_0070","Forest/Woodland","Woody vegetation"]
["Wimmera","Wim_","Hills Herb-rich Woodland","WimmeraHills Herb-rich Woodland","Wim_0071",70,15,15,15,0,5,1,5,null,null,1,5,1,1,1,1,1,5,20,30,7,10,1,1,null,null,15,25,5,15,null,null,null,null,null,null,null,null,null,null,null,null,0,10,"0","10","Continuous",0,13,3,28,11,20,150,1,1,71,"Vu","Vulnerable",1,0,0,"Wim_0071","Forest/Woodland","Woody vegetation"]
["Wimmera","Wim_","Inland Saltmarsh","WimmeraInland Saltmarsh","Wim_0677",0,0,0,null,null,null,null,null,null,null,null,null,4,20,null,null,null,null,7,5,3,5,null,null,null,null,2,1,2,1,null,null,null,null,null,null,null,null,null,null,null,null,null,null,"0","10","Continuous",0,6,4,10,20,0,0,1.36,1.36,677,"En","Endangered",5,0,0,"Wim_0677","grasslands","Other grassland vegetation"]
["Wimmera","Wim_","Intermittent Swampy Woodland","WimmeraIntermittent Swampy Woodland","Wim_0813",70,15,15,20,0,5,null,null,null,null,1,5,1,5,null,null,2,5,5,10,1,5,null,null,null,null,3,30,2,10,null,null,null,null,null,null,null,null,null,null,null,null,null,null,null,null,"Continuous",0,8,2,8,10,20,200,1,1,813,"Vu","Vulnerable",1,0,0,"Wim_0813","Forest/Woodland","Woody vegetation"]
["Wimmera","Wim_","Lateritic Woodland","WimmeraLateritic Woodland","Wim_0704",70,15,15,15,0,5,1,5,null,null,11,25,11,20,4,5,2,5,14,10,4,5,2,5,1,1,15,20,4,5,"4","1",null,null,null,null,null,null,null,null,3,5,0,10,"0","10","Continuous",0,16,23,20,50,20,150,1,1,704,"Vu","Vulnerable",1,0,0,"Wim_0704","Forest/Woodland","Woody vegetation"]
["Wimmera","Wim_","Lignum Cane Grass Swamp","WimmeraLignum Cane Grass Swamp","Wim_0655",0,0,0,null,null,null,null,null,null,null,1,25,null,null,2,10,null,null,null,null,null,null,null,null,null,null,null,null,3,40,null,null,null,null,null,null,null,null,null,null,null,null,null,null,"0","10","Episodic",5,4,1,null,25,10,0,1.36,1.36,655,"En","Endangered",6,0,0,"Wim_0655","wetlands","Non-woody wetland vegetation"]
["Wimmera","Wim_","Lignum Swamp","WimmeraLignum Swamp","Wim_0104",0,0,0,null,null,null,null,null,null,null,1,20,null,null,null,null,4,5,8,25,2,10,null,null,1,5,2,5,2,5,null,null,null,null,null,null,null,null,null,null,1,1,null,null,"0","10","Continuous",0,9,1,14,20,5,0,1.36,1.36,104,"En","Endangered",6,0,0,"Wim_0104","wetlands","Non-woody wetland vegetation"]
["Wimmera","Wim_","Lignum Swampy Woodland","WimmeraLignum Swampy Woodland","Wim_0823",70,15,15,20,0,5,1,5,null,null,2,30,1,5,null,null,2,1,8,10,4,10,null,null,1,5,2,5,3,15,null,null,null,null,null,null,null,null,null,null,null,null,null,null,"0","10","Continuous",0,11,4,14,40,5,100,1,1,823,"Vu","Vulnerable",1,0,0,"Wim_0823","Forest/Woodland","Woody vegetation"]
["Wimmera","Wim_","Low Chenopod Shrubland","WimmeraLow Chenopod Shrubland","Wim_0102",null,0,0,null,null,null,null,null,null,null,null,null,null,null,null,null,null,null,null,null,null,null,null,null,null,null,null,null,null,null,null,null,null,null,null,null,null,null,null,null,null,null,null,null,null,null,null,0,0,null,null,null,0,0,1.36,1.36,102,"D","Depleted",5,0,0,"Wim_0102","grasslands","Other grassland vegetation"]
["Wimmera","Wim_","Low Rises Woodland","WimmeraLow Rises Woodland","Wim_0066",60,20,15,20,0,5,2,5,null,null,5,15,3,5,null,null,1,1,3,5,2,1,null,null,null,null,8,25,1,1,null,null,null,null,null,null,null,null,null,null,null,null,0,10,"0","10","Continuous",0,11,10,6,25,15,200,1,1,66,"En","Endangered",1,0,0,"Wim_0066","Forest/Woodland","Woody vegetation"]
["Wimmera","Wim_","Lowan Sands Mallee","WimmeraLowan Sands Mallee","Wim_0087",0,0,7,25,null,null,null,null,null,null,5,35,7,30,1,1,null,null,4,10,null,null,1,1,null,null,5,5,2,10,null,null,null,null,null,null,null,null,null,null,null,null,null,null,"0","10","Episodic",30,8,12,4,65,5,50,1.1499999999999999,1.1499999999999999,87,"LC","Least Concern",2,0,0,"Wim_0087","scrubs/shrublands/mallee with logs","Woody vegetation"]
["Wimmera","Wim_","Lower Rainfall Shallow Sands Woodland","WimmeraLower Rainfall Shallow Sands Woodland","Wim_0882_62",60,15,15,20,0,5,1,5,null,null,3,10,4,20,2,5,1,1,7,15,3,5,null,null,null,null,8,25,3,1,"2","1",null,null,null,null,null,null,null,null,null,null,0,10,"0","10","Continuous",0,13,8,11,35,20,200,1,{"$error":"#N/A"},{"$error":"#N/A"},{"$error":"#N/A"},{"$error":"#N/A"},{"$error":"#N/A"},{"$error":"#N/A"},{"$error":"#N/A"},{"$error":"#N/A"},{"$error":"#N/A"},{"$error":"#N/A"}]
["Wimmera","Wim_","Lunette Woodland","WimmeraLunette Woodland","Wim_0652",80,8,15,10,0,5,1,5,null,null,3,10,2,1,1,1,3,5,8,15,3,5,2,5,null,null,12,45,2,5,null,null,null,null,null,null,null,null,null,null,null,null,0,10,"0","10","Continuous",0,13,6,14,16,10,100,1,1,652,"En","Endangered",1,0,0,"Wim_0652","Forest/Woodland","Woody vegetation"]
["Wimmera","Wim_","Metamorphic Slopes Shrubby Woodland","WimmeraMetamorphic Slopes Shrubby Woodland","Wim_0069",40,15,8,15,null,null,1,5,null,null,7,25,3,5,1,1,2,5,11,20,2,1,1,5,null,null,7,15,null,null,null,null,null,null,1,5,null,null,null,null,null,null,0,10,"0","20","Continuous",0,12,11,15,35,20,150,1,1,69,"D","Depleted",1,0,0,"Wim_0069","Forest/Woodland","Woody vegetation"]
["Wimmera","Wim_","Non-treed Semi-arid Chenopod Woodland","WimmeraNon-treed Semi-arid Chenopod Woodland","Wim_0098_61",null,0,0,null,null,null,null,null,null,null,null,null,null,null,null,null,null,null,null,null,null,null,null,null,null,null,null,null,null,null,null,null,null,null,null,null,null,null,null,null,null,null,null,null,null,null,null,0,0,null,null,null,0,0,0,{"$error":"#N/A"},{"$error":"#N/A"},{"$error":"#N/A"},{"$error":"#N/A"},{"$error":"#N/A"},{"$error":"#N/A"},{"$error":"#N/A"},{"$error":"#N/A"},{"$error":"#N/A"},{"$error":"#N/A"}]
["Wimmera","Wim_","Northern Wimmera Riverine Chenopod Woodland","WimmeraNorthern Wimmera Riverine Chenopod Woodland","Wim_0103_62",40,5,15,10,0,5,1,5,null,null,3,30,5,25,1,1,null,null,5,5,5,10,null,null,null,null,2,5,null,null,null,null,null,null,null,null,null,null,null,null,null,null,null,null,"0","10","Continuous",0,9,9,10,60,5,50,1,{"$error":"#N/A"},{"$error":"#N/A"},{"$error":"#N/A"},{"$error":"#N/A"},{"$error":"#N/A"},{"$error":"#N/A"},{"$error":"#N/A"},{"$error":"#N/A"},{"$error":"#N/A"},{"$error":"#N/A"}]
["Wimmera","Wim_","Parilla Mallee","WimmeraParilla Mallee","Wim_0981",35,25,10,25,0,5,null,null,null,null,4,10,3,10,null,null,1,1,3,5,5,5,null,null,null,null,6,20,1,5,null,null,null,null,null,null,null,null,null,null,null,null,0,10,"0","10","Continuous",0,10,7,9,20,20,150,1,1,981,"En","Endangered",1,0,"y","Wim_0981","Forest/Woodland","Woody vegetation"]
["Wimmera","Wim_","Permanent Open Freshwater","WimmeraPermanent Open Freshwater","Wim_0682",null,0,0,null,null,null,null,null,null,null,null,null,null,null,null,null,null,null,null,null,null,null,null,null,null,null,null,null,null,null,null,null,null,null,null,null,null,null,null,null,null,null,null,null,null,null,null,0,0,null,null,null,0,0,0,{"$error":"#N/A"},{"$error":"#N/A"},{"$error":"#N/A"},{"$error":"#N/A"},{"$error":"#N/A"},{"$error":"#N/A"},{"$error":"#N/A"},{"$error":"#N/A"},{"$error":"#N/A"},{"$error":"#N/A"}]
["Wimmera","Wim_","Permanent Saline","WimmeraPermanent Saline","Wim_0684",null,0,0,null,null,null,null,null,null,null,null,null,null,null,null,null,null,null,null,null,null,null,null,null,null,null,null,null,null,null,null,null,null,null,null,null,null,null,null,null,null,null,null,null,null,null,null,0,0,null,null,null,0,0,0,{"$error":"#N/A"},{"$error":"#N/A"},{"$error":"#N/A"},{"$error":"#N/A"},{"$error":"#N/A"},{"$error":"#N/A"},{"$error":"#N/A"},{"$error":"#N/A"},{"$error":"#N/A"},{"$error":"#N/A"}]
["Wimmera","Wim_","Plains Grassland","WimmeraPlains Grassland","Wim_0132",0,0,0,null,null,null,null,null,null,null,null,null,2,5,null,null,3,5,6,20,3,10,1,5,1,1,5,30,2,5,null,null,null,null,null,null,null,null,null,null,null,null,0,10,"0","20","Episodic",5,10,2,12,5,10,0,1.36,1.36,132,"En","Endangered",5,"y",0,"Wim_0132","grasslands","Other grassland vegetation"]
["Wimmera","Wim_","Plains Grassy Wetland","WimmeraPlains Grassy Wetland","Wim_0125",0,0,0,null,null,null,null,null,null,null,null,null,null,null,null,null,5,5,11,20,6,10,2,5,null,null,7,20,3,40,null,null,null,null,null,null,null,null,null,null,null,null,0,10,null,null,"Episodic",5,7,null,22,null,10,50,1.36,1.36,125,"En","Endangered",6,"y",0,"Wim_0125","wetlands","Non-woody wetland vegetation"]
["Wimmera","Wim_","Plains Grassy Woodland","WimmeraPlains Grassy Woodland","Wim_0055",80,15,15,15,0,5,null,null,null,null,1,5,2,5,1,1,1,1,18,25,4,10,1,1,null,null,15,40,4,5,null,null,null,null,null,null,null,null,null,null,null,null,0,10,null,null,"Continuous",0,11,3,23,10,10,100,1,1,55,"En","Endangered",1,0,0,"Wim_0055","Forest/Woodland","Woody vegetation"]
["Wimmera","Wim_","Plains Riparian Shrubby Woodland","WimmeraPlains Riparian Shrubby Woodland","Wim_0659",80,15,15,20,0,5,1,5,null,null,4,20,2,5,null,null,3,5,9,15,2,1,4,15,1,5,13,20,3,5,"3","5",null,null,null,null,null,null,null,null,1,5,0,10,null,null,"Continuous",0,14,7,14,30,20,200,1,1,659,"Vu","Vulnerable",1,0,0,"Wim_0659","Forest/Woodland","Woody vegetation"]
["Wimmera","Wim_","Plains Savannah","WimmeraPlains Savannah","Wim_0826",0,0,0,null,null,null,null,null,null,null,null,null,2,5,null,null,3,5,6,20,3,10,1,5,1,5,5,35,2,5,null,null,null,null,null,null,null,null,null,null,null,null,0,10,"0","25","Continuous",0,10,2,12,5,5,0,1,1,826,"En","Endangered",1,0,0,"Wim_0826","Forest/Woodland","Woody vegetation"]
["Wimmera","Wim_","Plains Sedgy Wetland",{"$f":"CONCATENATE(A1283,C1283)","v":"WimmeraPlains Sedgy Wetland"},"Wim_0647",0,0,0,null,null,null,null,null,null,null,null,null,null,null,null,null,2,5,4,20,2,5,null,null,1,25,4,10,1,5,null,null,null,null,null,null,null,null,null,null,null,null,null,null,null,null,"Episodic",5,6,null,8,null,10,50,1.36,1.36,647,"En","Endangered",6,0,0,"Wim_0647","wetlands","Non-woody wetland vegetation"]
["Wimmera","Wim_","Plains Sedgy Woodland","WimmeraPlains Sedgy Woodland","Wim_0283",70,15,15,10,0,5,null,null,null,null,2,5,2,1,null,null,4,15,10,20,2,5,2,1,1,1,13,30,4,20,null,null,null,null,null,null,null,null,null,null,null,null,0,10,null,null,"Continuous",0,11,4,16,6,10,150,1,1,283,"D","Depleted",1,0,0,"Wim_0283","Forest/Woodland","Woody vegetation"]
["Wimmera","Wim_","Plains Swampy Woodland","WimmeraPlains Swampy Woodland","Wim_0651",80,10,15,10,0,5,1,5,null,null,4,15,null,null,null,null,3,5,8,20,4,5,3,30,1,1,7,10,2,5,null,null,null,null,null,null,null,null,null,null,null,null,0,20,null,null,"Continuous",0,11,5,15,20,10,100,1,1,651,"En","Endangered",1,0,0,"Wim_0651","Forest/Woodland","Woody vegetation"]
["Wimmera","Wim_","Plains Woodland","WimmeraPlains Woodland","Wim_0803",70,15,15,15,0,5,null,null,null,null,2,5,2,5,1,1,1,1,20,25,4,10,1,5,1,1,16,30,3,5,null,null,null,null,null,null,null,null,null,null,null,null,0,10,"0","10","Continuous",0,13,4,25,10,10,100,1,1,803,"En","Endangered",1,0,0,"Wim_0803","Forest/Woodland","Woody vegetation"]
["Wimmera","Wim_","Red Gum Swamp","WimmeraRed Gum Swamp","Wim_0292",80,10,15,10,0,5,1,10,null,null,1,10,null,null,null,null,3,10,10,25,3,5,2,5,null,null,8,20,2,15,null,null,null,null,null,null,null,null,null,null,null,null,0,10,null,null,"Episodic",5,10,2,16,20,20,150,1,1,292,"Vu","Vulnerable",1,0,0,"Wim_0292","Forest/Woodland","Woody vegetation"]
["Wimmera","Wim_","Red Swale Mallee","WimmeraRed Swale Mallee","Wim_0095",0,0,6,30,null,null,null,null,null,null,4,10,3,5,null,null,1,1,7,10,2,1,1,1,null,null,3,5,null,null,null,null,null,null,null,null,null,null,null,null,null,null,0,10,"0","20","Episodic",30,9,7,10,15,15,50,1.1499999999999999,1.1499999999999999,95,"LC","Least Concern",2,0,0,"Wim_0095","scrubs/shrublands/mallee with logs","Woody vegetation"]
["Wimmera","Wim_","Ridged Plains Mallee","WimmeraRidged Plains Mallee","Wim_0096",40,15,10,10,0,5,null,null,null,null,3,5,3,10,1,1,2,5,5,10,5,15,1,5,1,1,3,20,1,1,null,null,null,null,null,null,null,null,null,null,null,null,0,10,"0","20","Continuous",0,13,6,12,15,5,50,1,1,96,"En","Endangered",1,0,"y","Wim_0096","Forest/Woodland","Woody vegetation"]
["Wimmera","Wim_","Riparian Scrub","WimmeraRiparian Scrub","Wim_0191",0,0,0,null,null,null,null,null,null,null,4,10,2,1,1,1,1,5,4,5,null,null,2,25,null,null,1,10,3,15,null,null,null,null,null,null,null,null,null,null,null,null,0,20,null,null,"Continuous",0,9,6,5,11,40,0,1.25,1.25,191,"En","Endangered",3,0,0,"Wim_0191","scrubs/shrublands/mallee without logs","Woody vegetation"]
["Wimmera","Wim_","Riparian Shrubland","WimmeraRiparian Shrubland","Wim_0019",0,0,0,null,null,null,null,null,null,null,6,40,null,null,null,null,2,5,6,10,2,5,3,10,null,null,3,10,2,1,null,null,null,null,2,5,null,null,null,null,2,5,0,10,null,null,"Episodic",5,10,6,10,40,20,100,1.25,1.25,19,"D","Depleted",3,0,0,"Wim_0019","scrubs/shrublands/mallee without logs","Woody vegetation"]
["Wimmera","Wim_","Riparian Woodland","WimmeraRiparian Woodland","Wim_0641",80,15,15,10,0,5,2,10,null,null,2,10,1,1,null,null,4,10,5,10,1,5,3,10,null,null,4,30,2,5,null,null,null,null,null,null,null,null,null,null,1,5,0,10,null,null,"Continuous",0,12,5,10,21,30,200,1,1,641,"Vu","Vulnerable",1,0,0,"Wim_0641","Forest/Woodland","Woody vegetation"]
["Wimmera","Wim_","Riverine Chenopod Woodland","WimmeraRiverine Chenopod Woodland","Wim_0103",null,0,0,null,null,null,null,null,null,null,null,null,null,null,null,null,null,null,null,null,null,null,null,null,null,null,null,null,null,null,null,null,null,null,null,null,null,null,null,null,null,null,null,null,null,null,null,0,0,null,null,null,0,0,1,1,103,"En","Endangered",1,0,0,"Wim_0103","Forest/Woodland","Woody vegetation"]
["Wimmera","Wim_","Rocky Outcrop Shrubland","WimmeraRocky Outcrop Shrubland","Wim_0028",0,0,0,null,null,null,null,null,null,null,9,45,2,10,1,1,2,1,2,5,null,null,2,5,null,null,5,10,null,null,null,null,null,null,null,null,null,null,null,null,null,null,0,20,"0","10","Continuous",0,9,11,4,55,40,0,1.36,1.36,28,"Ra","Rare",4,0,0,"Wim_0028","heathlands","Woody vegetation"]
["Wimmera","Wim_","Salt Paperbark Woodland","WimmeraSalt Paperbark Woodland","Wim_0676",0,0,8,10,null,null,null,null,null,null,null,null,null,null,1,10,null,null,3,15,3,10,null,null,null,null,1,1,null,null,null,null,null,null,null,null,null,null,null,null,null,null,null,null,"0","10","Continuous",0,5,null,6,null,0,100,1.1499999999999999,1.1499999999999999,676,"Vu","Vulnerable",2,0,0,"Wim_0676","scrubs/shrublands/mallee with logs","Woody vegetation"]
["Wimmera","Wim_","Samphire Shrubland","WimmeraSamphire Shrubland","Wim_0101",0,0,0,null,null,null,null,null,null,null,null,null,4,20,null,null,null,null,7,5,3,5,null,null,null,null,2,1,2,1,null,null,null,null,null,null,null,null,null,null,null,null,null,null,"0","10","Continuous",0,6,4,10,20,0,0,1.36,1.36,101,"LC","Least Concern",5,0,0,"Wim_0101","grasslands","Other grassland vegetation"]
["Wimmera","Wim_","Sand Forest","WimmeraSand Forest","Wim_0134",70,15,20,30,0,5,1,5,null,null,3,5,1,5,2,5,null,null,2,5,null,null,1,1,null,null,7,15,2,1,null,null,null,null,1,50,null,null,null,null,null,null,0,10,null,null,"Continuous",0,11,5,2,15,40,150,1,1,134,"En","Endangered",1,0,0,"Wim_0134","Forest/Woodland","Woody vegetation"]
["Wimmera","Wim_","Sand Heathland","WimmeraSand Heathland","Wim_0006",0,0,0,null,null,null,null,null,null,null,7,30,8,25,2,5,null,null,1,1,null,null,1,1,null,null,4,10,2,15,null,null,null,null,null,null,null,null,null,null,null,null,0,10,null,null,"Episodic",30,8,15,1,55,20,0,1.36,1.36,6,"D","Depleted",4,0,0,"Wim_0006","heathlands","Woody vegetation"]
["Wimmera","Wim_","Sand Ridge Woodland","WimmeraSand Ridge Woodland","Wim_0264",70,15,15,15,0,5,null,null,null,null,4,20,3,10,2,5,2,5,10,15,5,5,3,10,null,null,8,15,null,null,null,null,null,null,1,5,null,null,null,null,null,null,0,10,"0","10","Continuous",0,12,7,17,30,10,150,1,1,264,"En","Endangered",1,0,0,"Wim_0264","Forest/Woodland","Woody vegetation"]
["Wimmera","Wim_","Sandstone Ridge Shrubland","WimmeraSandstone Ridge Shrubland","Wim_0093",0,0,3,15,null,null,null,null,null,null,6,40,5,20,1,5,2,1,5,10,null,null,1,5,null,null,6,15,null,null,null,null,null,null,null,null,null,null,null,null,2,1,0,10,"0","20","Episodic",30,10,11,7,60,20,50,1.1499999999999999,1.1499999999999999,93,"Vu","Vulnerable",2,0,0,"Wim_0093","scrubs/shrublands/mallee with logs","Woody vegetation"]
["Wimmera","Wim_","Sandy Stream Woodland","WimmeraSandy Stream Woodland","Wim_0674",80,10,15,10,0,5,2,15,null,null,5,15,null,null,null,null,null,null,6,10,3,5,2,10,2,20,10,30,3,5,null,null,null,null,null,null,null,null,null,null,null,null,0,10,null,null,"Continuous",0,10,7,9,30,40,200,1,1,674,"En","Endangered",1,0,0,"Wim_0674","Forest/Woodland","Woody vegetation"]
["Wimmera","Wim_","Scree-slope Woodland","WimmeraScree-slope Woodland","Wim_0709",40,10,15,20,0,5,null,null,null,null,2,10,null,null,2,5,1,5,6,30,1,1,1,1,null,null,5,25,null,null,null,null,null,null,null,null,null,null,null,null,null,null,0,10,"0","10","Continuous",0,10,2,8,10,15,200,1,1,709,"En","Endangered",1,0,0,"Wim_0709","Forest/Woodland","Woody vegetation"]
["Wimmera","Wim_","Seasonally Inundated Shrubby Woodland","WimmeraSeasonally Inundated Shrubby Woodland","Wim_0195",70,15,15,15,0,5,null,null,null,null,7,35,4,5,1,1,3,5,4,10,3,5,null,null,null,null,6,20,4,5,"3","1",null,null,null,null,null,null,"1","1",null,null,0,10,null,null,"Continuous",0,12,11,10,40,20,150,1,1,195,"LC","Least Concern",1,0,0,"Wim_0195","Forest/Woodland","Woody vegetation"]
["Wimmera","Wim_","Sedge Wetland","WimmeraSedge Wetland","Wim_0136",80,5,15,10,0,5,null,null,null,null,1,1,null,null,null,null,4,10,10,20,3,10,3,5,null,null,11,30,3,10,"2","5",null,null,null,null,null,null,null,null,null,null,0,10,"0","10","Episodic",5,11,1,17,1,10,50,1.36,1.36,136,"En","Endangered",6,0,0,"Wim_0136","wetlands","Non-woody wetland vegetation"]
["Wimmera","Wim_","Sedge-rich Woodland","WimmeraSedge-rich Woodland","Wim_0065",70,15,15,10,0,5,null,null,null,null,2,5,2,1,null,null,1,5,10,20,2,5,null,null,1,1,13,30,3,15,null,null,null,null,null,null,null,null,null,null,null,null,0,10,"0","10","Continuous",0,11,4,13,6,10,150,1,1,65,"Vu","Vulnerable",1,0,0,"Wim_0065","Forest/Woodland","Woody vegetation"]
["Wimmera","Wim_","Semi-arid Chenopod Woodland","WimmeraSemi-arid Chenopod Woodland","Wim_0098",null,0,0,null,null,null,null,null,null,null,null,null,null,null,null,null,null,null,null,null,null,null,null,null,null,null,null,null,null,null,null,null,null,null,null,null,null,null,null,null,null,null,null,null,null,null,null,0,0,null,null,null,0,0,1,1,98,"Vu","Vulnerable",1,0,0,"Wim_0098","Forest/Woodland","Woody vegetation"]
["Wimmera","Wim_","Semi-arid Woodland","WimmeraSemi-arid Woodland","Wim_0097",40,20,12,20,0,5,null,null,null,null,5,15,5,20,null,null,2,5,7,5,2,5,null,null,null,null,2,10,1,1,null,null,null,null,null,null,null,null,null,null,null,null,0,10,"0","20","Continuous",0,10,10,11,35,20,200,1,1,97,"Vu","Vulnerable",1,0,"y","Wim_0097","Forest/Woodland","Woody vegetation"]
["Wimmera","Wim_","Semi-permanent Saline","WimmeraSemi-permanent Saline","Wim_0683",null,0,0,null,null,null,null,null,null,null,null,null,null,null,null,null,null,null,null,null,null,null,null,null,null,null,null,null,null,null,null,null,null,null,null,null,null,null,null,null,null,null,null,null,null,null,null,0,0,null,null,null,0,0,0,{"$error":"#N/A"},{"$error":"#N/A"},{"$error":"#N/A"},{"$error":"#N/A"},{"$error":"#N/A"},{"$error":"#N/A"},{"$error":"#N/A"},{"$error":"#N/A"},{"$error":"#N/A"},{"$error":"#N/A"}]
["Wimmera","Wim_","Shallow Freshwater Marsh","WimmeraShallow Freshwater Marsh","Wim_0200",null,null,0,null,null,null,null,null,null,null,null,null,null,null,null,null,null,null,null,null,null,null,null,null,null,null,null,null,null,null,null,null,null,null,null,null,null,null,null,null,null,null,null,null,null,null,null,5,0,null,null,null,null,0,1.36,1.36,200,"Vu","Vulnerable",6,0,0,"Wim_0200","wetlands","Non-woody wetland vegetation"]
["Wimmera","Wim_","Shallow Sands Woodland","WimmeraShallow Sands Woodland","Wim_0882",null,null,null,null,null,null,null,null,null,null,null,null,null,null,null,null,null,null,null,null,null,null,null,null,null,null,null,null,null,null,null,null,null,null,null,null,null,null,null,null,null,null,null,null,null,null,null,null,0,null,null,null,null,0,1,1,882,"Vu","Vulnerable",1,0,0,"Wim_0882","Forest/Woodland","Woody vegetation"]
["Wimmera","Wim_","Shrubby Woodland","WimmeraShrubby Woodland","Wim_0282",70,15,15,20,0,5,2,10,null,null,6,40,3,5,1,1,2,1,5,5,2,5,2,10,1,5,4,10,2,10,null,null,null,null,1,1,null,null,null,null,null,null,0,10,null,null,"Continuous",0,14,11,9,55,20,150,1,1,282,"LC","Least Concern",1,0,0,"Wim_0282","Forest/Woodland","Woody vegetation"]
["Wimmera","Wim_","Southern Wimmera Riverine Chenopod Woodland","WimmeraSouthern Wimmera Riverine Chenopod Woodland","Wim_0103_61",60,10,15,10,0,5,1,5,null,null,3,5,3,5,null,null,null,null,10,20,3,5,1,1,null,null,7,25,2,5,null,null,null,null,null,null,null,null,null,null,null,null,0,10,"0","10","Continuous",0,11,7,13,15,20,150,1,{"$error":"#N/A"},{"$error":"#N/A"},{"$error":"#N/A"},{"$error":"#N/A"},{"$error":"#N/A"},{"$error":"#N/A"},{"$error":"#N/A"},{"$error":"#N/A"},{"$error":"#N/A"},{"$error":"#N/A"}]
["Wimmera","Wim_","Swamp Scrub","WimmeraSwamp Scrub","Wim_0053",0,0,0,null,null,null,null,null,null,null,2,10,1,1,null,null,5,5,9,15,3,10,2,15,2,5,4,15,3,15,null,null,null,null,2,5,null,null,null,null,1,5,0,20,null,null,"Continuous",0,12,3,17,11,40,0,1.25,1.1499999999999999,53,"En","Endangered",3,0,0,"Wim_0053","scrubs/shrublands/mallee without logs","Woody vegetation"]
["Wimmera","Wim_","Treed Escarpment Shrubland","WimmeraTreed Escarpment Shrubland","Wim_0895_61",70,15,0,0,0,5,3,10,null,null,2,10,2,5,null,null,3,5,4,10,5,5,1,5,1,5,9,25,3,5,null,null,null,null,null,null,null,null,null,null,1,5,0,10,"0","20","Continuous",0,14,7,12,25,20,150,1,{"$error":"#N/A"},{"$error":"#N/A"},{"$error":"#N/A"},{"$error":"#N/A"},{"$error":"#N/A"},{"$error":"#N/A"},{"$error":"#N/A"},{"$error":"#N/A"},{"$error":"#N/A"},{"$error":"#N/A"}]
["Wimmera","Wim_","Treed Plains Savannah","WimmeraTreed Plains Savannah","Wim_0826_61",40,5,10,10,0,5,null,null,null,null,null,null,2,5,null,null,3,5,6,20,3,10,1,5,1,5,5,35,2,5,null,null,null,null,null,null,null,null,null,null,null,null,0,10,"0","25","Continuous",0,11,2,12,5,5,50,1,{"$error":"#N/A"},{"$error":"#N/A"},{"$error":"#N/A"},{"$error":"#N/A"},{"$error":"#N/A"},{"$error":"#N/A"},{"$error":"#N/A"},{"$error":"#N/A"},{"$error":"#N/A"},{"$error":"#N/A"}]
["Wimmera","Wim_","Wetland Formation","WimmeraWetland Formation","Wim_0074",null,null,0,null,null,null,null,null,null,null,null,null,null,null,null,null,null,null,null,null,null,null,null,null,null,null,null,null,null,null,null,null,null,null,null,null,null,null,null,null,null,null,null,null,null,null,null,5,0,null,null,null,null,0,1.36,1.36,74,"En","Endangered",6,0,0,"Wim_0074","wetlands","Non-woody wetland vegetation"]
["Wimmera","Wim_","Woorinen Mallee","WimmeraWoorinen Mallee","Wim_0824",15,30,12,25,0,5,null,null,null,null,6,10,6,20,null,null,null,null,6,10,7,10,null,null,null,null,1,1,null,null,null,null,null,null,null,null,null,null,null,null,null,null,0,10,"0","15","Continuous",0,8,12,13,30,20,200,1,1,824,"Vu","Vulnerable",1,0,"y","Wim_0824","Forest/Woodland","Woody vegetation"]
[{"$error":"#N/A"},"GWet","No Benchmark Record",{"$error":"#N/A"},"GWet0000",null,0,0,null,null,null,null,null,null,null,null,null,null,null,null,null,null,null,null,null,null,null,null,null,null,null,null,null,null,null,null,null,null,null,null,null,null,null,null,null,null,null,null,null,null,null,null,0,0,null,null,null,0,0,0,{"$error":"#N/A"},{"$error":"#N/A"},{"$error":"#N/A"},{"$error":"#N/A"},{"$error":"#N/A"},{"$error":"#N/A"},{"$error":"#N/A"},{"$error":"#N/A"},{"$error":"#N/A"},{"$error":"#N/A"}]

{"sheet":"Dropdowns","index":4,"n_rows":89,"n_cols":9,"rows_kept":89,"cut":false,"hidden":true,"merged":[]}
["Percentage of all standing trees (dead and alive) coverage","Stock and other threats","Percentage of weed coverage","Logs and fallen timber coverage","Presence of organic litter","Level of rabbit presence","Type of veg","Authority responsible","Councils"]
["<select>","<select>","<select>","<select>","<select>","<select>","<select>","<select>","<select>"]
["None","No existing fence","< 1% cover","None","None","No rabbit presence recorded","Patch of native vegetation","Local Council","ALPINE"]
["0-30% cover","Existing fence requires upgrades","1-10% cover","Small amount","Small amount","Evidence of rabbits (poo) but no warrens","Scattered tree","Department of Environment, Land, Water and Planning","ARARAT"]
["30-70% cover","Existing stock exclusion fence ","10-30% cover","Large amount","Large amount","Rabbit warrens recorded","Revegetation","Trust for Nature","BALLARAT"]
["> 70% cover","Existing stock exclusion fence plus additional measures to exclude other threats","30-50% cover",null,null,null,"Patch of native vegetation and scattered tree",null,"BANYULE"]
[null,null,"> 50% cover",null,null,null,"Patch of native vegetation and revegetation",null,"BASS COAST"]
[null,null,null,null,null,null,"Scattered tree and revegetation",null,"BAW BAW"]
[null,null,null,null,null,null,"Patch of native vegetation, scattered tree and revegetation",null,"BAYSIDE"]
[null,null,null,null,null,null,null,null,"BENALLA"]
[null,null,null,null,null,null,null,null,"BOROONDARA"]
[null,null,null,null,null,null,null,null,"BRIMBANK"]
["Annual report",null,null,null,null,null,"Scattered trees","Revegetation","BULOKE"]
["<select>","<select>","<select>","<select>","<select>","<select>","<select>","<select>","CAMPASPE"]
["Same as previous year","Fence in working order","Same as previous year","Same as previous year","Same as previous year","Same as previous year","All planted trees alive","No change to revegetation since previous year","CARDINIA"]
["Less than previous year","Fence requires upgrades","Less than previous year","Less than previous year","Less than previous year","Rabbit activity less than previous year","Some planted trees dead","Revegetation established since previous year","CASEY"]
["More than previous year","Fence requires additional measures to exclude other threats","More than previous year","More than previous year","More than previous year","Rabbit activity more than previous year",null,"Some revegetation die-back since previous year","CENTRAL GOLDFIELDS"]
[null,null,null,null,null,null,null,null,"COLAC OTWAY"]
[null,null,null,null,null,null,null,null,"CORANGAMITE"]
[null,null,null,null,null,null,null,null,"DAREBIN"]
[null,null,null,null,null,null,null,null,"EAST GIPPSLAND"]
[null,null,null,null,null,null,null,null,"FALLS CREEK ALPINE RESORT (UNINC)"]
[null,null,null,null,null,null,null,null,"FRANKSTON"]
[null,null,null,null,null,null,null,null,"FRENCH-ELIZABETH-SANDSTONE ISLANDS (UNINC)"]
[null,null,null,null,null,null,null,null,"GABO ISLAND (UNINC)"]
[null,null,null,null,null,null,null,null,"GANNAWARRA"]
[null,null,null,null,null,null,null,null,"GLEN EIRA"]
[null,null,null,null,null,null,null,null,"GLENELG"]
[null,null,null,null,null,null,null,null,"GOLDEN PLAINS"]
[null,null,null,null,null,null,null,null,"GREATER BENDIGO"]
[null,null,null,null,null,null,null,null,"GREATER DANDENONG"]
[null,null,null,null,null,null,null,null,"GREATER GEELONG"]
[null,null,null,null,null,null,null,null,"GREATER SHEPPARTON"]
[null,null,null,null,null,null,null,null,"HEPBURN"]
[null,null,null,null,null,null,null,null,"HINDMARSH"]
[null,null,null,null,null,null,null,null,"HOBSONS BAY"]
[null,null,null,null,null,null,null,null,"HORSHAM"]
[null,null,null,null,null,null,null,null,"HUME"]
[null,null,null,null,null,null,null,null,"INDIGO"]
[null,null,null,null,null,null,null,null,"KINGSTON"]
[null,null,null,null,null,null,null,null,"KNOX"]
[null,null,null,null,null,null,null,null,"LAKE MOUNTAIN ALPINE RESORT (UNINC)"]
[null,null,null,null,null,null,null,null,"LATROBE"]
[null,null,null,null,null,null,null,null,"LODDON"]
[null,null,null,null,null,null,null,null,"MACEDON RANGES"]
[null,null,null,null,null,null,null,null,"MANNINGHAM"]
[null,null,null,null,null,null,null,null,"MANSFIELD"]
[null,null,null,null,null,null,null,null,"MARIBYRNONG"]
[null,null,null,null,null,null,null,null,"MAROONDAH"]
[null,null,null,null,null,null,null,null,"MELBOURNE"]
[null,null,null,null,null,null,null,null,"MELTON"]
[null,null,null,null,null,null,null,null,"MILDURA"]
[null,null,null,null,null,null,null,null,"MITCHELL"]
[null,null,null,null,null,null,null,null,"MOIRA"]
[null,null,null,null,null,null,null,null,"MONASH"]
[null,null,null,null,null,null,null,null,"MOONEE VALLEY"]
[null,null,null,null,null,null,null,null,"MOORABOOL"]
[null,null,null,null,null,null,null,null,"MORELAND"]
[null,null,null,null,null,null,null,null,"MORNINGTON PENINSULA"]
[null,null,null,null,null,null,null,null,"MOUNT ALEXANDER"]
[null,null,null,null,null,null,null,null,"MOUNT BAW BAW ALPINE RESORT (UNINC)"]
[null,null,null,null,null,null,null,null,"MOUNT BULLER ALPINE RESORT (UNINC)"]
[null,null,null,null,null,null,null,null,"MOUNT HOTHAM ALPINE RESORT (UNINC)"]
[null,null,null,null,null,null,null,null,"MOUNT STIRLING ALPINE RESORT (UNINC)"]
[null,null,null,null,null,null,null,null,"MOYNE"]
[null,null,null,null,null,null,null,null,"MURRINDINDI"]
[null,null,null,null,null,null,null,null,"NILLUMBIK"]
[null,null,null,null,null,null,null,null,"NORTHERN GRAMPIANS"]
[null,null,null,null,null,null,null,null,"PORT PHILLIP"]
[null,null,null,null,null,null,null,null,"PYRENEES"]
[null,null,null,null,null,null,null,null,"QUEENSCLIFFE"]
[null,null,null,null,null,null,null,null,"SOUTH GIPPSLAND"]
[null,null,null,null,null,null,null,null,"SOUTHERN GRAMPIANS"]
[null,null,null,null,null,null,null,null,"STONNINGTON"]
[null,null,null,null,null,null,null,null,"STRATHBOGIE"]
[null,null,null,null,null,null,null,null,"SURF COAST"]
[null,null,null,null,null,null,null,null,"SWAN HILL"]
[null,null,null,null,null,null,null,null,"TOWONG"]
[null,null,null,null,null,null,null,null,"WANGARATTA"]
[null,null,null,null,null,null,null,null,"WARRNAMBOOL"]
[null,null,null,null,null,null,null,null,"WELLINGTON"]
[null,null,null,null,null,null,null,null,"WEST WIMMERA"]
[null,null,null,null,null,null,null,null,"WHITEHORSE"]
[null,null,null,null,null,null,null,null,"WHITTLESEA"]
[null,null,null,null,null,null,null,null,"WODONGA"]
[null,null,null,null,null,null,null,null,"WYNDHAM"]
[null,null,null,null,null,null,null,null,"YARRA"]
[null,null,null,null,null,null,null,null,"YARRA RANGES"]
[null,null,null,null,null,null,null,null,"YARRIAMBIACK"]